{
  "reportName" : "Allure Report",
  "testRuns" : [ ],
  "statistic" : {
    "failed" : 0,
    "broken" : 0,
    "skipped" : 0,
    "passed" : 2,
    "unknown" : 0,
    "total" : 2
  },
  "time" : {
    "start" : 1592931171421,
    "stop" : 1592931177269,
    "duration" : 5848,
    "minDuration" : 1565,
    "maxDuration" : 4283,
    "sumDuration" : 5848
  }
}