<svg width="21" height="21" viewBox="0 0 21 21" fill="none" xmlns="http://www.w3.org/2000/svg">
<path d="M20.0889 19.312L15.0498 14.2729C14.96 14.1831 14.8428 14.1362 14.7178 14.1362H14.3154C15.6553 12.687 16.4756 10.7534 16.4756 8.62451C16.4756 4.13623 12.8389 0.499512 8.35059 0.499512C3.8623 0.499512 0.225586 4.13623 0.225586 8.62451C0.225586 13.1128 3.8623 16.7495 8.35059 16.7495C10.4795 16.7495 12.4131 15.9292 13.8623 14.5933V14.9917C13.8623 15.1167 13.9131 15.2339 13.999 15.3237L19.0381 20.3628C19.2217 20.5464 19.5186 20.5464 19.7021 20.3628L20.0889 19.9761C20.2725 19.7925 20.2725 19.4956 20.0889 19.312ZM8.35059 15.4995C4.5498 15.4995 1.47559 12.4253 1.47559 8.62451C1.47559 4.82373 4.5498 1.74951 8.35059 1.74951C12.1514 1.74951 15.2256 4.82373 15.2256 8.62451C15.2256 12.4253 12.1514 15.4995 8.35059 15.4995Z" fill="#1A1A1A"/>
</svg>
