{
  "type": "commonjs",
  "license": "MIT",
  "scripts": {
    "ci:test": "jest --ci",
    "ci:test:coverage": "jest --coverage --ci",
    "ci:vulnerabilities:monitor": "snyk monitor",
    "git:push:skip-ci": "git push -o ci.skip",
    "git:undo": "git reset --soft HEAD~1",
    "git:undo:hard": "git reset --hard HEAD~1",
    "test": "jest --coverage --coverage-reporters='text'",
    "test:all": "run-s -sn test:lint test test:vulnerabilities",
    "test:coverage": "jest --coverage",
    "test:lint": "eslint '**/*.{spec,test}.*'",
    "test:lint:commit": "commitlint -V",
    "test:vulnerabilities": "snyk test",
    "test:watch": "jest --watch",
    "update": "ncu -u",
    "update:check": "ncu",
    "version:first": "standard-version --first-release",
    "version:prerelease": "standard-version --prerelease",
    "version:release": "standard-version",
    "version:push": "git push --follow-tags"
  },
  "files": [
    "!**/__*__/",
    "!**/*.{spec,test}.*"
  ],
  "publishConfig": {
    "access": "public"
  },
  "engines": {
    "node": ">=14.0.0"
  },
  "dependencies": {},
  "devDependencies": {
    "@commitlint/cli": "^11.0.0",
    "@commitlint/config-conventional": "^11.0.0",
    "eslint": "^7.15.0",
    "eslint-plugin-jest": "^24.1.3",
    "eslint-plugin-node": "^11.1.0",
    "eslint-plugin-standard": "^4.1.0",
    "husky": "^4.3.5",
    "jest": "^26.6.3",
    "lint-staged": "^10.5.3",
    "npm-check-updates": "^10.2.5",
    "npm-run-all": "^4.1.5",
    "snyk": "^1.436.0",
    "standard-version": "^9.0.0",
    "strip-ansi": "^6.0.0"
  }
}
