{
  "name": "core-app",
  "$schema": "../../../node_modules/nx/schemas/project-schema.json",
  "sourceRoot": "libs/core/app/src",
  "projectType": "library",
  "targets": {
    "build": {
      "executor": "@nrwl/js:tsc",
      "outputs": ["{options.outputPath}"],
      "options": {
        "outputPath": "dist/libs/core/app",
        "tsConfig": "libs/core/app/tsconfig.lib.json",
        "packageJson": "libs/core/app/package.json",
        "main": "libs/core/app/src/index.ts",
        "assets": ["libs/core/app/*.md"]
      }
    },
    "publish": {
      "executor": "nx:run-commands",
      "options": {
        "command": "node tools/scripts/publish.mjs core-app {args.ver} {args.tag}"
      },
      "dependsOn": ["build"]
    },
    "lint": {
      "executor": "@nrwl/linter:eslint",
      "outputs": ["{options.outputFile}"],
      "options": {
        "lintFilePatterns": ["libs/core/app/**/*.ts"]
      }
    },
    "test": {
      "executor": "@nrwl/jest:jest",
      "outputs": ["{workspaceRoot}/coverage/{projectRoot}"],
      "options": {
        "jestConfig": "libs/core/app/jest.config.ts",
        "passWithNoTests": true
      },
      "configurations": {
        "ci": {
          "ci": true,
          "codeCoverage": true
        }
      }
    }
  },
  "tags": []
}
