{
  "name": "alchemyst-infra",
  "$schema": "../../../node_modules/nx/schemas/project-schema.json",
  "sourceRoot": "libs/alchemyst/infra/src",
  "projectType": "library",
  "targets": {
    "build": {
      "executor": "@nrwl/js:tsc",
      "outputs": ["{options.outputPath}"],
      "options": {
        "outputPath": "dist/libs/alchemyst/infra",
        "tsConfig": "libs/alchemyst/infra/tsconfig.lib.json",
        "packageJson": "libs/alchemyst/infra/package.json",
        "main": "libs/alchemyst/infra/src/index.ts",
        "assets": ["libs/alchemyst/infra/*.md"]
      }
    },
    "publish": {
      "executor": "nx:run-commands",
      "options": {
        "command": "node tools/scripts/publish.mjs alchemyst-infra {args.ver} {args.tag}"
      },
      "dependsOn": ["build"]
    },
    "lint": {
      "executor": "@nrwl/linter:eslint",
      "outputs": ["{options.outputFile}"],
      "options": {
        "lintFilePatterns": ["libs/alchemyst/infra/**/*.ts"]
      }
    },
    "test": {
      "executor": "@nrwl/jest:jest",
      "outputs": ["{workspaceRoot}/coverage/{projectRoot}"],
      "options": {
        "jestConfig": "libs/alchemyst/infra/jest.config.ts",
        "passWithNoTests": true
      },
      "configurations": {
        "ci": {
          "ci": true,
          "codeCoverage": true
        }
      }
    }
  },
  "tags": []
}
