@startuml


class Document {
    + docimentId: string
    - version: string
    # path: string
    + modify()
    + archieve()
    + download()
    + delete()
}

class Contract {
    + terminate()
    + extension()
}

class Signature {
    - key: string
}

Contract -up-|> Document
Contract "1" *--> "0..*" Signature

class Person {
    # givenname: string
    # surname: string
    + fullname: string
}

class Project {
    + code: string
    + label: string
    + description: string
}

class Role {
    + name: string
    + description: string
    + begin: Date
    + end: Date
}
Role o-up-> Project

class Employee {
    + employeeNumber: string
}

Employee o-up-> Role
Person <-o Employee
Employee *-> Contract


class Timesheet {

}

@enduml
