@startuml


package "Presentation Layer" as pl {
    component "Web Assistant" as wa
    component "Administration Console" as ac
}

package "Application Layer" as al {
    component "Finance API" as fin_api
    component "Worksheet API" as work_api
}

package "Infrastructure Layer" as il {
  component "Directory Engine"
  component "Mailing Engine"
  component "Template Engine"
  component "Masterdata Management"
}

package "Domain Model Layer" as dml {
  component "Masterdata"
  component "Worksheet"
}

pl -down-> al
al -down-> dml
al -down-> il
il -down-> dml


@enduml
