{
    "entryFile": "src/app.ts",
    "noImplicitAdditionalProperties": "throw-on-extras",
    "controllerPathGlobs": ["src/**/*Controller.ts"],
    "spec": {
        "outputDirectory": "src",
        "host": "localhost:3000",
        "basePath": "/v1",
        "specVersion": 2,
        "tags": [
            {
                "name": "UAAC",
                "description": "Paspartu UAAC module API",
                "externalDocs": {
                    "description": "Find out more about User Access and Authentication Control",
                    "url": "http://swagger.io"
                }
            }
        ],
        "securityDefinitions": {
            "api_key": {
                "type": "apiKey",
                "name": "access_token",
                "in": "query"
            },
            "jwt": {
                "type": "apiKey",
                "name": "access_token",
                "in": "query"
            },
            "tsoa_auth": {
                "type": "oauth2",
                "authorizationUrl": "http://swagger.io/api/oauth/dialog",
                "flow": "implicit",
                "scopes": {
                    "write:pets": "modify things",
                    "read:pets": "read things"
                }
            }
        }
    },
    "routes": {
        "basePath": "/v1",
        "routesDir": "src",
        "middleware": "express",
        "iocModule": "src/ioc",
        "authenticationModule": "src/authentication"
    }
}
