{
  "name": "alchemyst-frontend",
  "$schema": "../../../node_modules/nx/schemas/project-schema.json",
  "sourceRoot": "apps/alchemyst/frontend/src",
  "implicitDependencies": ["alchemyst-backend"],
  "projectType": "application",
  "targets": {
    "build": {
      "executor": "@nx/webpack:webpack",
      "outputs": ["{options.outputPath}"],
      "defaultConfiguration": "production",
      "options": {
        "compiler": "babel",
        "outputPath": "dist/apps/alchemyst/frontend",
        "index": "apps/alchemyst/frontend/src/index.html",
        "baseHref": "/",
        "main": "apps/alchemyst/frontend/src/main.tsx",
        "tsConfig": "apps/alchemyst/frontend/tsconfig.app.json",
        "assets": [
          "apps/alchemyst/frontend/src/favicon.ico",
          "apps/alchemyst/frontend/src/assets"
        ],
        "styles": [],
        "scripts": [],
        "isolatedConfig": true,
        "webpackConfig": "apps/alchemyst/frontend/webpack.config.js"
      },
      "configurations": {
        "development": {
          "extractLicenses": false,
          "optimization": false,
          "sourceMap": true,
          "vendorChunk": true
        },
        "production": {
          "fileReplacements": [
            {
              "replace": "apps/alchemyst/frontend/src/environments/environment.ts",
              "with": "apps/alchemyst/frontend/src/environments/environment.prod.ts"
            }
          ],
          "optimization": true,
          "outputHashing": "all",
          "sourceMap": false,
          "namedChunks": false,
          "extractLicenses": true,
          "vendorChunk": false
        }
      }
    },
    "serve": {
      "executor": "@nx/webpack:dev-server",
      "defaultConfiguration": "development",
      "options": {
        "buildTarget": "alchemyst-frontend:build",
        "hmr": true,
        "proxyConfig": "apps/alchemyst/frontend/proxy.conf.json",
        "port": 3001
      },
      "configurations": {
        "development": {
          "buildTarget": "alchemyst-frontend:build:development"
        },
        "production": {
          "buildTarget": "alchemyst-frontend:build:production",
          "hmr": false
        }
      }
    },
    "lint": {
      "executor": "@nx/linter:eslint",
      "outputs": ["{options.outputFile}"],
      "options": {
        "lintFilePatterns": ["apps/alchemyst/frontend/**/*.{ts,tsx,js,jsx}"]
      }
    },
    "serve-static": {
      "executor": "@nx/web:file-server",
      "options": {
        "buildTarget": "alchemyst-frontend:build"
      }
    },
    "test": {
      "executor": "@nx/jest:jest",
      "outputs": ["{workspaceRoot}/coverage/{projectRoot}"],
      "options": {
        "jestConfig": "apps/alchemyst/frontend/jest.config.ts",
        "passWithNoTests": true
      },
      "configurations": {
        "ci": {
          "ci": true,
          "codeCoverage": true
        }
      }
    }
  },
  "tags": ["module:alchemyst", "archetype:frontend"]
}
