{
  "name": "schef-common",
  "$schema": "../../../node_modules/nx/schemas/project-schema.json",
  "sourceRoot": "libs/schef/common/src",
  "projectType": "library",
  "targets": {
    "build": {
      "executor": "@nx/js:tsc",
      "outputs": ["{options.outputPath}"],
      "options": {
        "outputPath": "dist/libs/schef/common",
        "main": "libs/schef/common/src/index.ts",
        "tsConfig": "libs/schef/common/tsconfig.lib.json",
        "assets": ["libs/schef/common/*.md"]
      }
    },
    "publish": {
      "command": "node tools/scripts/publish.mjs schef-common {args.ver} {args.tag}",
      "dependsOn": ["build"]
    },
    "lint": {
      "executor": "@nx/linter:eslint",
      "outputs": ["{options.outputFile}"],
      "options": {
        "lintFilePatterns": [
          "libs/schef/common/**/*.ts",
          "libs/schef/common/package.json"
        ]
      }
    },
    "test": {
      "executor": "@nx/jest:jest",
      "outputs": ["{workspaceRoot}/coverage/{projectRoot}"],
      "options": {
        "jestConfig": "libs/schef/common/jest.config.ts",
        "passWithNoTests": true
      },
      "configurations": {
        "ci": {
          "ci": true,
          "codeCoverage": true
        }
      }
    }
  },
  "tags": ["module:schef", "archetype:common"]
}
