{
  "chromeWebSecurity": false,
  "fixturesFolder": "tests/e2e/fixtures",
  "integrationFolder": "tests/e2e/integration",
  "pluginsFile": "tests/e2e/plugins/index.js",
  "screenshotsFolder": "tests/e2e/screenshots",
  "supportFile": "tests/e2e/support/index.js",
  "testFiles": "**/*.spec.*",
  "videosFolder": "tests/e2e/videos",
  "video": false,
  "viewportHeight": 768,
  "viewportWidth": 1024
}
