"""Configuration file for experiments"""

from numpy import array
import os

datafile = os.path.expanduser('~')+'/Data/iedb_benchmark/iedb_data_pca.pickle'

#all_tasks = ['A_2403', 'A_2402', 'A_2301', 'A_0201', 'A_0203', 'A_0202', 'A_6901']
#all_tasks = ['A_6901', 'A_0202', 'A_0203', 'A_0201', 'A_2301', 'A_2402', 'A_2403']
#all_tasks = ['A_6901', 'A_0201', 'A_0202', 'A_0203', 'A_2301', 'A_2402', 'A_2403']
#all_tasks = ['A_6901', 'A_2403', 'A_2301', 'A_2402', 'A_0201', 'A_0202', 'A_0203']
#all_tasks = ['A_2301', 'A_2402', 'A_2403', 'A_6901']
#all_tasks = ['A_6901', 'A_2403', 'A_2402', 'A_2301']
#all_tasks = ['A_2301', 'A_2402', 'A_2403']




#####################################################################
# Kernel matrices from Christian and Nora
#####################################################################

# all_tasks = ['A_2301', 'A_2402', 'A_2403', 'A_6901']
KMKL4 = array([[0.7, 0.5, 0.37, 0.2],
               [0.5, 0.54, 0.37, 0.2],
               [0.37, 0.37, 0.46, 0.2],
               [0.2, 0.2, 0.2, 0.45]])

#all_tasks = ['A_6901', 'A_2403', 'A_2402', 'A_2301']
KMKL4a = array([[0.45, 0.2, 0.2, 0.2],
                [0.2, 0.46, 0.37, 0.37],
                [0.2, 0.37, 0.54, 0.5],
                [0.2, 0.37, 0.5, 0.7]])

#all_tasks = ['A_6901', 'A_0202', 'A_0203', 'A_0201', 'A_2301', 'A_2402', 'A_2403']
Kseq7 = array([[1., 0.45, 0.45, 0.55, 0., 0., 0.],
               [0.45,1., 0.85, 0.85, 0.25, 0.25, 0.3],
               [0.45,0.85,1, 0.85, 0., 0., 0.],
               [0.55,0.85,0.85,1., 0.25, 0., 0.25],
               [0.,0.25,0.,0.25,1., 0.9, 0.85],
               [0.,0.25,0.,0.,0.9,1.,0.9],
               [0.,0.3,0.,0.25,0.85,0.9,1.]])

all_tasks = ['A_2403', 'A_2402', 'A_2301', 'A_0201', 'A_0203', 'A_0202', 'A_6901']
Kseq7rev = array([[1., 0.9, 0.85, 0.25, 0., 0.3, 0.],
                  [0.9, 1., 0.9, 0., 0., 0.25, 0.],
                  [0.85, 0.9, 1., 0.25, 0., 0.25, 0.],
                  [0.25, 0., 0.25, 1., 0.85, 0.85, 0.55],
                  [0., 0., 0., 0.85, 1., 0.85, 0.45],
                  [0.3, 0.25, 0.25, 0.85, 0.85, 1., 0.45],
                  [0., 0., 0., 0.55, 0.45, 0.45, 1.]])

#####################################################################
# Experimental conditions
#####################################################################


num_task = len(all_tasks)
expt_name = '%dtasks' % num_task
sim_name = 'multitask_mhc_Ky_%s.pkl' % expt_name
consim_name = 'multitask_mhc_%s.pkl' % expt_name
