%YAML 1.1
%TAG !u! tag:unity3d.com,2011:
--- !u!114 &11400000
MonoBehaviour:
  m_ObjectHideFlags: 0
  m_CorrespondingSourceObject: {fileID: 0}
  m_PrefabInstance: {fileID: 0}
  m_PrefabAsset: {fileID: 0}
  m_GameObject: {fileID: 0}
  m_Enabled: 1
  m_EditorHideFlags: 0
  m_Script: {fileID: 11500000, guid: cbebb21aca654729a4e4dd3466785bea, type: 3}
  m_Name: card_info
  m_EditorClassIdentifier: 
  data:
  - id: 1
    name: card_1
    desc: card_1_desc
    icon: CardIcons/card_1
    energe_cost: 1
    region: 1
    hero: 1
  - id: 2
    name: card_2
    desc: card_2_desc
    icon: CardIcons/card_2
    energe_cost: 2
    region: 1
    hero: 0
  - id: 3
    name: card_3
    desc: card_3_desc
    icon: CardIcons/card_3
    energe_cost: 3
    region: 2
    hero: 0
  - id: 4
    name: card_4
    desc: card_4_desc
    icon: CardIcons/card_4
    energe_cost: 4
    region: 1
    hero: 1
  - id: 5
    name: card_5
    desc: card_5_desc
    icon: CardIcons/card_5
    energe_cost: 5
    region: 3
    hero: 1
  - id: 6
    name: card_6
    desc: card_6_desc
    icon: CardIcons/card_6
    energe_cost: 6
    region: 2
    hero: 0
  - id: 7
    name: card_7
    desc: card_7_desc
    icon: CardIcons/card_7
    energe_cost: 6
    region: 3
    hero: 0
  - id: 8
    name: card_8
    desc: card_8_desc
    icon: CardIcons/card_8
    energe_cost: 6
    region: 4
    hero: 0
  - id: 9
    name: card_9
    desc: card_9_desc
    icon: CardIcons/card_9
    energe_cost: 3
    region: 4
    hero: 1
  - id: 10
    name: card_10
    desc: card_10_desc
    icon: CardIcons/card_10
    energe_cost: 2
    region: 2
    hero: 1
  - id: 11
    name: card_11
    desc: card_11_desc
    icon: CardIcons/card_11
    energe_cost: 1
    region: 1
    hero: 0
  - id: 12
    name: card_12
    desc: card_12_desc
    icon: CardIcons/card_12
    energe_cost: 2
    region: 1
    hero: 0
  - id: 13
    name: card_13
    desc: card_13_desc
    icon: CardIcons/card_13
    energe_cost: 3
    region: 1
    hero: 1
  - id: 14
    name: card_14
    desc: card_14_desc
    icon: CardIcons/card_14
    energe_cost: 3
    region: 1
    hero: 0
  - id: 15
    name: card_15
    desc: card_15_desc
    icon: CardIcons/card_15
    energe_cost: 3
    region: 1
    hero: 1
