%YAML 1.1
%TAG !u! tag:unity3d.com,2011:
--- !u!114 &11400000
MonoBehaviour:
  m_ObjectHideFlags: 0
  m_CorrespondingSourceObject: {fileID: 0}
  m_PrefabInstance: {fileID: 0}
  m_PrefabAsset: {fileID: 0}
  m_GameObject: {fileID: 0}
  m_Enabled: 1
  m_EditorHideFlags: 0
  m_Script: {fileID: 11500000, guid: bbb281ee3bf0b054c82ac2347e9e782c, type: 3}
  m_Name: Sprite
  m_EditorClassIdentifier: 
  m_GroupName: Sprite
  m_Data:
    m_SerializedData: []
  m_GUID: 4d612156331ce0d4a9f8cd3cd96dd356
  m_SerializeEntries:
  - m_GUID: 88357b167f1d5bc40aec6c6a64017eef
    m_Address: Common
    m_ReadOnly: 0
    m_SerializedLabels:
    - built-in
    - sprite
    - preload
  - m_GUID: 3b3e875bee5b48d4d9d85e77d79230e2
    m_Address: CardIcons
    m_ReadOnly: 0
    m_SerializedLabels:
    - built-in
    - sprite
    - preload
  - m_GUID: 8f9e22b3084750e48becbaab97578cf4
    m_Address: DeckIcons
    m_ReadOnly: 0
    m_SerializedLabels:
    - built-in
    - sprite
    - preload
  - m_GUID: 838192a17742ba449ab9addc21184270
    m_Address: PlayerIcons
    m_ReadOnly: 0
    m_SerializedLabels:
    - built-in
    - sprite
    - preload
  - m_GUID: 648b202830131a14593546714a8b8d09
    m_Address: SplashScreen
    m_ReadOnly: 0
    m_SerializedLabels:
    - built-in
    - sprite
    - preload
  m_ReadOnly: 0
  m_Settings: {fileID: 11400000, guid: eece7faaf2544884ca6899b9c45e3363, type: 2}
  m_SchemaSet:
    m_Schemas:
    - {fileID: 11400000, guid: 246fad6bec6c8ef42939d87174df6a39, type: 2}
    - {fileID: 11400000, guid: f3b4a18ee5c9ede4e8582ca4684b0675, type: 2}
