%YAML 1.1
%TAG !u! tag:unity3d.com,2011:
--- !u!114 &11400000
MonoBehaviour:
  m_ObjectHideFlags: 0
  m_CorrespondingSourceObject: {fileID: 0}
  m_PrefabInstance: {fileID: 0}
  m_PrefabAsset: {fileID: 0}
  m_GameObject: {fileID: 0}
  m_Enabled: 1
  m_EditorHideFlags: 0
  m_Script: {fileID: 11500000, guid: bbb281ee3bf0b054c82ac2347e9e782c, type: 3}
  m_Name: Auto_UIPrefabs
  m_EditorClassIdentifier: 
  m_GroupName: Auto_UIPrefabs
  m_Data:
    m_SerializedData: []
  m_GUID: e0e0a27e834d10e4eace8a7ff9f74fe8
  m_SerializeEntries:
  - m_GUID: 05dcefc09e9a2214d9a83ad603812fa4
    m_Address: UIPrefabs/TournamentBanPickWindow.prefab
    m_ReadOnly: 0
    m_SerializedLabels:
    - built-in
  - m_GUID: 33d6a5221c0cf1248938acee0f3b68a8
    m_Address: UIPrefabs/SelectDeckWindow.prefab
    m_ReadOnly: 0
    m_SerializedLabels:
    - built-in
  - m_GUID: 00f154fc1f821cc4fbef654f30ee3fcd
    m_Address: UIPrefabs/LoadingWindow.prefab
    m_ReadOnly: 0
    m_SerializedLabels:
    - built-in
  - m_GUID: 44a0e978e1ca4b44786a5b50f55e501f
    m_Address: UIPrefabs/GeneralPopup.prefab
    m_ReadOnly: 0
    m_SerializedLabels:
    - built-in
  m_ReadOnly: 0
  m_Settings: {fileID: 11400000, guid: eece7faaf2544884ca6899b9c45e3363, type: 2}
  m_SchemaSet:
    m_Schemas:
    - {fileID: 11400000, guid: 7ed1b06b1439901438b6eb3056b21429, type: 2}
    - {fileID: 11400000, guid: fcc6f2beeb8e8c048bc15e4cee756aaa, type: 2}
