%YAML 1.1
%TAG !u! tag:unity3d.com,2011:
--- !u!114 &11400000
MonoBehaviour:
  m_ObjectHideFlags: 0
  m_CorrespondingSourceObject: {fileID: 0}
  m_PrefabInstance: {fileID: 0}
  m_PrefabAsset: {fileID: 0}
  m_GameObject: {fileID: 0}
  m_Enabled: 1
  m_EditorHideFlags: 0
  m_Script: {fileID: 11500000, guid: 54d21f6ece3b46479f0c328f8c6007e0, type: 3}
  m_Name: BlueGradient
  m_EditorClassIdentifier: 
  colorMode: 2
  topLeft: {r: 0.7058824, g: 0.81568635, b: 0.9607844, a: 1}
  topRight: {r: 0.7058824, g: 0.81568635, b: 0.9607844, a: 1}
  bottomLeft: {r: 0.5647059, g: 0.8000001, b: 0.9568628, a: 1}
  bottomRight: {r: 0.5647059, g: 0.8000001, b: 0.9568628, a: 1}
