%YAML 1.1
%TAG !u! tag:unity3d.com,2011:
--- !u!1045 &1
EditorBuildSettings:
  m_ObjectHideFlags: 0
  serializedVersion: 2
  m_Scenes:
  - enabled: 1
    path: Assets/Scenes/Preload.unity
    guid: ad3f0719f0aa1304fbf251e28d55a75c
  m_configObjects:
    com.unity.addressableassets: {fileID: 11400000, guid: 2238513ec53d90c4483bfaa73cfe4b52, type: 2}
