%YAML 1.1
%TAG !u! tag:unity3d.com,2011:
--- !u!114 &11400000
MonoBehaviour:
  m_ObjectHideFlags: 0
  m_CorrespondingSourceObject: {fileID: 0}
  m_PrefabInstance: {fileID: 0}
  m_PrefabAsset: {fileID: 0}
  m_GameObject: {fileID: 0}
  m_Enabled: 1
  m_EditorHideFlags: 0
  m_Script: {fileID: 11500000, guid: 468a46d0ae32c3544b7d98094e6448a9, type: 3}
  m_Name: AddressableAssetSettings
  m_EditorClassIdentifier: 
  m_DefaultGroup: 1cbe45645d1e7da44b79fe16a7729d91
  m_OptimizeCatalogSize: 0
  m_BuildRemoteCatalog: 1
  m_BundleLocalCatalog: 0
  m_CatalogRequestsTimeout: 0
  m_DisableCatalogUpdateOnStart: 1
  m_IgnoreUnsupportedFilesInBuild: 0
  m_UniqueBundleIds: 0
  m_NonRecursiveBuilding: 0
  m_CCDEnabled: 0
  m_maxConcurrentWebRequests: 500
  m_ContiguousBundles: 1
  m_StripUnityVersionFromBundleBuild: 0
  m_DisableVisibleSubAssetRepresentations: 0
  m_ShaderBundleNaming: 0
  m_ShaderBundleCustomNaming: 
  m_MonoScriptBundleNaming: 0
  m_MonoScriptBundleCustomNaming: 
  m_RemoteCatalogBuildPath:
    m_Id: b8a6ce4f1419d904c937e309d33e1c62
  m_RemoteCatalogLoadPath:
    m_Id: d9216a84264172540aa91f68b0c04d1a
  m_ContentStateBuildPath: 
  m_BuildAddressablesWithPlayerBuild: 0
  m_overridePlayerVersion: 
  m_GroupAssets:
  - {fileID: 11400000, guid: e2c67de7d92d7e14dabd7f2a2b25d889, type: 2}
  - {fileID: 11400000, guid: ecdc0c7b5606db745836a027fbeae196, type: 2}
  - {fileID: 11400000, guid: e7883139f63a55645a69364c8e6772c3, type: 2}
  - {fileID: 11400000, guid: 39c0659f484b8d54296a4aa23286eeda, type: 2}
  - {fileID: 11400000, guid: 657b4143822d8e3449e35d9f3a4452f2, type: 2}
  - {fileID: 11400000, guid: 97d2a2b89b5f1324fb2c7f06060c1970, type: 2}
  - {fileID: 11400000, guid: ad4ffa6639999544b9b19bc1116471f8, type: 2}
  m_BuildSettings:
    m_CompileScriptsInVirtualMode: 0
    m_CleanupStreamingAssetsAfterBuilds: 1
    m_LogResourceManagerExceptions: 1
    m_BundleBuildPath: Temp/com.unity.addressables/AssetBundles
  m_ProfileSettings:
    m_Profiles:
    - m_InheritedParent: 
      m_Id: 3c66df20a27da5845ae5379eb079d851
      m_ProfileName: Default
      m_Values:
      - m_Id: 4937f6a9af249a84eb5d600454fdb6ae
        m_Value: '[UnityEditor.EditorUserBuildSettings.activeBuildTarget]'
      - m_Id: 130cb4f86648b6843860fbc37f7b9361
        m_Value: '[UnityEngine.AddressableAssets.Addressables.BuildPath]/[BuildTarget]'
      - m_Id: 329e967a40a15104a83443c011dd326c
        m_Value: '{UnityEngine.AddressableAssets.Addressables.RuntimePath}/[BuildTarget]'
      - m_Id: b8a6ce4f1419d904c937e309d33e1c62
        m_Value: ServerData/[BuildTarget]
      - m_Id: d9216a84264172540aa91f68b0c04d1a
        m_Value: http://[PrivateIpAddress]:[HostingServicePort]
    - m_InheritedParent: 
      m_Id: f9e9bee05af90444bba487d9551fea47
      m_ProfileName: Patch
      m_Values:
      - m_Id: 4937f6a9af249a84eb5d600454fdb6ae
        m_Value: '[UnityEditor.EditorUserBuildSettings.activeBuildTarget]'
      - m_Id: 130cb4f86648b6843860fbc37f7b9361
        m_Value: '[UnityEngine.AddressableAssets.Addressables.BuildPath]/[BuildTarget]'
      - m_Id: 329e967a40a15104a83443c011dd326c
        m_Value: '{UnityEngine.AddressableAssets.Addressables.RuntimePath}/[BuildTarget]'
      - m_Id: b8a6ce4f1419d904c937e309d33e1c62
        m_Value: ServerData/[BuildTarget]/1
      - m_Id: d9216a84264172540aa91f68b0c04d1a
        m_Value: '{Settings.RemoteLoadPath}'
    - m_InheritedParent: 
      m_Id: eceb861b6def8714b96255367c71361f
      m_ProfileName: PlayerBundleTogether
      m_Values:
      - m_Id: 4937f6a9af249a84eb5d600454fdb6ae
        m_Value: '[UnityEditor.EditorUserBuildSettings.activeBuildTarget]'
      - m_Id: 130cb4f86648b6843860fbc37f7b9361
        m_Value: '[UnityEngine.AddressableAssets.Addressables.BuildPath]/[BuildTarget]'
      - m_Id: 329e967a40a15104a83443c011dd326c
        m_Value: '{UnityEngine.AddressableAssets.Addressables.RuntimePath}/[BuildTarget]'
      - m_Id: b8a6ce4f1419d904c937e309d33e1c62
        m_Value: '[UnityEngine.AddressableAssets.Addressables.BuildPath]/[BuildTarget]'
      - m_Id: d9216a84264172540aa91f68b0c04d1a
        m_Value: '{UnityEngine.AddressableAssets.Addressables.RuntimePath}/[BuildTarget]'
    m_ProfileEntryNames:
    - m_Id: 4937f6a9af249a84eb5d600454fdb6ae
      m_Name: BuildTarget
      m_InlineUsage: 0
    - m_Id: 130cb4f86648b6843860fbc37f7b9361
      m_Name: Local.BuildPath
      m_InlineUsage: 0
    - m_Id: 329e967a40a15104a83443c011dd326c
      m_Name: Local.LoadPath
      m_InlineUsage: 0
    - m_Id: b8a6ce4f1419d904c937e309d33e1c62
      m_Name: Remote.BuildPath
      m_InlineUsage: 0
    - m_Id: d9216a84264172540aa91f68b0c04d1a
      m_Name: Remote.LoadPath
      m_InlineUsage: 0
    m_ProfileVersion: 1
  m_LabelTable:
    m_LabelNames:
    - default
    - built-in
    - prefab
    - sprite
    - preload
    - pool-asset
    - localization
    - text
    - sfx
    - en
    - game-data
  m_SchemaTemplates: []
  m_GroupTemplateObjects:
  - {fileID: 11400000, guid: 77e72c16b7e032e4e8852b739e4ab938, type: 2}
  m_InitializationObjects: []
  m_CertificateHandlerType:
    m_AssemblyName: 
    m_ClassName: 
  m_ActivePlayerDataBuilderIndex: 3
  m_DataBuilders:
  - {fileID: 11400000, guid: 07b59b408628c914390c9e5fb79fed66, type: 2}
  - {fileID: 11400000, guid: 8cb03e96b8ef0354f8bbbb533283b496, type: 2}
  - {fileID: 11400000, guid: 4f0e9c82575142e4eaef60c554b20614, type: 2}
  - {fileID: 11400000, guid: de150ce6aba5c1e4abe8adcf1d37487b, type: 2}
  m_ActiveProfileId: eceb861b6def8714b96255367c71361f
  m_HostingServicesManager:
    m_HostingServiceInfos: []
    m_Settings: {fileID: 11400000}
    m_NextInstanceId: 0
    m_RegisteredServiceTypeRefs: []
    m_GlobalProfileVariablesInfos:
    - key: PrivateIpAddress
      value: 192.168.46.1
    - key: PrivateIpAddress_1
      value: 192.168.211.1
    - key: PrivateIpAddress_2
      value: 192.168.121.1
    - key: PrivateIpAddress_3
      value: 192.168.66.1
    - key: PrivateIpAddress_4
      value: 192.168.56.1
    - key: PrivateIpAddress_5
      value: 169.254.45.72
    - key: PrivateIpAddress_6
      value: 192.168.253.1
    - key: PrivateIpAddress_7
      value: 192.168.174.1
    - key: PrivateIpAddress_8
      value: 192.168.87.1
    - key: PrivateIpAddress_9
      value: 192.168.30.1
    - key: PrivateIpAddress_10
      value: 192.168.201.1
    - key: PrivateIpAddress_11
      value: 192.168.124.1
    - key: PrivateIpAddress_12
      value: 192.168.47.1
    - key: PrivateIpAddress_13
      value: 192.168.226.1
    - key: PrivateIpAddress_14
      value: 192.168.171.1
    - key: PrivateIpAddress_15
      value: 192.168.113.1
    - key: PrivateIpAddress_16
      value: 192.168.18.1
    - key: PrivateIpAddress_17
      value: 192.168.127.1
    - key: PrivateIpAddress_18
      value: 192.168.69.1
    - key: PrivateIpAddress_19
      value: 192.168.193.1
    - key: PrivateIpAddress_20
      value: 192.168.215.1
    - key: PrivateIpAddress_21
      value: 192.168.50.43
