%YAML 1.1
%TAG !u! tag:unity3d.com,2011:
--- !u!1001 &7621876485604008648
PrefabInstance:
  m_ObjectHideFlags: 0
  serializedVersion: 2
  m_Modification:
    m_TransformParent: {fileID: 0}
    m_Modifications:
    - target: {fileID: 1193510216473288686, guid: c1d98eba45a925f438490bf8807e2dc0, type: 3}
      propertyPath: m_Name
      value: Btn_Go
      objectReference: {fileID: 0}
    - target: {fileID: 6663586584083025076, guid: c1d98eba45a925f438490bf8807e2dc0, type: 3}
      propertyPath: m_sharedMaterial
      value: 
      objectReference: {fileID: 2100000, guid: 4c9f1eb6b6ff97944bf0912e49fa22c1, type: 2}
    - target: {fileID: 8225588255146766514, guid: c1d98eba45a925f438490bf8807e2dc0, type: 3}
      propertyPath: m_Pivot.x
      value: 0.5
      objectReference: {fileID: 0}
    - target: {fileID: 8225588255146766514, guid: c1d98eba45a925f438490bf8807e2dc0, type: 3}
      propertyPath: m_Pivot.y
      value: 0.5
      objectReference: {fileID: 0}
    - target: {fileID: 8225588255146766514, guid: c1d98eba45a925f438490bf8807e2dc0, type: 3}
      propertyPath: m_RootOrder
      value: 0
      objectReference: {fileID: 0}
    - target: {fileID: 8225588255146766514, guid: c1d98eba45a925f438490bf8807e2dc0, type: 3}
      propertyPath: m_AnchorMax.x
      value: 0
      objectReference: {fileID: 0}
    - target: {fileID: 8225588255146766514, guid: c1d98eba45a925f438490bf8807e2dc0, type: 3}
      propertyPath: m_AnchorMax.y
      value: 1
      objectReference: {fileID: 0}
    - target: {fileID: 8225588255146766514, guid: c1d98eba45a925f438490bf8807e2dc0, type: 3}
      propertyPath: m_AnchorMin.x
      value: 0
      objectReference: {fileID: 0}
    - target: {fileID: 8225588255146766514, guid: c1d98eba45a925f438490bf8807e2dc0, type: 3}
      propertyPath: m_AnchorMin.y
      value: 1
      objectReference: {fileID: 0}
    - target: {fileID: 8225588255146766514, guid: c1d98eba45a925f438490bf8807e2dc0, type: 3}
      propertyPath: m_SizeDelta.x
      value: 340
      objectReference: {fileID: 0}
    - target: {fileID: 8225588255146766514, guid: c1d98eba45a925f438490bf8807e2dc0, type: 3}
      propertyPath: m_SizeDelta.y
      value: 140
      objectReference: {fileID: 0}
    - target: {fileID: 8225588255146766514, guid: c1d98eba45a925f438490bf8807e2dc0, type: 3}
      propertyPath: m_LocalPosition.x
      value: 0
      objectReference: {fileID: 0}
    - target: {fileID: 8225588255146766514, guid: c1d98eba45a925f438490bf8807e2dc0, type: 3}
      propertyPath: m_LocalPosition.y
      value: 0
      objectReference: {fileID: 0}
    - target: {fileID: 8225588255146766514, guid: c1d98eba45a925f438490bf8807e2dc0, type: 3}
      propertyPath: m_LocalPosition.z
      value: 0
      objectReference: {fileID: 0}
    - target: {fileID: 8225588255146766514, guid: c1d98eba45a925f438490bf8807e2dc0, type: 3}
      propertyPath: m_LocalRotation.w
      value: 1
      objectReference: {fileID: 0}
    - target: {fileID: 8225588255146766514, guid: c1d98eba45a925f438490bf8807e2dc0, type: 3}
      propertyPath: m_LocalRotation.x
      value: 0
      objectReference: {fileID: 0}
    - target: {fileID: 8225588255146766514, guid: c1d98eba45a925f438490bf8807e2dc0, type: 3}
      propertyPath: m_LocalRotation.y
      value: 0
      objectReference: {fileID: 0}
    - target: {fileID: 8225588255146766514, guid: c1d98eba45a925f438490bf8807e2dc0, type: 3}
      propertyPath: m_LocalRotation.z
      value: 0
      objectReference: {fileID: 0}
    - target: {fileID: 8225588255146766514, guid: c1d98eba45a925f438490bf8807e2dc0, type: 3}
      propertyPath: m_AnchoredPosition.x
      value: 0
      objectReference: {fileID: 0}
    - target: {fileID: 8225588255146766514, guid: c1d98eba45a925f438490bf8807e2dc0, type: 3}
      propertyPath: m_AnchoredPosition.y
      value: 0
      objectReference: {fileID: 0}
    - target: {fileID: 8225588255146766514, guid: c1d98eba45a925f438490bf8807e2dc0, type: 3}
      propertyPath: m_LocalEulerAnglesHint.x
      value: 0
      objectReference: {fileID: 0}
    - target: {fileID: 8225588255146766514, guid: c1d98eba45a925f438490bf8807e2dc0, type: 3}
      propertyPath: m_LocalEulerAnglesHint.y
      value: 0
      objectReference: {fileID: 0}
    - target: {fileID: 8225588255146766514, guid: c1d98eba45a925f438490bf8807e2dc0, type: 3}
      propertyPath: m_LocalEulerAnglesHint.z
      value: 0
      objectReference: {fileID: 0}
    - target: {fileID: 8865974691749865764, guid: c1d98eba45a925f438490bf8807e2dc0, type: 3}
      propertyPath: m_Sprite
      value: 
      objectReference: {fileID: 21300000, guid: 9ce604c24071dca40b2d0d27ad604bab, type: 3}
    m_RemovedComponents: []
  m_SourcePrefab: {fileID: 100100000, guid: c1d98eba45a925f438490bf8807e2dc0, type: 3}
