id,name,desc,icon,energe_cost,region,hero
1,card_1,card_1_desc,CardIcons/card_1,1,1,true
2,card_2,card_2_desc,CardIcons/card_2,2,1,false
3,card_3,card_3_desc,CardIcons/card_3,3,2,false
4,card_4,card_4_desc,CardIcons/card_4,4,1,true
5,card_5,card_5_desc,CardIcons/card_5,5,3,true
6,card_6,card_6_desc,CardIcons/card_6,6,2,false
7,card_7,card_7_desc,CardIcons/card_7,6,3,false
8,card_8,card_8_desc,CardIcons/card_8,6,4,false
9,card_9,card_9_desc,CardIcons/card_9,3,4,true
10,card_10,card_10_desc,CardIcons/card_10,2,2,true
11,card_11,card_11_desc,CardIcons/card_11,1,1,false
12,card_12,card_12_desc,CardIcons/card_12,2,1,false
13,card_13,card_13_desc,CardIcons/card_13,3,1,true
14,card_14,card_14_desc,CardIcons/card_14,3,1,false
15,card_15,card_15_desc,CardIcons/card_15,3,1,true