%YAML 1.1
%TAG !u! tag:unity3d.com,2011:
--- !u!1 &611089578836597131
GameObject:
  m_ObjectHideFlags: 0
  m_CorrespondingSourceObject: {fileID: 0}
  m_PrefabInstance: {fileID: 0}
  m_PrefabAsset: {fileID: 0}
  serializedVersion: 6
  m_Component:
  - component: {fileID: 8240423434446902231}
  m_Layer: 5
  m_Name: Top
  m_TagString: Untagged
  m_Icon: {fileID: 0}
  m_NavMeshLayer: 0
  m_StaticEditorFlags: 0
  m_IsActive: 1
--- !u!224 &8240423434446902231
RectTransform:
  m_ObjectHideFlags: 0
  m_CorrespondingSourceObject: {fileID: 0}
  m_PrefabInstance: {fileID: 0}
  m_PrefabAsset: {fileID: 0}
  m_GameObject: {fileID: 611089578836597131}
  m_LocalRotation: {x: -0, y: -0, z: -0, w: 1}
  m_LocalPosition: {x: 0, y: 0, z: 0}
  m_LocalScale: {x: 1, y: 1, z: 1}
  m_Children:
  - {fileID: 6367613397483787533}
  - {fileID: 3411618369504515408}
  m_Father: {fileID: 2909267924625156676}
  m_RootOrder: 0
  m_LocalEulerAnglesHint: {x: 0, y: 0, z: 0}
  m_AnchorMin: {x: 0, y: 1}
  m_AnchorMax: {x: 1, y: 1}
  m_AnchoredPosition: {x: 0, y: 0}
  m_SizeDelta: {x: 0, y: 100}
  m_Pivot: {x: 0.5, y: 1}
--- !u!1 &4118677497056815340
GameObject:
  m_ObjectHideFlags: 0
  m_CorrespondingSourceObject: {fileID: 0}
  m_PrefabInstance: {fileID: 0}
  m_PrefabAsset: {fileID: 0}
  serializedVersion: 6
  m_Component:
  - component: {fileID: 6367613397483787533}
  - component: {fileID: 5347917929787738232}
  - component: {fileID: 3946389037123554460}
  - component: {fileID: 7536053205132747343}
  m_Layer: 5
  m_Name: TitleText
  m_TagString: Untagged
  m_Icon: {fileID: 0}
  m_NavMeshLayer: 0
  m_StaticEditorFlags: 0
  m_IsActive: 1
--- !u!224 &6367613397483787533
RectTransform:
  m_ObjectHideFlags: 0
  m_CorrespondingSourceObject: {fileID: 0}
  m_PrefabInstance: {fileID: 0}
  m_PrefabAsset: {fileID: 0}
  m_GameObject: {fileID: 4118677497056815340}
  m_LocalRotation: {x: 0, y: 0, z: 0, w: 1}
  m_LocalPosition: {x: 0, y: 0, z: 0}
  m_LocalScale: {x: 1, y: 1, z: 1}
  m_Children: []
  m_Father: {fileID: 8240423434446902231}
  m_RootOrder: 0
  m_LocalEulerAnglesHint: {x: 0, y: 0, z: 0}
  m_AnchorMin: {x: 0, y: 0}
  m_AnchorMax: {x: 1, y: 1}
  m_AnchoredPosition: {x: 15, y: 2}
  m_SizeDelta: {x: -30, y: -4}
  m_Pivot: {x: 0.5, y: 0.5}
--- !u!222 &5347917929787738232
CanvasRenderer:
  m_ObjectHideFlags: 0
  m_CorrespondingSourceObject: {fileID: 0}
  m_PrefabInstance: {fileID: 0}
  m_PrefabAsset: {fileID: 0}
  m_GameObject: {fileID: 4118677497056815340}
  m_CullTransparentMesh: 1
--- !u!114 &3946389037123554460
MonoBehaviour:
  m_ObjectHideFlags: 0
  m_CorrespondingSourceObject: {fileID: 0}
  m_PrefabInstance: {fileID: 0}
  m_PrefabAsset: {fileID: 0}
  m_GameObject: {fileID: 4118677497056815340}
  m_Enabled: 1
  m_EditorHideFlags: 0
  m_Script: {fileID: 11500000, guid: f4688fdb7df04437aeb418b961361dc5, type: 3}
  m_Name: 
  m_EditorClassIdentifier: 
  m_Material: {fileID: 0}
  m_Color: {r: 1, g: 1, b: 1, a: 1}
  m_RaycastTarget: 1
  m_RaycastPadding: {x: 0, y: 0, z: 0, w: 0}
  m_Maskable: 1
  m_OnCullStateChanged:
    m_PersistentCalls:
      m_Calls: []
  m_text: '#tournament_ban_pick_choose_a_deck'
  m_isRightToLeft: 0
  m_fontAsset: {fileID: 11400000, guid: 03b5875f1d7e53b42ac6748b5df6ee2f, type: 2}
  m_sharedMaterial: {fileID: 7230987703158328321, guid: 03b5875f1d7e53b42ac6748b5df6ee2f, type: 2}
  m_fontSharedMaterials: []
  m_fontMaterial: {fileID: 0}
  m_fontMaterials: []
  m_fontColor32:
    serializedVersion: 2
    rgba: 4294967295
  m_fontColor: {r: 1, g: 1, b: 1, a: 1}
  m_enableVertexGradient: 0
  m_colorMode: 3
  m_fontColorGradient:
    topLeft: {r: 1, g: 1, b: 1, a: 1}
    topRight: {r: 1, g: 1, b: 1, a: 1}
    bottomLeft: {r: 1, g: 1, b: 1, a: 1}
    bottomRight: {r: 1, g: 1, b: 1, a: 1}
  m_fontColorGradientPreset: {fileID: 0}
  m_spriteAsset: {fileID: 0}
  m_tintAllSprites: 0
  m_StyleSheet: {fileID: 0}
  m_TextStyleHashCode: -1183493901
  m_overrideHtmlColors: 0
  m_faceColor:
    serializedVersion: 2
    rgba: 4294967295
  m_fontSize: 34
  m_fontSizeBase: 34
  m_fontWeight: 400
  m_enableAutoSizing: 0
  m_fontSizeMin: 18
  m_fontSizeMax: 72
  m_fontStyle: 16
  m_HorizontalAlignment: 2
  m_VerticalAlignment: 512
  m_textAlignment: 65535
  m_characterSpacing: 0
  m_wordSpacing: 0
  m_lineSpacing: 0
  m_lineSpacingMax: 0
  m_paragraphSpacing: 0
  m_charWidthMaxAdj: 0
  m_enableWordWrapping: 0
  m_wordWrappingRatios: 0.4
  m_overflowMode: 0
  m_linkedTextComponent: {fileID: 0}
  parentLinkedComponent: {fileID: 0}
  m_enableKerning: 1
  m_enableExtraPadding: 0
  checkPaddingRequired: 0
  m_isRichText: 1
  m_parseCtrlCharacters: 1
  m_isOrthographic: 1
  m_isCullingEnabled: 0
  m_horizontalMapping: 0
  m_verticalMapping: 0
  m_uvLineOffset: 0
  m_geometrySortingOrder: 0
  m_IsTextObjectScaleStatic: 0
  m_VertexBufferAutoSizeReduction: 0
  m_useMaxVisibleDescender: 1
  m_pageToDisplay: 1
  m_margin: {x: 0, y: 0, z: 0, w: 0}
  m_isUsingLegacyAnimationComponent: 0
  m_isVolumetricText: 0
  m_hasFontAssetChanged: 0
  m_baseMaterial: {fileID: 0}
  m_maskOffset: {x: 0, y: 0, z: 0, w: 0}
--- !u!114 &7536053205132747343
MonoBehaviour:
  m_ObjectHideFlags: 0
  m_CorrespondingSourceObject: {fileID: 0}
  m_PrefabInstance: {fileID: 0}
  m_PrefabAsset: {fileID: 0}
  m_GameObject: {fileID: 4118677497056815340}
  m_Enabled: 1
  m_EditorHideFlags: 0
  m_Script: {fileID: 11500000, guid: 78b4d36b0e168554da34b6848c40f76f, type: 3}
  m_Name: 
  m_EditorClassIdentifier: 
  staticText: 1
  textId: tournament_ban_pick_choose_a_deck
--- !u!1 &4157482194893509278
GameObject:
  m_ObjectHideFlags: 0
  m_CorrespondingSourceObject: {fileID: 0}
  m_PrefabInstance: {fileID: 0}
  m_PrefabAsset: {fileID: 0}
  serializedVersion: 6
  m_Component:
  - component: {fileID: 3411618369504515408}
  - component: {fileID: 2625426001504916647}
  - component: {fileID: 8126407864421222503}
  m_Layer: 5
  m_Name: LineSeperator
  m_TagString: Untagged
  m_Icon: {fileID: 0}
  m_NavMeshLayer: 0
  m_StaticEditorFlags: 0
  m_IsActive: 1
--- !u!224 &3411618369504515408
RectTransform:
  m_ObjectHideFlags: 0
  m_CorrespondingSourceObject: {fileID: 0}
  m_PrefabInstance: {fileID: 0}
  m_PrefabAsset: {fileID: 0}
  m_GameObject: {fileID: 4157482194893509278}
  m_LocalRotation: {x: -0, y: -0, z: -0, w: 1}
  m_LocalPosition: {x: 0, y: 0, z: 0}
  m_LocalScale: {x: 1, y: 1, z: 1}
  m_Children: []
  m_Father: {fileID: 8240423434446902231}
  m_RootOrder: 1
  m_LocalEulerAnglesHint: {x: 0, y: 0, z: 0}
  m_AnchorMin: {x: 0, y: 0}
  m_AnchorMax: {x: 1, y: 0}
  m_AnchoredPosition: {x: 0, y: 0}
  m_SizeDelta: {x: -30, y: 4}
  m_Pivot: {x: 0.5, y: 0}
--- !u!222 &2625426001504916647
CanvasRenderer:
  m_ObjectHideFlags: 0
  m_CorrespondingSourceObject: {fileID: 0}
  m_PrefabInstance: {fileID: 0}
  m_PrefabAsset: {fileID: 0}
  m_GameObject: {fileID: 4157482194893509278}
  m_CullTransparentMesh: 1
--- !u!114 &8126407864421222503
MonoBehaviour:
  m_ObjectHideFlags: 0
  m_CorrespondingSourceObject: {fileID: 0}
  m_PrefabInstance: {fileID: 0}
  m_PrefabAsset: {fileID: 0}
  m_GameObject: {fileID: 4157482194893509278}
  m_Enabled: 1
  m_EditorHideFlags: 0
  m_Script: {fileID: 11500000, guid: fe87c0e1cc204ed48ad3b37840f39efc, type: 3}
  m_Name: 
  m_EditorClassIdentifier: 
  m_Material: {fileID: 0}
  m_Color: {r: 1, g: 1, b: 1, a: 1}
  m_RaycastTarget: 1
  m_RaycastPadding: {x: 0, y: 0, z: 0, w: 0}
  m_Maskable: 1
  m_OnCullStateChanged:
    m_PersistentCalls:
      m_Calls: []
  m_Sprite: {fileID: 21300000, guid: 8f93e395262c7d24cb9bde4ac39352aa, type: 3}
  m_Type: 0
  m_PreserveAspect: 0
  m_FillCenter: 1
  m_FillMethod: 4
  m_FillAmount: 1
  m_FillClockwise: 1
  m_FillOrigin: 0
  m_UseSpriteMesh: 0
  m_PixelsPerUnitMultiplier: 1
--- !u!1 &7935167365316343875
GameObject:
  m_ObjectHideFlags: 0
  m_CorrespondingSourceObject: {fileID: 0}
  m_PrefabInstance: {fileID: 0}
  m_PrefabAsset: {fileID: 0}
  serializedVersion: 6
  m_Component:
  - component: {fileID: 4030790530481487293}
  m_Layer: 5
  m_Name: Mid
  m_TagString: Untagged
  m_Icon: {fileID: 0}
  m_NavMeshLayer: 0
  m_StaticEditorFlags: 0
  m_IsActive: 1
--- !u!224 &4030790530481487293
RectTransform:
  m_ObjectHideFlags: 0
  m_CorrespondingSourceObject: {fileID: 0}
  m_PrefabInstance: {fileID: 0}
  m_PrefabAsset: {fileID: 0}
  m_GameObject: {fileID: 7935167365316343875}
  m_LocalRotation: {x: 0, y: 0, z: 0, w: 1}
  m_LocalPosition: {x: 0, y: 0, z: 0}
  m_LocalScale: {x: 1, y: 1, z: 1}
  m_Children:
  - {fileID: 4657402935397316407}
  - {fileID: 2201206847377760318}
  m_Father: {fileID: 2909267924625156676}
  m_RootOrder: 1
  m_LocalEulerAnglesHint: {x: 0, y: 0, z: 0}
  m_AnchorMin: {x: 0, y: 0}
  m_AnchorMax: {x: 1, y: 1}
  m_AnchoredPosition: {x: 0, y: -52}
  m_SizeDelta: {x: 0, y: -104}
  m_Pivot: {x: 0.5, y: 0.5}
--- !u!1 &8443267492351046422
GameObject:
  m_ObjectHideFlags: 0
  m_CorrespondingSourceObject: {fileID: 0}
  m_PrefabInstance: {fileID: 0}
  m_PrefabAsset: {fileID: 0}
  serializedVersion: 6
  m_Component:
  - component: {fileID: 2909267924625156676}
  - component: {fileID: 6648094463316480656}
  - component: {fileID: 3748261202482470039}
  - component: {fileID: 900292470279116929}
  m_Layer: 5
  m_Name: DeckPickWidget
  m_TagString: Untagged
  m_Icon: {fileID: 0}
  m_NavMeshLayer: 0
  m_StaticEditorFlags: 0
  m_IsActive: 1
--- !u!224 &2909267924625156676
RectTransform:
  m_ObjectHideFlags: 0
  m_CorrespondingSourceObject: {fileID: 0}
  m_PrefabInstance: {fileID: 0}
  m_PrefabAsset: {fileID: 0}
  m_GameObject: {fileID: 8443267492351046422}
  m_LocalRotation: {x: 0, y: 0, z: 0, w: 1}
  m_LocalPosition: {x: 0, y: 0, z: 0}
  m_LocalScale: {x: 1, y: 1, z: 1}
  m_Children:
  - {fileID: 8240423434446902231}
  - {fileID: 4030790530481487293}
  m_Father: {fileID: 0}
  m_RootOrder: 0
  m_LocalEulerAnglesHint: {x: 0, y: 0, z: 0}
  m_AnchorMin: {x: 1, y: 0}
  m_AnchorMax: {x: 1, y: 1}
  m_AnchoredPosition: {x: 0, y: 0}
  m_SizeDelta: {x: 450, y: 0}
  m_Pivot: {x: 1, y: 0.5}
--- !u!114 &6648094463316480656
MonoBehaviour:
  m_ObjectHideFlags: 0
  m_CorrespondingSourceObject: {fileID: 0}
  m_PrefabInstance: {fileID: 0}
  m_PrefabAsset: {fileID: 0}
  m_GameObject: {fileID: 8443267492351046422}
  m_Enabled: 1
  m_EditorHideFlags: 0
  m_Script: {fileID: 11500000, guid: 897157d595834bb0bcd8a90ccbfbe3ec, type: 3}
  m_Name: 
  m_EditorClassIdentifier: 
  deckAndHeroWidget: {fileID: 7917676282202797689}
--- !u!222 &3748261202482470039
CanvasRenderer:
  m_ObjectHideFlags: 0
  m_CorrespondingSourceObject: {fileID: 0}
  m_PrefabInstance: {fileID: 0}
  m_PrefabAsset: {fileID: 0}
  m_GameObject: {fileID: 8443267492351046422}
  m_CullTransparentMesh: 1
--- !u!114 &900292470279116929
MonoBehaviour:
  m_ObjectHideFlags: 0
  m_CorrespondingSourceObject: {fileID: 0}
  m_PrefabInstance: {fileID: 0}
  m_PrefabAsset: {fileID: 0}
  m_GameObject: {fileID: 8443267492351046422}
  m_Enabled: 1
  m_EditorHideFlags: 0
  m_Script: {fileID: 11500000, guid: fe87c0e1cc204ed48ad3b37840f39efc, type: 3}
  m_Name: 
  m_EditorClassIdentifier: 
  m_Material: {fileID: 0}
  m_Color: {r: 0.25711998, g: 0.509434, b: 0.29248345, a: 1}
  m_RaycastTarget: 1
  m_RaycastPadding: {x: 0, y: 0, z: 0, w: 0}
  m_Maskable: 1
  m_OnCullStateChanged:
    m_PersistentCalls:
      m_Calls: []
  m_Sprite: {fileID: 0}
  m_Type: 0
  m_PreserveAspect: 0
  m_FillCenter: 1
  m_FillMethod: 4
  m_FillAmount: 1
  m_FillClockwise: 1
  m_FillOrigin: 0
  m_UseSpriteMesh: 0
  m_PixelsPerUnitMultiplier: 1
--- !u!1001 &3163786734242023936
PrefabInstance:
  m_ObjectHideFlags: 0
  serializedVersion: 2
  m_Modification:
    m_TransformParent: {fileID: 4030790530481487293}
    m_Modifications:
    - target: {fileID: 1912576427584150463, guid: 019af9a797ffdf44aa8089c1e2a4bc23, type: 3}
      propertyPath: m_AnchorMax.y
      value: 0
      objectReference: {fileID: 0}
    - target: {fileID: 1912576427584150463, guid: 019af9a797ffdf44aa8089c1e2a4bc23, type: 3}
      propertyPath: m_AnchorMin.y
      value: 0
      objectReference: {fileID: 0}
    - target: {fileID: 1912576427584150463, guid: 019af9a797ffdf44aa8089c1e2a4bc23, type: 3}
      propertyPath: m_SizeDelta.x
      value: 0
      objectReference: {fileID: 0}
    - target: {fileID: 1912576427584150463, guid: 019af9a797ffdf44aa8089c1e2a4bc23, type: 3}
      propertyPath: m_SizeDelta.y
      value: 0
      objectReference: {fileID: 0}
    - target: {fileID: 1912576427584150463, guid: 019af9a797ffdf44aa8089c1e2a4bc23, type: 3}
      propertyPath: m_AnchoredPosition.x
      value: 0
      objectReference: {fileID: 0}
    - target: {fileID: 1912576427584150463, guid: 019af9a797ffdf44aa8089c1e2a4bc23, type: 3}
      propertyPath: m_AnchoredPosition.y
      value: 0
      objectReference: {fileID: 0}
    - target: {fileID: 2056663001838228421, guid: 019af9a797ffdf44aa8089c1e2a4bc23, type: 3}
      propertyPath: m_AnchorMax.y
      value: 0
      objectReference: {fileID: 0}
    - target: {fileID: 2056663001838228421, guid: 019af9a797ffdf44aa8089c1e2a4bc23, type: 3}
      propertyPath: m_AnchorMin.y
      value: 0
      objectReference: {fileID: 0}
    - target: {fileID: 2056663001838228421, guid: 019af9a797ffdf44aa8089c1e2a4bc23, type: 3}
      propertyPath: m_SizeDelta.x
      value: 0
      objectReference: {fileID: 0}
    - target: {fileID: 2056663001838228421, guid: 019af9a797ffdf44aa8089c1e2a4bc23, type: 3}
      propertyPath: m_SizeDelta.y
      value: 0
      objectReference: {fileID: 0}
    - target: {fileID: 2056663001838228421, guid: 019af9a797ffdf44aa8089c1e2a4bc23, type: 3}
      propertyPath: m_AnchoredPosition.x
      value: 0
      objectReference: {fileID: 0}
    - target: {fileID: 2056663001838228421, guid: 019af9a797ffdf44aa8089c1e2a4bc23, type: 3}
      propertyPath: m_AnchoredPosition.y
      value: 0
      objectReference: {fileID: 0}
    - target: {fileID: 2857999158075449617, guid: 019af9a797ffdf44aa8089c1e2a4bc23, type: 3}
      propertyPath: m_Name
      value: DeckAndHeroWidget
      objectReference: {fileID: 0}
    - target: {fileID: 2981396632285624357, guid: 019af9a797ffdf44aa8089c1e2a4bc23, type: 3}
      propertyPath: m_AnchorMax.y
      value: 0
      objectReference: {fileID: 0}
    - target: {fileID: 2981396632285624357, guid: 019af9a797ffdf44aa8089c1e2a4bc23, type: 3}
      propertyPath: m_AnchorMin.y
      value: 0
      objectReference: {fileID: 0}
    - target: {fileID: 2981396632285624357, guid: 019af9a797ffdf44aa8089c1e2a4bc23, type: 3}
      propertyPath: m_AnchoredPosition.x
      value: 0
      objectReference: {fileID: 0}
    - target: {fileID: 2981396632285624357, guid: 019af9a797ffdf44aa8089c1e2a4bc23, type: 3}
      propertyPath: m_AnchoredPosition.y
      value: 0
      objectReference: {fileID: 0}
    - target: {fileID: 5696013320718863344, guid: 019af9a797ffdf44aa8089c1e2a4bc23, type: 3}
      propertyPath: m_AnchorMax.y
      value: 0
      objectReference: {fileID: 0}
    - target: {fileID: 5696013320718863344, guid: 019af9a797ffdf44aa8089c1e2a4bc23, type: 3}
      propertyPath: m_AnchorMin.y
      value: 0
      objectReference: {fileID: 0}
    - target: {fileID: 5696013320718863344, guid: 019af9a797ffdf44aa8089c1e2a4bc23, type: 3}
      propertyPath: m_AnchoredPosition.x
      value: 0
      objectReference: {fileID: 0}
    - target: {fileID: 5696013320718863344, guid: 019af9a797ffdf44aa8089c1e2a4bc23, type: 3}
      propertyPath: m_AnchoredPosition.y
      value: 0
      objectReference: {fileID: 0}
    - target: {fileID: 6068169306265109266, guid: 019af9a797ffdf44aa8089c1e2a4bc23, type: 3}
      propertyPath: m_AnchorMax.y
      value: 0
      objectReference: {fileID: 0}
    - target: {fileID: 6068169306265109266, guid: 019af9a797ffdf44aa8089c1e2a4bc23, type: 3}
      propertyPath: m_AnchorMin.y
      value: 0
      objectReference: {fileID: 0}
    - target: {fileID: 6068169306265109266, guid: 019af9a797ffdf44aa8089c1e2a4bc23, type: 3}
      propertyPath: m_SizeDelta.x
      value: 0
      objectReference: {fileID: 0}
    - target: {fileID: 6068169306265109266, guid: 019af9a797ffdf44aa8089c1e2a4bc23, type: 3}
      propertyPath: m_SizeDelta.y
      value: 0
      objectReference: {fileID: 0}
    - target: {fileID: 6068169306265109266, guid: 019af9a797ffdf44aa8089c1e2a4bc23, type: 3}
      propertyPath: m_AnchoredPosition.x
      value: 0
      objectReference: {fileID: 0}
    - target: {fileID: 6068169306265109266, guid: 019af9a797ffdf44aa8089c1e2a4bc23, type: 3}
      propertyPath: m_AnchoredPosition.y
      value: 0
      objectReference: {fileID: 0}
    - target: {fileID: 7731110519928601911, guid: 019af9a797ffdf44aa8089c1e2a4bc23, type: 3}
      propertyPath: m_Pivot.x
      value: 0.5
      objectReference: {fileID: 0}
    - target: {fileID: 7731110519928601911, guid: 019af9a797ffdf44aa8089c1e2a4bc23, type: 3}
      propertyPath: m_Pivot.y
      value: 0.5
      objectReference: {fileID: 0}
    - target: {fileID: 7731110519928601911, guid: 019af9a797ffdf44aa8089c1e2a4bc23, type: 3}
      propertyPath: m_RootOrder
      value: 0
      objectReference: {fileID: 0}
    - target: {fileID: 7731110519928601911, guid: 019af9a797ffdf44aa8089c1e2a4bc23, type: 3}
      propertyPath: m_AnchorMax.x
      value: 1
      objectReference: {fileID: 0}
    - target: {fileID: 7731110519928601911, guid: 019af9a797ffdf44aa8089c1e2a4bc23, type: 3}
      propertyPath: m_AnchorMax.y
      value: 1
      objectReference: {fileID: 0}
    - target: {fileID: 7731110519928601911, guid: 019af9a797ffdf44aa8089c1e2a4bc23, type: 3}
      propertyPath: m_AnchorMin.x
      value: 0
      objectReference: {fileID: 0}
    - target: {fileID: 7731110519928601911, guid: 019af9a797ffdf44aa8089c1e2a4bc23, type: 3}
      propertyPath: m_AnchorMin.y
      value: 0
      objectReference: {fileID: 0}
    - target: {fileID: 7731110519928601911, guid: 019af9a797ffdf44aa8089c1e2a4bc23, type: 3}
      propertyPath: m_SizeDelta.x
      value: 0
      objectReference: {fileID: 0}
    - target: {fileID: 7731110519928601911, guid: 019af9a797ffdf44aa8089c1e2a4bc23, type: 3}
      propertyPath: m_SizeDelta.y
      value: -120
      objectReference: {fileID: 0}
    - target: {fileID: 7731110519928601911, guid: 019af9a797ffdf44aa8089c1e2a4bc23, type: 3}
      propertyPath: m_LocalPosition.x
      value: 0
      objectReference: {fileID: 0}
    - target: {fileID: 7731110519928601911, guid: 019af9a797ffdf44aa8089c1e2a4bc23, type: 3}
      propertyPath: m_LocalPosition.y
      value: 0
      objectReference: {fileID: 0}
    - target: {fileID: 7731110519928601911, guid: 019af9a797ffdf44aa8089c1e2a4bc23, type: 3}
      propertyPath: m_LocalPosition.z
      value: 0
      objectReference: {fileID: 0}
    - target: {fileID: 7731110519928601911, guid: 019af9a797ffdf44aa8089c1e2a4bc23, type: 3}
      propertyPath: m_LocalRotation.w
      value: 1
      objectReference: {fileID: 0}
    - target: {fileID: 7731110519928601911, guid: 019af9a797ffdf44aa8089c1e2a4bc23, type: 3}
      propertyPath: m_LocalRotation.x
      value: 0
      objectReference: {fileID: 0}
    - target: {fileID: 7731110519928601911, guid: 019af9a797ffdf44aa8089c1e2a4bc23, type: 3}
      propertyPath: m_LocalRotation.y
      value: 0
      objectReference: {fileID: 0}
    - target: {fileID: 7731110519928601911, guid: 019af9a797ffdf44aa8089c1e2a4bc23, type: 3}
      propertyPath: m_LocalRotation.z
      value: 0
      objectReference: {fileID: 0}
    - target: {fileID: 7731110519928601911, guid: 019af9a797ffdf44aa8089c1e2a4bc23, type: 3}
      propertyPath: m_AnchoredPosition.x
      value: 0
      objectReference: {fileID: 0}
    - target: {fileID: 7731110519928601911, guid: 019af9a797ffdf44aa8089c1e2a4bc23, type: 3}
      propertyPath: m_AnchoredPosition.y
      value: 60
      objectReference: {fileID: 0}
    - target: {fileID: 7731110519928601911, guid: 019af9a797ffdf44aa8089c1e2a4bc23, type: 3}
      propertyPath: m_LocalEulerAnglesHint.x
      value: 0
      objectReference: {fileID: 0}
    - target: {fileID: 7731110519928601911, guid: 019af9a797ffdf44aa8089c1e2a4bc23, type: 3}
      propertyPath: m_LocalEulerAnglesHint.y
      value: 0
      objectReference: {fileID: 0}
    - target: {fileID: 7731110519928601911, guid: 019af9a797ffdf44aa8089c1e2a4bc23, type: 3}
      propertyPath: m_LocalEulerAnglesHint.z
      value: 0
      objectReference: {fileID: 0}
    - target: {fileID: 8583431789855945806, guid: 019af9a797ffdf44aa8089c1e2a4bc23, type: 3}
      propertyPath: m_AnchorMax.y
      value: 0
      objectReference: {fileID: 0}
    - target: {fileID: 8583431789855945806, guid: 019af9a797ffdf44aa8089c1e2a4bc23, type: 3}
      propertyPath: m_AnchorMin.y
      value: 0
      objectReference: {fileID: 0}
    - target: {fileID: 8583431789855945806, guid: 019af9a797ffdf44aa8089c1e2a4bc23, type: 3}
      propertyPath: m_SizeDelta.x
      value: 0
      objectReference: {fileID: 0}
    - target: {fileID: 8583431789855945806, guid: 019af9a797ffdf44aa8089c1e2a4bc23, type: 3}
      propertyPath: m_SizeDelta.y
      value: 0
      objectReference: {fileID: 0}
    - target: {fileID: 8583431789855945806, guid: 019af9a797ffdf44aa8089c1e2a4bc23, type: 3}
      propertyPath: m_AnchoredPosition.x
      value: 0
      objectReference: {fileID: 0}
    - target: {fileID: 8583431789855945806, guid: 019af9a797ffdf44aa8089c1e2a4bc23, type: 3}
      propertyPath: m_AnchoredPosition.y
      value: 0
      objectReference: {fileID: 0}
    m_RemovedComponents: []
  m_SourcePrefab: {fileID: 100100000, guid: 019af9a797ffdf44aa8089c1e2a4bc23, type: 3}
--- !u!224 &4657402935397316407 stripped
RectTransform:
  m_CorrespondingSourceObject: {fileID: 7731110519928601911, guid: 019af9a797ffdf44aa8089c1e2a4bc23, type: 3}
  m_PrefabInstance: {fileID: 3163786734242023936}
  m_PrefabAsset: {fileID: 0}
--- !u!114 &7917676282202797689 stripped
MonoBehaviour:
  m_CorrespondingSourceObject: {fileID: 5046630710848093305, guid: 019af9a797ffdf44aa8089c1e2a4bc23, type: 3}
  m_PrefabInstance: {fileID: 3163786734242023936}
  m_PrefabAsset: {fileID: 0}
  m_GameObject: {fileID: 0}
  m_Enabled: 1
  m_EditorHideFlags: 0
  m_Script: {fileID: 11500000, guid: e5f292656cbb42ae93ed27b6f36861f9, type: 3}
  m_Name: 
  m_EditorClassIdentifier: 
--- !u!1001 &7830467933070299276
PrefabInstance:
  m_ObjectHideFlags: 0
  serializedVersion: 2
  m_Modification:
    m_TransformParent: {fileID: 4030790530481487293}
    m_Modifications:
    - target: {fileID: 312671485317451404, guid: c1d98eba45a925f438490bf8807e2dc0, type: 3}
      propertyPath: m_OnClick.m_PersistentCalls.m_Calls.Array.size
      value: 1
      objectReference: {fileID: 0}
    - target: {fileID: 312671485317451404, guid: c1d98eba45a925f438490bf8807e2dc0, type: 3}
      propertyPath: m_OnClick.m_PersistentCalls.m_Calls.Array.data[0].m_Mode
      value: 1
      objectReference: {fileID: 0}
    - target: {fileID: 312671485317451404, guid: c1d98eba45a925f438490bf8807e2dc0, type: 3}
      propertyPath: m_OnClick.m_PersistentCalls.m_Calls.Array.data[0].m_Target
      value: 
      objectReference: {fileID: 6648094463316480656}
    - target: {fileID: 312671485317451404, guid: c1d98eba45a925f438490bf8807e2dc0, type: 3}
      propertyPath: m_OnClick.m_PersistentCalls.m_Calls.Array.data[0].m_CallState
      value: 2
      objectReference: {fileID: 0}
    - target: {fileID: 312671485317451404, guid: c1d98eba45a925f438490bf8807e2dc0, type: 3}
      propertyPath: m_OnClick.m_PersistentCalls.m_Calls.Array.data[0].m_MethodName
      value: OnClickedChoose
      objectReference: {fileID: 0}
    - target: {fileID: 312671485317451404, guid: c1d98eba45a925f438490bf8807e2dc0, type: 3}
      propertyPath: m_OnClick.m_PersistentCalls.m_Calls.Array.data[0].m_TargetAssemblyTypeName
      value: UI.Widgets.TournamentBanPick.DeckPickWidget, MyScriptAssembly
      objectReference: {fileID: 0}
    - target: {fileID: 312671485317451404, guid: c1d98eba45a925f438490bf8807e2dc0, type: 3}
      propertyPath: m_OnClick.m_PersistentCalls.m_Calls.Array.data[0].m_Arguments.m_ObjectArgumentAssemblyTypeName
      value: UnityEngine.Object, UnityEngine
      objectReference: {fileID: 0}
    - target: {fileID: 1193510216473288686, guid: c1d98eba45a925f438490bf8807e2dc0, type: 3}
      propertyPath: m_Name
      value: Btn_Generic
      objectReference: {fileID: 0}
    - target: {fileID: 3225694418795974607, guid: c1d98eba45a925f438490bf8807e2dc0, type: 3}
      propertyPath: textId
      value: choose
      objectReference: {fileID: 0}
    - target: {fileID: 3225694418795974607, guid: c1d98eba45a925f438490bf8807e2dc0, type: 3}
      propertyPath: staticText
      value: 1
      objectReference: {fileID: 0}
    - target: {fileID: 6663586584083025076, guid: c1d98eba45a925f438490bf8807e2dc0, type: 3}
      propertyPath: m_text
      value: '#choose'
      objectReference: {fileID: 0}
    - target: {fileID: 6663586584083025076, guid: c1d98eba45a925f438490bf8807e2dc0, type: 3}
      propertyPath: m_fontSize
      value: 50
      objectReference: {fileID: 0}
    - target: {fileID: 8225588255146766514, guid: c1d98eba45a925f438490bf8807e2dc0, type: 3}
      propertyPath: m_Pivot.x
      value: 0.5
      objectReference: {fileID: 0}
    - target: {fileID: 8225588255146766514, guid: c1d98eba45a925f438490bf8807e2dc0, type: 3}
      propertyPath: m_Pivot.y
      value: 0
      objectReference: {fileID: 0}
    - target: {fileID: 8225588255146766514, guid: c1d98eba45a925f438490bf8807e2dc0, type: 3}
      propertyPath: m_RootOrder
      value: 1
      objectReference: {fileID: 0}
    - target: {fileID: 8225588255146766514, guid: c1d98eba45a925f438490bf8807e2dc0, type: 3}
      propertyPath: m_AnchorMax.x
      value: 0.5
      objectReference: {fileID: 0}
    - target: {fileID: 8225588255146766514, guid: c1d98eba45a925f438490bf8807e2dc0, type: 3}
      propertyPath: m_AnchorMax.y
      value: 0
      objectReference: {fileID: 0}
    - target: {fileID: 8225588255146766514, guid: c1d98eba45a925f438490bf8807e2dc0, type: 3}
      propertyPath: m_AnchorMin.x
      value: 0.5
      objectReference: {fileID: 0}
    - target: {fileID: 8225588255146766514, guid: c1d98eba45a925f438490bf8807e2dc0, type: 3}
      propertyPath: m_AnchorMin.y
      value: 0
      objectReference: {fileID: 0}
    - target: {fileID: 8225588255146766514, guid: c1d98eba45a925f438490bf8807e2dc0, type: 3}
      propertyPath: m_SizeDelta.x
      value: 340
      objectReference: {fileID: 0}
    - target: {fileID: 8225588255146766514, guid: c1d98eba45a925f438490bf8807e2dc0, type: 3}
      propertyPath: m_SizeDelta.y
      value: 120
      objectReference: {fileID: 0}
    - target: {fileID: 8225588255146766514, guid: c1d98eba45a925f438490bf8807e2dc0, type: 3}
      propertyPath: m_LocalPosition.x
      value: 0
      objectReference: {fileID: 0}
    - target: {fileID: 8225588255146766514, guid: c1d98eba45a925f438490bf8807e2dc0, type: 3}
      propertyPath: m_LocalPosition.y
      value: 0
      objectReference: {fileID: 0}
    - target: {fileID: 8225588255146766514, guid: c1d98eba45a925f438490bf8807e2dc0, type: 3}
      propertyPath: m_LocalPosition.z
      value: 0
      objectReference: {fileID: 0}
    - target: {fileID: 8225588255146766514, guid: c1d98eba45a925f438490bf8807e2dc0, type: 3}
      propertyPath: m_LocalRotation.w
      value: 1
      objectReference: {fileID: 0}
    - target: {fileID: 8225588255146766514, guid: c1d98eba45a925f438490bf8807e2dc0, type: 3}
      propertyPath: m_LocalRotation.x
      value: -0
      objectReference: {fileID: 0}
    - target: {fileID: 8225588255146766514, guid: c1d98eba45a925f438490bf8807e2dc0, type: 3}
      propertyPath: m_LocalRotation.y
      value: -0
      objectReference: {fileID: 0}
    - target: {fileID: 8225588255146766514, guid: c1d98eba45a925f438490bf8807e2dc0, type: 3}
      propertyPath: m_LocalRotation.z
      value: -0
      objectReference: {fileID: 0}
    - target: {fileID: 8225588255146766514, guid: c1d98eba45a925f438490bf8807e2dc0, type: 3}
      propertyPath: m_AnchoredPosition.x
      value: 0
      objectReference: {fileID: 0}
    - target: {fileID: 8225588255146766514, guid: c1d98eba45a925f438490bf8807e2dc0, type: 3}
      propertyPath: m_AnchoredPosition.y
      value: 0
      objectReference: {fileID: 0}
    - target: {fileID: 8225588255146766514, guid: c1d98eba45a925f438490bf8807e2dc0, type: 3}
      propertyPath: m_LocalEulerAnglesHint.x
      value: 0
      objectReference: {fileID: 0}
    - target: {fileID: 8225588255146766514, guid: c1d98eba45a925f438490bf8807e2dc0, type: 3}
      propertyPath: m_LocalEulerAnglesHint.y
      value: 0
      objectReference: {fileID: 0}
    - target: {fileID: 8225588255146766514, guid: c1d98eba45a925f438490bf8807e2dc0, type: 3}
      propertyPath: m_LocalEulerAnglesHint.z
      value: 0
      objectReference: {fileID: 0}
    m_RemovedComponents: []
  m_SourcePrefab: {fileID: 100100000, guid: c1d98eba45a925f438490bf8807e2dc0, type: 3}
--- !u!224 &2201206847377760318 stripped
RectTransform:
  m_CorrespondingSourceObject: {fileID: 8225588255146766514, guid: c1d98eba45a925f438490bf8807e2dc0, type: 3}
  m_PrefabInstance: {fileID: 7830467933070299276}
  m_PrefabAsset: {fileID: 0}
