#FIG 3.2  Produced by xfig version 3.2.5c
Landscape
Center
Metric
A4      
100.00
Single
-2
1200 2
6 285 810 855 1110
4 2 0 50 -1 16 7 0.0000 4 105 510 855 900 0 .. +2,5 V\001
4 2 0 50 -1 16 7 0.0000 4 105 480 855 1080 -2,5 .. 0 V\001
-6
1 1 0 1 0 6 61 -1 38 0.000 1 0.0000 4140 1080 180 540 4140 1080 4320 1080
1 1 0 1 0 6 51 -1 30 0.000 1 0.0000 1260 1080 180 540 1260 1080 1440 1080
1 1 0 1 0 0 70 -1 20 0.000 1 0.0000 1305 1125 180 540 1305 1125 1485 1125
1 1 0 1 0 0 70 -1 20 0.000 1 0.0000 4185 1125 180 540 4185 1125 4365 1125
2 1 0 1 0 7 50 -1 -1 0.000 0 0 -1 0 0 2
	 1260 540 4140 540
2 2 0 0 7 6 60 -1 38 0.000 0 0 -1 0 0 5
	 1260 540 4140 540 4140 1620 1260 1620 1260 540
2 1 0 1 0 0 50 -1 20 0.000 0 0 -1 0 0 2
	 1260 1620 4140 1620
2 2 0 1 0 0 70 -1 20 0.000 0 0 -1 0 0 5
	 1305 1665 4185 1665 4185 585 1305 585 1305 1665
3 0 0 1 0 7 50 -1 -1 0.000 0 1 0 15
	1 1 1.00 60.00 120.00
	 900 900 990 900 1080 900 1260 720 1620 1080 1980 720
	 2340 1080 2700 720 3060 1080 3420 720 3780 1080 4140 720
	 4320 900 4410 900 4545 900
	 0.000 1.000 1.000 1.000 1.000 1.000 1.000 1.000
	 1.000 1.000 1.000 1.000 1.000 1.000 0.000
3 0 0 1 0 7 50 -1 -1 0.000 0 1 0 14
	1 1 1.00 60.00 120.00
	 900 990 1170 990 1260 990 1530 720 1890 1080 2250 720
	 2610 1080 2970 720 3330 1080 3690 720 4050 1080 4230 990
	 4365 990 4545 990
	 0.000 1.000 1.000 1.000 1.000 1.000 1.000 1.000
	 1.000 1.000 1.000 1.000 1.000 0.000
3 0 0 1 0 7 50 -1 -1 0.000 0 0 1 15
	1 1 1.00 60.00 120.00
	 900 1260 990 1260 1080 1260 1260 1080 1620 1440 1980 1080
	 2340 1440 2700 1080 3060 1440 3420 1080 3780 1440 4140 1080
	 4320 1260 4410 1260 4500 1260
	 0.000 1.000 1.000 1.000 1.000 1.000 1.000 1.000
	 1.000 1.000 1.000 1.000 1.000 1.000 0.000
3 0 0 1 0 7 50 -1 -1 0.000 0 0 1 14
	1 1 1.00 60.00 120.00
	 900 1350 1170 1350 1260 1350 1530 1080 1890 1440 2250 1080
	 2610 1440 2970 1080 3330 1440 3690 1080 4050 1440 4230 1350
	 4320 1350 4500 1350
	 0.000 1.000 1.000 1.000 1.000 1.000 1.000 1.000
	 1.000 1.000 1.000 1.000 1.000 0.000
4 0 0 50 -1 16 7 0.0000 4 105 480 4545 1440 -2,5 .. 0 V\001
4 0 0 50 -1 16 7 0.0000 4 105 510 4545 1260 0 .. +2,5 V\001
4 1 0 50 -1 16 10 0.0000 4 120 1065 2700 765 Paire \351mission\001
4 1 0 50 -1 16 10 0.0000 4 150 1095 2700 1485 Paire r\351ception\001
