#FIG 3.2  Produced by xfig version 3.2.5c
Portrait
Center
Metric
A4      
100.00
Single
-2
1200 2
6 360 720 1035 1485
2 2 0 1 -1 11 52 0 36 0.000 0 0 -1 0 0 5
	 450 900 900 900 900 1350 450 1350 450 900
2 2 0 1 0 6 51 -1 36 0.000 0 0 -1 0 0 5
	 450 1035 495 1035 495 1215 450 1215 450 1035
2 2 0 1 0 6 51 -1 36 0.000 0 0 -1 0 0 5
	 585 1350 765 1350 765 1305 585 1305 585 1350
2 2 0 1 0 6 51 -1 36 0.000 0 0 -1 0 0 5
	 855 1035 900 1035 900 1215 855 1215 855 1035
2 2 0 1 0 6 51 -1 36 0.000 0 0 -1 0 0 5
	 585 900 765 900 765 945 585 945 585 900
2 2 0 1 -1 0 55 0 20 0.000 0 0 -1 0 0 5
	 495 945 945 945 945 1395 495 1395 495 945
4 2 -1 8 0 16 5 0.0000 4 135 90 585 1485 3\001
4 2 -1 8 0 16 5 0.0000 4 135 90 1035 1260 2\001
4 0 -1 8 0 16 5 0.0000 4 135 90 360 1035 4\001
4 0 -1 8 0 16 5 0.0000 4 135 90 765 855 1\001
-6
6 1755 720 2430 1485
2 2 0 1 -1 11 52 0 36 0.000 0 0 -1 0 0 5
	 1845 900 2295 900 2295 1350 1845 1350 1845 900
2 2 0 1 0 6 51 -1 36 0.000 0 0 -1 0 0 5
	 1845 1035 1890 1035 1890 1215 1845 1215 1845 1035
2 2 0 1 0 6 51 -1 36 0.000 0 0 -1 0 0 5
	 1980 1350 2160 1350 2160 1305 1980 1305 1980 1350
2 2 0 1 0 6 51 -1 36 0.000 0 0 -1 0 0 5
	 2250 1035 2295 1035 2295 1215 2250 1215 2250 1035
2 2 0 1 0 6 51 -1 36 0.000 0 0 -1 0 0 5
	 1980 900 2160 900 2160 945 1980 945 1980 900
2 2 0 1 -1 0 55 0 20 0.000 0 0 -1 0 0 5
	 1890 945 2340 945 2340 1395 1890 1395 1890 945
4 2 -1 8 0 16 5 0.0000 4 135 90 1980 1485 3\001
4 2 -1 8 0 16 5 0.0000 4 135 90 2430 1260 2\001
4 0 -1 8 0 16 5 0.0000 4 135 90 1755 1035 4\001
4 0 -1 8 0 16 5 0.0000 4 135 90 2160 855 1\001
-6
2 1 0 3 4 7 10 0 -1 0.000 0 0 7 1 0 2
	1 1 1.00 60.00 79.50
	 675 450 675 855
2 1 0 3 4 7 10 0 -1 0.000 0 0 7 1 0 2
	1 1 1.00 60.00 79.50
	 675 990 675 1575
2 1 0 3 4 7 10 0 -1 0.000 0 0 7 1 0 2
	1 1 1.00 60.00 79.50
	 1395 1125 1800 1125
3 0 0 3 4 7 10 0 -1 0.000 0 1 0 4
	1 1 1.00 60.00 79.50
	 675 990 675 1080 630 1125 225 1125
	 0.000 1.000 1.000 0.000
3 0 0 3 4 7 10 0 -1 0.000 0 1 0 4
	1 1 1.00 60.00 79.50
	 675 990 675 1080 720 1125 1125 1125
	 0.000 1.000 1.000 0.000
4 1 1 8 0 16 9 0.0000 4 165 450 2070 405 Rejet\001
4 1 1 8 0 16 9 0.0000 4 135 1080 675 405 Transmission\001
4 0 -1 8 0 16 7 0.0000 4 135 360 720 630 S->G\001
4 0 -1 8 0 16 7 0.0000 4 135 360 1395 1080 S->G\001
