#FIG 3.2  Produced by xfig version 3.2.5c
Portrait
Center
Metric
A4      
100.00
Single
-2
1200 2
2 2 0 1 -1 1 51 0 38 0.000 0 0 0 0 0 5
	 3825 450 225 450 225 225 3825 225 3825 450
2 2 0 1 -1 0 52 0 20 0.000 0 0 0 0 0 5
	 3870 495 270 495 270 270 3870 270 3870 495
2 1 0 1 -1 -1 50 0 -1 0.000 0 0 -1 0 0 2
	 765 225 765 450
2 1 0 1 -1 -1 50 0 -1 0.000 0 0 -1 0 0 2
	 2025 225 2025 450
4 1 0 50 0 16 6 0.0000 4 75 120 495 180 10\001
4 1 0 50 0 16 6 0.0000 4 75 120 1350 180 54\001
4 1 0 50 0 16 6 0.0000 4 75 120 2925 180 64\001
4 1 -1 50 0 16 8 0.0000 4 105 555 2925 405 Interface\001
4 1 -1 50 0 16 8 0.0000 4 90 75 1350 405 0\001
4 1 0 50 0 16 5 0.0000 4 60 510 495 360 1111 1110 10\001
