#FIG 3.2
Portrait
Center
Metric
A4      
100.00
Single
-2
1200 2
6 180 630 360 945
2 1 0 1 -1 7 0 0 -1 0.000 0 0 -1 0 0 2
	 270 765 225 900
2 1 0 1 -1 7 0 0 -1 0.000 0 0 -1 0 0 2
	 270 765 270 945
2 1 0 1 -1 7 0 0 -1 0.000 0 0 -1 0 0 2
	 270 765 315 900
2 1 0 1 -1 7 0 0 -1 0.000 0 0 -1 0 0 5
	 225 669 201 735 303 780 333 714 228 666
2 1 0 1 -1 7 0 0 -1 0.000 0 0 -1 0 0 4
	 210 696 180 684 180 696 210 705
-6
6 360 1395 585 1710
2 1 0 1 -1 7 0 0 -1 0.000 0 0 -1 0 0 2
	 489 1494 444 1629
2 1 0 1 -1 7 0 0 -1 0.000 0 0 -1 0 0 2
	 489 1494 489 1674
2 1 0 1 -1 7 0 0 -1 0.000 0 0 -1 0 0 2
	 489 1494 534 1629
2 1 0 1 -1 7 0 0 -1 0.000 0 0 -1 0 0 5
	 444 1398 420 1464 522 1509 552 1443 447 1395
2 1 0 1 -1 7 0 0 -1 0.000 0 0 -1 0 0 4
	 429 1425 399 1413 399 1425 429 1434
-6
6 1260 1395 1485 1710
2 1 0 1 -1 7 0 0 -1 0.000 0 0 -1 0 0 2
	 1389 1494 1344 1629
2 1 0 1 -1 7 0 0 -1 0.000 0 0 -1 0 0 2
	 1389 1494 1389 1674
2 1 0 1 -1 7 0 0 -1 0.000 0 0 -1 0 0 2
	 1389 1494 1434 1629
2 1 0 1 -1 7 0 0 -1 0.000 0 0 -1 0 0 5
	 1344 1398 1320 1464 1422 1509 1452 1443 1347 1395
2 1 0 1 -1 7 0 0 -1 0.000 0 0 -1 0 0 4
	 1329 1425 1299 1413 1299 1425 1329 1434
-6
2 1 0 1 -1 7 0 0 -1 0.000 0 0 -1 0 0 2
	 360 1125 2115 1125
2 2 0 1 -1 7 0 0 -1 0.000 0 0 -1 0 0 5
	 540 630 810 630 810 900 540 900 540 630
2 1 0 1 -1 7 0 0 -1 0.000 0 0 -1 0 0 2
	 1575 900 1575 1125
2 1 0 1 -1 7 0 0 -1 0.000 0 0 -1 0 0 2
	 675 900 675 1125
2 2 0 1 -1 7 0 0 -1 0.000 0 0 -1 0 0 5
	 1440 630 1710 630 1710 900 1440 900 1440 630
2 1 0 1 -1 7 0 0 -1 0.000 0 0 -1 0 0 1
	 357 767
2 1 0 1 -1 7 0 0 -1 0.000 0 0 -1 0 0 2
	 360 765 540 765
2 2 0 1 -1 7 0 0 -1 0.000 0 0 -1 0 0 5
	 765 1349 1035 1349 1035 1619 765 1619 765 1349
2 1 0 1 -1 7 0 0 -1 0.000 0 0 -1 0 0 2
	 585 1485 765 1485
2 1 0 1 -1 7 0 0 -1 0.000 0 0 -1 0 0 2
	 900 1125 900 1350
2 2 0 1 -1 7 0 0 -1 0.000 0 0 -1 0 0 5
	 1665 1349 1935 1349 1935 1619 1665 1619 1665 1349
2 1 0 1 -1 7 0 0 -1 0.000 0 0 -1 0 0 2
	 1485 1485 1665 1485
2 1 0 1 -1 7 0 0 -1 0.000 0 0 -1 0 0 2
	 1800 1125 1800 1350
3 2 1 1 -1 7 0 0 -1 2.000 0 0 1 4
	0 0 1.00 40.00 80.00
	 1800 1080 1890 900 1935 630 1800 495
	 0.000 -1.000 -1.000 0.000
3 0 0 1 -1 7 0 0 -1 0.000 0 1 0 8
	1 1 1.00 30.00 60.00
	 630 1440 900 1440 945 1395 945 1215 990 1170 1395 1170
	 1440 1125 1440 945
	 0.000 1.000 1.000 1.000 1.000 1.000 1.000 0.000
3 0 0 1 -1 7 0 0 -1 0.000 0 1 0 11
	1 1 1.00 30.00 60.00
	 405 810 630 810 675 810 720 855 720 900 720 990
	 720 1035 765 1080 810 1080 1305 1080 1395 945
	 0.000 1.000 1.000 1.000 1.000 1.000 1.000 1.000
	 1.000 1.000 0.000
3 0 0 1 -1 7 0 0 -1 0.000 0 1 0 8
	1 1 1.00 30.00 60.00
	 1530 1530 1710 1530 1755 1485 1755 1215 1710 1170 1575 1170
	 1530 1125 1485 945
	 0.000 1.000 1.000 1.000 1.000 1.000 1.000 0.000
3 0 0 1 -1 7 0 0 -1 0.000 0 1 0 4
	1 1 1.00 30.00 60.00
	 1620 855 1620 1035 1665 1080 2115 1080
	 0.000 1.000 1.000 0.000
3 2 1 1 -1 7 0 0 -1 2.000 0 0 1 4
	0 0 1.00 40.00 80.00
	 1035 1080 990 900 990 720 1125 495
	 0.000 -1.000 -1.000 0.000
3 2 1 1 -1 7 0 0 -1 2.000 0 0 1 4
	0 0 1.00 40.00 80.00
	 1170 1170 1080 900 1080 630 1125 495
	 0.000 -1.000 -1.000 0.000
3 2 1 1 -1 7 0 0 -1 2.000 0 0 1 4
	0 0 1.00 40.00 80.00
	 1755 1260 1305 1215 1125 675 1125 495
	 0.000 -1.000 -1.000 0.000
4 1 -1 0 0 16 7 0.0000 4 105 420 1800 450 256 Kb/s\001
4 1 -1 0 0 16 7 0.0000 4 105 315 1125 450 1 Mb/s\001
