#FIG 3.2  Produced by xfig version 3.2.8b
Portrait
Center
Metric
A4
100.00
Single
-3
1200 2
0 32 #c6b797
0 33 #eff8ff
0 34 #dccba6
0 35 #404040
0 36 #808080
0 37 #c0c0c0
0 38 #e0e0e0
0 39 #8e8f8e
0 40 #aaaaaa
0 41 #555555
0 42 #8e8e8e
0 43 #d7d7d7
0 44 #aeaeae
0 45 #bebebe
0 46 #515151
0 47 #e7e3e7
0 48 #000049
0 49 #797979
0 50 #303430
0 51 #414141
0 52 #c7b696
0 53 #414541
0 54 #868286
0 55 #c7c3c7
0 56 #444444
0 57 #868686
0 58 #c7c7c7
0 59 #e7e7e7
0 60 #f7f7f7
0 61 #9e9e9e
0 62 #717571
0 63 #757575
0 64 #effbff
0 65 #f3f3f3
0 66 #d7d3d7
0 67 #aeaaae
0 68 #c2c2c2
0 69 #303030
0 70 #515551
0 71 #f7f3f7
0 72 #666666
0 73 #717171
# Network hub
6 1800 675 4005 990
6 2609 751 3180 894
6 2609 751 2752 894
6 2609 751 2752 894
2 2 0 1 0 0 18 0 20 0.000 0 1 -1 0 0 5
	 2634 776 2727 776 2727 838 2634 838 2634 776
2 2 0 1 0 0 18 0 20 0.000 0 1 -1 0 0 5
	 2665 838 2696 838 2696 869 2665 869 2665 838
-6
-6
6 2752 751 2895 894
6 2752 751 2895 894
2 2 0 1 0 0 18 0 20 0.000 0 1 -1 0 0 5
	 2777 776 2870 776 2870 838 2777 838 2777 776
2 2 0 1 0 0 18 0 20 0.000 0 1 -1 0 0 5
	 2808 838 2838 838 2838 869 2808 869 2808 838
-6
-6
6 2895 751 3038 894
6 2895 751 3038 894
2 2 0 1 0 0 18 0 20 0.000 0 1 -1 0 0 5
	 2919 776 3013 776 3013 838 2919 838 2919 776
2 2 0 1 0 0 18 0 20 0.000 0 1 -1 0 0 5
	 2951 838 2981 838 2981 869 2951 869 2951 838
-6
-6
6 3038 751 3180 894
2 2 0 1 0 0 18 0 20 0.000 0 1 -1 0 0 5
	 3062 776 3156 776 3156 838 3062 838 3062 776
2 2 0 1 0 0 18 0 20 0.000 0 1 -1 0 0 5
	 3094 838 3124 838 3124 869 3094 869 3094 838
-6
2 2 0 0 0 38 19 0 20 2.000 0 1 -1 0 0 5
	 2609 751 3180 751 3180 894 2609 894 2609 751
-6
6 2323 751 2466 894
6 2323 751 2466 894
6 2323 751 2466 894
2 2 0 1 0 0 18 0 20 0.000 0 1 -1 0 0 5
	 2348 776 2441 776 2441 838 2348 838 2348 776
2 2 0 1 0 0 18 0 20 0.000 0 1 -1 0 0 5
	 2379 838 2410 838 2410 869 2379 869 2379 838
-6
-6
2 2 0 0 0 38 19 0 20 2.000 0 1 -1 0 0 5
	 2323 751 2466 751 2466 894 2323 894 2323 751
-6
6 3323 751 3895 894
6 3323 751 3466 894
6 3323 751 3466 894
2 2 0 1 0 0 18 0 20 0.000 0 1 -1 0 0 5
	 3348 776 3441 776 3441 838 3348 838 3348 776
2 2 0 1 0 0 18 0 20 0.000 0 1 -1 0 0 5
	 3380 838 3410 838 3410 869 3380 869 3380 838
-6
-6
6 3466 751 3609 894
6 3466 751 3609 894
2 2 0 1 0 0 18 0 20 0.000 0 1 -1 0 0 5
	 3491 776 3584 776 3584 838 3491 838 3491 776
2 2 0 1 0 0 18 0 20 0.000 0 1 -1 0 0 5
	 3522 838 3553 838 3553 869 3522 869 3522 838
-6
-6
6 3609 751 3752 894
6 3609 751 3752 894
2 2 0 1 0 0 18 0 20 0.000 0 1 -1 0 0 5
	 3634 776 3727 776 3727 838 3634 838 3634 776
2 2 0 1 0 0 18 0 20 0.000 0 1 -1 0 0 5
	 3665 838 3696 838 3696 869 3665 869 3665 838
-6
-6
6 3752 751 3895 894
2 2 0 1 0 0 18 0 20 0.000 0 1 -1 0 0 5
	 3777 776 3870 776 3870 838 3777 838 3777 776
2 2 0 1 0 0 18 0 20 0.000 0 1 -1 0 0 5
	 3808 838 3839 838 3839 869 3808 869 3808 838
-6
2 2 0 0 0 38 19 0 20 2.000 0 1 -1 0 0 5
	 3323 751 3895 751 3895 894 3323 894 3323 751
-6
6 1966 751 2323 894
6 1966 751 2252 894
2 1 0 2 0 0 18 0 -1 6.000 0 1 7 0 0 1
	 2049 801
2 1 0 2 0 0 18 0 -1 6.000 0 1 7 0 0 1
	 2091 801
2 1 0 2 0 0 18 0 -1 6.000 0 1 7 0 0 1
	 2133 801
2 1 0 2 0 0 18 0 -1 6.000 0 1 7 0 0 1
	 2175 801
2 1 0 2 0 0 18 0 -1 6.000 0 1 7 0 0 1
	 2217 801
2 1 0 2 0 0 18 0 -1 6.000 0 1 7 0 0 1
	 2071 842
2 1 0 2 0 0 18 0 -1 6.000 0 1 7 0 0 1
	 2112 842
2 1 0 2 0 0 18 0 -1 6.000 0 1 7 0 0 1
	 2154 842
2 1 0 2 0 0 18 0 -1 6.000 0 1 7 0 0 1
	 2195 842
-6
1 3 0 1 0 0 19 0 -1 0.000 1 0.0000 1987 822 20 20 1987 822 1966 822
1 3 0 1 0 0 19 0 -1 0.000 1 0.0000 2278 822 20 20 2278 822 2257 822
3 5 0 1 0 38 19 0 20 0.000 1 0 0 8
	 2029 770 2008 770 2029 874 2049 874 2217 874 2237 874
	 2257 770 2237 770
	 0.000 1.000 1.000 0.000 0.000 1.000 1.000 0.000
-6
2 2 0 1 0 37 20 0 20 0.000 0 1 -1 0 0 5
	 1823 680 3966 680 3966 965 1823 965 1823 680
-6
# Desktop computer
6 1125 2025 2013 3150
6 1198 2043 1949 2732
2 2 0 1 0 38 20 0 20 0.000 2 0 7 0 0 5
	 1198 2043 1949 2043 1949 2670 1198 2670 1198 2043
2 2 0 0 0 35 19 0 22 0.000 1 0 -1 0 0 5
	 1793 2106 1730 2106 1730 2607 1793 2607 1793 2106
2 2 0 0 0 35 19 0 24 0.000 1 0 -1 0 0 5
	 1730 2106 1668 2106 1668 2607 1730 2607 1730 2106
2 2 0 0 0 35 19 0 26 0.000 1 0 -1 0 0 5
	 1668 2106 1574 2106 1574 2607 1668 2607 1668 2106
2 2 0 0 0 35 19 0 28 0.000 1 0 -1 0 0 5
	 1574 2106 1480 2106 1480 2607 1574 2607 1574 2106
2 2 0 0 0 35 19 0 30 0.000 1 0 -1 0 0 5
	 1480 2106 1417 2106 1417 2607 1480 2607 1480 2106
2 2 0 0 0 35 19 0 33 0.000 1 0 -1 0 0 5
	 1417 2106 1354 2106 1354 2607 1417 2607 1417 2106
2 2 0 0 0 35 19 0 33 0.000 1 0 -1 0 0 5
	 1354 2106 1292 2106 1292 2607 1354 2607 1354 2106
2 2 0 1 0 36 20 0 20 0.000 2 0 7 0 0 5
	 1417 2670 1730 2670 1730 2701 1417 2701 1417 2670
2 2 0 1 0 36 20 0 20 0.000 2 0 -1 0 0 5
	 1386 2701 1762 2701 1762 2732 1386 2732 1386 2701
2 2 0 0 0 35 19 0 20 0.000 1 0 7 0 0 5
	 1856 2106 1793 2106 1793 2607 1856 2607 1856 2106
3 5 0 0 0 37 18 0 20 0.000 0 0 0 4
	 1261 2106 1261 2607 1292 2576 1292 2137
	 0.000 0.000 0.000 0.000
3 5 0 0 0 7 18 0 20 0.000 0 0 0 5
	 1261 2607 1292 2576 1580 2589 1856 2576 1887 2607
	 0.000 0.000 -1.000 0.000 0.000
3 5 0 0 0 37 18 0 20 0.000 0 0 0 4
	 1887 2106 1887 2607 1856 2576 1856 2137
	 0.000 0.000 0.000 0.000
3 5 0 0 0 36 18 0 20 0.000 0 0 0 5
	 1261 2106 1292 2137 1580 2125 1856 2137 1887 2106
	 0.000 0.000 -1.000 0.000 0.000
-6
6 1135 2952 2012 3140
2 3 0 1 0 38 20 0 20 0.000 2 0 7 0 0 7
	 1229 2952 1918 2952 2012 3109 2012 3140 1135 3140 1135 3109
	 1229 2952
2 1 0 1 0 37 19 0 20 0.000 2 0 -1 0 0 4
	 1135 3109 1135 3140 2012 3140 2012 3109
2 3 0 0 0 7 19 0 20 0.000 2 0 -1 0 0 5
	 1261 2983 1198 3077 1762 3077 1730 2983 1261 2983
2 2 0 0 0 36 18 0 20 0.000 2 0 -1 0 0 5
	 1198 3077 1762 3077 1762 3089 1198 3089 1198 3077
2 3 0 0 0 37 18 0 20 0.000 2 0 -1 0 0 9
	 1249 2983 1198 3077 1292 3077 1305 3046 1283 3046 1296 3014
	 1275 3014 1292 2983 1249 2983
2 3 0 0 0 37 18 0 20 0.000 2 0 -1 0 0 10
	 1762 3077 1668 3077 1668 3046 1688 3046 1685 3014 1699 3014
	 1703 3014 1697 2983 1736 2983 1762 3077
2 3 0 0 0 7 19 0 20 0.000 2 0 -1 0 0 5
	 1887 2983 1762 2983 1793 3077 1949 3077 1887 2983
2 3 0 0 0 37 18 0 20 0.000 2 0 -1 0 0 7
	 1949 3077 1921 3077 1887 3002 1767 3002 1761 2983 1900 2983
	 1949 3077
2 2 0 0 0 36 18 0 20 0.000 2 0 -1 0 0 5
	 1793 3077 1949 3077 1949 3088 1793 3088 1793 3077
2 3 0 0 0 36 18 0 20 0.000 2 0 -1 0 0 5
	 1793 3078 1792 3089 1761 2993 1761 2984 1793 3078
-6
6 1213 2732 1934 2921
6 1677 2765 1896 2828
6 1677 2765 1896 2828
2 1 0 1 36 -1 19 0 -1 0.000 2 0 -1 0 0 5
	 1677 2796 1677 2781 1745 2781 1745 2765 1828 2765
2 1 0 1 36 -1 19 0 -1 0.000 2 0 -1 0 0 3
	 1745 2828 1745 2796 1828 2796
2 1 0 1 36 -1 19 0 -1 0.000 2 0 -1 0 0 2
	 1828 2781 1896 2781
2 1 0 1 7 -1 19 0 -1 0.000 2 0 -1 0 0 2
	 1828 2765 1828 2781
2 1 0 1 7 -1 19 0 -1 0.000 2 0 -1 0 0 2
	 1677 2796 1745 2796
2 1 0 1 7 -1 19 0 -1 0.000 2 0 -1 0 0 5
	 1745 2828 1828 2828 1828 2796 1896 2796 1896 2781
2 1 0 1 36 -1 19 0 -1 0.000 2 0 -1 0 0 3
	 1845 2828 1879 2828 1879 2812
2 1 0 1 7 -1 19 0 -1 0.000 2 0 -1 0 0 3
	 1845 2828 1845 2812 1879 2812
-6
-6
2 2 0 1 0 35 20 0 20 0.000 2 0 -1 0 0 5
	 1213 2921 1307 2921 1307 2904 1213 2904 1213 2921
2 2 0 1 0 35 20 0 20 0.000 2 0 -1 0 0 5
	 1840 2921 1934 2921 1934 2904 1840 2904 1840 2921
2 2 0 1 0 38 20 0 20 0.000 2 0 -1 0 0 5
	 1213 2732 1934 2732 1934 2906 1213 2906 1213 2732
-6
-6
# Desktop computer
6 2712 2025 3600 3150
6 2785 2043 3536 2732
2 2 0 1 0 38 20 0 20 0.000 2 0 7 0 0 5
	 2785 2043 3536 2043 3536 2670 2785 2670 2785 2043
2 2 0 0 0 35 19 0 22 0.000 1 0 -1 0 0 5
	 3380 2106 3317 2106 3317 2607 3380 2607 3380 2106
2 2 0 0 0 35 19 0 24 0.000 1 0 -1 0 0 5
	 3317 2106 3255 2106 3255 2607 3317 2607 3317 2106
2 2 0 0 0 35 19 0 26 0.000 1 0 -1 0 0 5
	 3255 2106 3161 2106 3161 2607 3255 2607 3255 2106
2 2 0 0 0 35 19 0 28 0.000 1 0 -1 0 0 5
	 3161 2106 3067 2106 3067 2607 3161 2607 3161 2106
2 2 0 0 0 35 19 0 30 0.000 1 0 -1 0 0 5
	 3067 2106 3004 2106 3004 2607 3067 2607 3067 2106
2 2 0 0 0 35 19 0 33 0.000 1 0 -1 0 0 5
	 3004 2106 2941 2106 2941 2607 3004 2607 3004 2106
2 2 0 0 0 35 19 0 33 0.000 1 0 -1 0 0 5
	 2941 2106 2879 2106 2879 2607 2941 2607 2941 2106
2 2 0 1 0 36 20 0 20 0.000 2 0 7 0 0 5
	 3004 2670 3317 2670 3317 2701 3004 2701 3004 2670
2 2 0 1 0 36 20 0 20 0.000 2 0 -1 0 0 5
	 2973 2701 3349 2701 3349 2732 2973 2732 2973 2701
2 2 0 0 0 35 19 0 20 0.000 1 0 7 0 0 5
	 3443 2106 3380 2106 3380 2607 3443 2607 3443 2106
3 5 0 0 0 37 18 0 20 0.000 0 0 0 4
	 2848 2106 2848 2607 2879 2576 2879 2137
	 0.000 0.000 0.000 0.000
3 5 0 0 0 7 18 0 20 0.000 0 0 0 5
	 2848 2607 2879 2576 3167 2589 3443 2576 3474 2607
	 0.000 0.000 -1.000 0.000 0.000
3 5 0 0 0 37 18 0 20 0.000 0 0 0 4
	 3474 2106 3474 2607 3443 2576 3443 2137
	 0.000 0.000 0.000 0.000
3 5 0 0 0 36 18 0 20 0.000 0 0 0 5
	 2848 2106 2879 2137 3167 2125 3443 2137 3474 2106
	 0.000 0.000 -1.000 0.000 0.000
-6
6 2722 2952 3599 3140
2 3 0 1 0 38 20 0 20 0.000 2 0 7 0 0 7
	 2816 2952 3505 2952 3599 3109 3599 3140 2722 3140 2722 3109
	 2816 2952
2 1 0 1 0 37 19 0 20 0.000 2 0 -1 0 0 4
	 2722 3109 2722 3140 3599 3140 3599 3109
2 3 0 0 0 7 19 0 20 0.000 2 0 -1 0 0 5
	 2848 2983 2785 3077 3349 3077 3317 2983 2848 2983
2 2 0 0 0 36 18 0 20 0.000 2 0 -1 0 0 5
	 2785 3077 3349 3077 3349 3089 2785 3089 2785 3077
2 3 0 0 0 37 18 0 20 0.000 2 0 -1 0 0 9
	 2836 2983 2785 3077 2879 3077 2892 3046 2870 3046 2883 3014
	 2862 3014 2879 2983 2836 2983
2 3 0 0 0 37 18 0 20 0.000 2 0 -1 0 0 10
	 3349 3077 3255 3077 3255 3046 3275 3046 3272 3014 3286 3014
	 3290 3014 3284 2983 3323 2983 3349 3077
2 3 0 0 0 7 19 0 20 0.000 2 0 -1 0 0 5
	 3474 2983 3349 2983 3380 3077 3536 3077 3474 2983
2 3 0 0 0 37 18 0 20 0.000 2 0 -1 0 0 7
	 3536 3077 3508 3077 3474 3002 3354 3002 3348 2983 3487 2983
	 3536 3077
2 2 0 0 0 36 18 0 20 0.000 2 0 -1 0 0 5
	 3380 3077 3536 3077 3536 3088 3380 3088 3380 3077
2 3 0 0 0 36 18 0 20 0.000 2 0 -1 0 0 5
	 3380 3078 3379 3089 3348 2993 3348 2984 3380 3078
-6
6 2800 2732 3521 2921
6 3264 2765 3483 2828
6 3264 2765 3483 2828
2 1 0 1 36 -1 19 0 -1 0.000 2 0 -1 0 0 5
	 3264 2796 3264 2781 3332 2781 3332 2765 3415 2765
2 1 0 1 36 -1 19 0 -1 0.000 2 0 -1 0 0 3
	 3332 2828 3332 2796 3415 2796
2 1 0 1 36 -1 19 0 -1 0.000 2 0 -1 0 0 2
	 3415 2781 3483 2781
2 1 0 1 7 -1 19 0 -1 0.000 2 0 -1 0 0 2
	 3415 2765 3415 2781
2 1 0 1 7 -1 19 0 -1 0.000 2 0 -1 0 0 2
	 3264 2796 3332 2796
2 1 0 1 7 -1 19 0 -1 0.000 2 0 -1 0 0 5
	 3332 2828 3415 2828 3415 2796 3483 2796 3483 2781
2 1 0 1 36 -1 19 0 -1 0.000 2 0 -1 0 0 3
	 3432 2828 3466 2828 3466 2812
2 1 0 1 7 -1 19 0 -1 0.000 2 0 -1 0 0 3
	 3432 2828 3432 2812 3466 2812
-6
-6
2 2 0 1 0 35 20 0 20 0.000 2 0 -1 0 0 5
	 2800 2921 2894 2921 2894 2904 2800 2904 2800 2921
2 2 0 1 0 35 20 0 20 0.000 2 0 -1 0 0 5
	 3427 2921 3521 2921 3521 2904 3427 2904 3427 2921
2 2 0 1 0 38 20 0 20 0.000 2 0 -1 0 0 5
	 2800 2732 3521 2732 3521 2906 2800 2906 2800 2732
-6
-6
# Desktop computer
6 4287 2025 5175 3150
6 4360 2043 5111 2732
2 2 0 1 0 38 20 0 20 0.000 2 0 7 0 0 5
	 4360 2043 5111 2043 5111 2670 4360 2670 4360 2043
2 2 0 0 0 35 19 0 22 0.000 1 0 -1 0 0 5
	 4955 2106 4892 2106 4892 2607 4955 2607 4955 2106
2 2 0 0 0 35 19 0 24 0.000 1 0 -1 0 0 5
	 4892 2106 4830 2106 4830 2607 4892 2607 4892 2106
2 2 0 0 0 35 19 0 26 0.000 1 0 -1 0 0 5
	 4830 2106 4736 2106 4736 2607 4830 2607 4830 2106
2 2 0 0 0 35 19 0 28 0.000 1 0 -1 0 0 5
	 4736 2106 4642 2106 4642 2607 4736 2607 4736 2106
2 2 0 0 0 35 19 0 30 0.000 1 0 -1 0 0 5
	 4642 2106 4579 2106 4579 2607 4642 2607 4642 2106
2 2 0 0 0 35 19 0 33 0.000 1 0 -1 0 0 5
	 4579 2106 4516 2106 4516 2607 4579 2607 4579 2106
2 2 0 0 0 35 19 0 33 0.000 1 0 -1 0 0 5
	 4516 2106 4454 2106 4454 2607 4516 2607 4516 2106
2 2 0 1 0 36 20 0 20 0.000 2 0 7 0 0 5
	 4579 2670 4892 2670 4892 2701 4579 2701 4579 2670
2 2 0 1 0 36 20 0 20 0.000 2 0 -1 0 0 5
	 4548 2701 4924 2701 4924 2732 4548 2732 4548 2701
2 2 0 0 0 35 19 0 20 0.000 1 0 7 0 0 5
	 5018 2106 4955 2106 4955 2607 5018 2607 5018 2106
3 5 0 0 0 37 18 0 20 0.000 0 0 0 4
	 4423 2106 4423 2607 4454 2576 4454 2137
	 0.000 0.000 0.000 0.000
3 5 0 0 0 7 18 0 20 0.000 0 0 0 5
	 4423 2607 4454 2576 4742 2589 5018 2576 5049 2607
	 0.000 0.000 -1.000 0.000 0.000
3 5 0 0 0 37 18 0 20 0.000 0 0 0 4
	 5049 2106 5049 2607 5018 2576 5018 2137
	 0.000 0.000 0.000 0.000
3 5 0 0 0 36 18 0 20 0.000 0 0 0 5
	 4423 2106 4454 2137 4742 2125 5018 2137 5049 2106
	 0.000 0.000 -1.000 0.000 0.000
-6
6 4297 2952 5174 3140
2 3 0 1 0 38 20 0 20 0.000 2 0 7 0 0 7
	 4391 2952 5080 2952 5174 3109 5174 3140 4297 3140 4297 3109
	 4391 2952
2 1 0 1 0 37 19 0 20 0.000 2 0 -1 0 0 4
	 4297 3109 4297 3140 5174 3140 5174 3109
2 3 0 0 0 7 19 0 20 0.000 2 0 -1 0 0 5
	 4423 2983 4360 3077 4924 3077 4892 2983 4423 2983
2 2 0 0 0 36 18 0 20 0.000 2 0 -1 0 0 5
	 4360 3077 4924 3077 4924 3089 4360 3089 4360 3077
2 3 0 0 0 37 18 0 20 0.000 2 0 -1 0 0 9
	 4411 2983 4360 3077 4454 3077 4467 3046 4445 3046 4458 3014
	 4437 3014 4454 2983 4411 2983
2 3 0 0 0 37 18 0 20 0.000 2 0 -1 0 0 10
	 4924 3077 4830 3077 4830 3046 4850 3046 4847 3014 4861 3014
	 4865 3014 4859 2983 4898 2983 4924 3077
2 3 0 0 0 7 19 0 20 0.000 2 0 -1 0 0 5
	 5049 2983 4924 2983 4955 3077 5111 3077 5049 2983
2 3 0 0 0 37 18 0 20 0.000 2 0 -1 0 0 7
	 5111 3077 5083 3077 5049 3002 4929 3002 4923 2983 5062 2983
	 5111 3077
2 2 0 0 0 36 18 0 20 0.000 2 0 -1 0 0 5
	 4955 3077 5111 3077 5111 3088 4955 3088 4955 3077
2 3 0 0 0 36 18 0 20 0.000 2 0 -1 0 0 5
	 4955 3078 4954 3089 4923 2993 4923 2984 4955 3078
-6
6 4375 2732 5096 2921
6 4839 2765 5058 2828
6 4839 2765 5058 2828
2 1 0 1 36 -1 19 0 -1 0.000 2 0 -1 0 0 5
	 4839 2796 4839 2781 4907 2781 4907 2765 4990 2765
2 1 0 1 36 -1 19 0 -1 0.000 2 0 -1 0 0 3
	 4907 2828 4907 2796 4990 2796
2 1 0 1 36 -1 19 0 -1 0.000 2 0 -1 0 0 2
	 4990 2781 5058 2781
2 1 0 1 7 -1 19 0 -1 0.000 2 0 -1 0 0 2
	 4990 2765 4990 2781
2 1 0 1 7 -1 19 0 -1 0.000 2 0 -1 0 0 2
	 4839 2796 4907 2796
2 1 0 1 7 -1 19 0 -1 0.000 2 0 -1 0 0 5
	 4907 2828 4990 2828 4990 2796 5058 2796 5058 2781
2 1 0 1 36 -1 19 0 -1 0.000 2 0 -1 0 0 3
	 5007 2828 5041 2828 5041 2812
2 1 0 1 7 -1 19 0 -1 0.000 2 0 -1 0 0 3
	 5007 2828 5007 2812 5041 2812
-6
-6
2 2 0 1 0 35 20 0 20 0.000 2 0 -1 0 0 5
	 4375 2921 4469 2921 4469 2904 4375 2904 4375 2921
2 2 0 1 0 35 20 0 20 0.000 2 0 -1 0 0 5
	 5002 2921 5096 2921 5096 2904 5002 2904 5002 2921
2 2 0 1 0 38 20 0 20 0.000 2 0 -1 0 0 5
	 4375 2732 5096 2732 5096 2906 4375 2906 4375 2732
-6
-6
2 1 0 1 0 7 15 -1 -1 0.000 0 0 -1 0 0 2
	 1575 2025 2700 810
2 1 0 1 0 7 15 -1 -1 0.000 0 0 -1 0 0 2
	 3150 2025 2970 810
2 1 0 1 0 7 15 -1 -1 0.000 0 0 -1 0 0 2
	 4725 2025 3395 784
2 2 0 1 0 31 51 -1 38 0.000 0 0 -1 0 0 5
	 180 540 1440 540 1440 1620 180 1620 180 540
2 2 0 1 0 0 52 -1 20 0.000 0 0 -1 0 0 5
	 225 585 1485 585 1485 1665 225 1665 225 585
2 1 0 1 0 7 50 -1 -1 0.000 0 0 -1 1 0 2
	1 1 1.00 60.00 120.00
	 4500 1620 4095 1215
2 1 0 1 0 7 50 -1 -1 0.000 0 0 -1 0 0 4
	 4455 1170 4455 1395 6705 1395 6705 1170
2 2 0 0 0 11 51 -1 34 0.000 0 0 -1 0 0 5
	 4455 1170 6705 1170 6705 1395 4455 1395 4455 1170
2 2 0 0 0 0 52 -1 20 0.000 0 0 -1 0 0 5
	 4500 1215 6750 1215 6750 1440 4500 1440 4500 1215
4 1 0 50 -1 16 9 0.0000 4 105 90 2700 630 1\001
4 1 0 50 -1 16 9 0.0000 4 105 90 2835 630 2\001
4 1 0 50 -1 16 9 0.0000 4 105 90 2970 630 3\001
4 1 0 50 -1 16 9 0.0000 4 105 90 3105 630 4\001
4 1 0 50 -1 16 9 0.0000 4 105 90 3555 630 6\001
4 1 0 50 -1 16 9 0.0000 4 105 90 3690 630 7\001
4 1 0 50 -1 16 9 0.0000 4 105 90 3825 630 8\001
4 1 0 50 -1 16 9 0.0000 4 105 90 3420 630 5\001
4 0 0 50 -1 16 10 0.0000 6 120 525 225 915 Port 2 :\001
4 0 0 50 -1 16 10 0.0000 6 150 1035 225 1110 Port 3 : Eth(B)\001
4 0 0 50 -1 16 10 0.0000 6 120 525 225 1305 Port 4 :\001
4 0 0 50 -1 16 10 0.0000 6 150 1035 225 720 Port 1 : Eth(A)\001
4 0 0 50 -1 16 10 0.0000 6 150 1035 225 1500 Port 5 : Eth(P)\001
4 1 0 50 -1 16 10 0.0000 6 120 105 1575 1935 A\001
4 1 0 50 -1 16 10 0.0000 6 120 105 4725 1890 P\001
4 1 0 50 -1 16 10 0.0000 6 120 105 3240 1890 B\001
4 0 0 50 -1 16 10 0.0000 6 150 1170 4500 1305 Eth(A) -> Eth(P)\001
4 1 0 50 -1 16 10 0.0000 6 120 1140 5580 1575 Trame Ethernet\001
