#FIG 3.2  Produced by xfig version 3.2.5c
Landscape
Center
Metric
A4      
100.00
Single
-2
1200 2
0 32 #c6b797
0 33 #eff8ff
0 34 #dccba6
0 35 #404040
0 36 #808080
0 37 #c0c0c0
0 38 #e0e0e0
0 39 #8e8f8e
0 40 #aaaaaa
0 41 #555555
0 42 #bebebe
0 43 #515151
0 44 #e7e3e7
0 45 #000049
0 46 #797979
0 47 #303430
0 48 #414141
0 49 #c7b696
0 50 #8e8e8e
0 51 #414541
0 52 #8e8e8e
0 53 #909090
0 54 #e6e4ce
0 55 #9b9b9b
0 56 #ce9100
0 57 #f762aa
0 58 #7070ff
0 59 #5f5f5f
0 60 #e2e2ee
0 61 #94949a
0 62 #dbdbdb
0 63 #a1a1b7
0 64 #9c0000
0 65 #ededed
0 66 #86acff
0 67 #444444
0 68 #cccccc
0 69 #fff2d3
0 70 #ffe4ae
0 71 #ffd279
0 72 #cfcfcf
0 73 #999999
0 74 #b2b2b2
0 75 #868286
0 76 #c7c3c7
0 77 #868686
0 78 #c7c7c7
0 79 #e7e7e7
0 80 #f7f7f7
0 81 #9e9e9e
0 82 #717571
0 83 #effbff
0 84 #666666
6 1500 1755 1980 2115
1 1 0 1 0 25 50 0 36 0.000 1 0.0000 1548 1899 46 10 1548 1899 1594 1899
2 1 0 1 0 7 50 0 -1 0.000 0 0 -1 0 0 3
	 1692 1947 1596 1947 1596 1899
2 3 0 1 0 25 50 0 36 0.000 0 0 -1 0 0 15
	 1620 1755 1956 1755 1884 1875 1884 2019 1836 2019 1836 2067
	 1812 2067 1812 2091 1764 2091 1764 2067 1740 2067 1740 2019
	 1692 2019 1692 1875 1620 1755
2 3 0 1 0 0 51 0 20 0.000 0 0 -1 0 0 15
	 1644 1779 1980 1779 1908 1899 1908 2043 1860 2043 1860 2091
	 1836 2091 1836 2115 1788 2115 1788 2091 1764 2091 1764 2043
	 1716 2043 1716 1899 1644 1779
-6
6 1710 2430 2205 2700
1 3 0 1 0 31 51 -1 30 0.000 1 0.0000 1800 2520 90 90 1800 2520 1890 2520
1 3 0 1 0 0 52 -1 20 0.000 1 0.0000 1855 2570 90 90 1855 2570 1945 2570
2 1 0 1 0 7 50 -1 -1 4.000 0 0 -1 0 0 2
	 1800 2430 1800 2610
2 1 0 1 0 7 50 -1 -1 4.000 0 0 -1 0 0 5
	 1710 2520 1755 2520 1800 2520 1845 2520 1890 2520
4 0 0 50 -1 16 8 0.0000 4 75 195 1980 2565 xor\001
-6
6 1710 2970 2205 3240
1 3 0 1 0 31 51 -1 30 0.000 1 0.0000 1800 3060 90 90 1800 3060 1890 3060
1 3 0 1 0 0 52 -1 20 0.000 1 0.0000 1855 3110 90 90 1855 3110 1945 3110
2 1 0 1 0 7 50 -1 -1 4.000 0 0 -1 0 0 2
	 1800 2970 1800 3150
2 1 0 1 0 7 50 -1 -1 4.000 0 0 -1 0 0 5
	 1710 3060 1755 3060 1800 3060 1845 3060 1890 3060
4 0 0 50 -1 16 8 0.0000 4 75 195 1980 3105 xor\001
-6
6 180 3600 3375 3825
2 1 0 1 0 7 50 -1 -1 4.000 0 0 -1 0 0 2
	 495 3600 495 3780
2 2 0 1 0 1 51 -1 38 0.000 0 0 -1 0 0 5
	 180 3600 3330 3600 3330 3780 180 3780 180 3600
2 2 0 1 0 0 52 -1 20 0.000 0 0 -1 0 0 5
	 225 3645 3375 3645 3375 3825 225 3825 225 3645
4 1 0 50 -1 16 6 0.0000 4 75 60 360 3735 7\001
4 1 0 50 -1 16 6 0.0000 4 75 120 1800 3735 25\001
-6
2 1 0 1 0 7 50 -1 -1 0.000 0 0 -1 0 0 2
	 450 630 1350 630
2 1 0 1 0 7 50 -1 -1 0.000 0 0 -1 0 0 2
	 450 810 1350 810
2 1 0 1 0 7 50 -1 -1 0.000 0 0 -1 0 0 2
	 450 990 1350 990
2 1 0 1 0 7 50 -1 -1 0.000 0 0 -1 0 0 2
	 450 1440 1350 1440
2 1 2 1 0 7 50 -1 -1 3.000 0 0 -1 0 0 2
	 900 1080 900 1350
2 2 0 1 0 19 51 -1 36 0.000 0 0 -1 0 0 5
	 450 450 1350 450 1350 1620 450 1620 450 450
2 2 0 1 0 0 52 -1 20 0.000 0 0 -1 0 0 5
	 495 495 1395 495 1395 1665 495 1665 495 495
2 2 0 1 0 1 51 -1 38 0.000 0 0 7 0 0 5
	 2160 630 3060 630 3060 810 2160 810 2160 630
2 2 0 1 0 1 51 -1 38 0.000 0 0 7 0 0 5
	 2160 900 3060 900 3060 1080 2160 1080 2160 900
2 2 0 1 0 1 51 -1 38 0.000 0 0 7 0 0 5
	 3150 630 3600 630 3600 810 3150 810 3150 630
2 2 0 1 0 1 51 -1 38 0.000 0 0 7 0 0 5
	 3150 900 3600 900 3600 1080 3150 1080 3150 900
2 2 0 1 0 0 52 -1 20 0.000 0 0 7 0 0 5
	 2205 675 3105 675 3105 855 2205 855 2205 675
2 2 0 1 0 0 52 -1 20 0.000 0 0 7 0 0 5
	 2205 945 3105 945 3105 1125 2205 1125 2205 945
2 2 0 1 0 0 52 -1 20 0.000 0 0 7 0 0 5
	 3195 945 3645 945 3645 1125 3195 1125 3195 945
2 2 0 1 0 0 52 -1 20 0.000 0 0 7 0 0 5
	 3195 675 3645 675 3645 855 3195 855 3195 675
2 1 0 1 0 7 50 -1 -1 4.000 0 0 -1 0 0 2
	 3060 1800 3600 1800
2 1 0 1 0 7 50 -1 -1 4.000 0 0 -1 0 0 2
	 3060 1980 3600 1980
2 1 0 1 0 7 50 -1 -1 4.000 0 0 -1 0 0 2
	 3060 2160 3600 2160
2 2 0 1 0 13 51 -1 36 0.000 0 0 -1 0 0 5
	 3060 1620 3600 1620 3600 2340 3060 2340 3060 1620
2 2 0 1 0 0 52 -1 20 0.000 0 0 -1 0 0 5
	 3105 1665 3645 1665 3645 2385 3105 2385 3105 1665
2 2 0 1 0 22 51 -1 36 0.000 0 0 -1 0 0 5
	 2610 2745 3510 2745 3510 2925 2610 2925 2610 2745
2 2 0 1 0 0 52 -1 20 0.000 0 0 -1 0 0 5
	 2655 2790 3555 2790 3555 2970 2655 2970 2655 2790
3 0 0 1 0 7 50 -1 -1 4.000 0 1 0 5
	1 1 1.00 60.00 120.00
	 315 945 180 945 180 2340 450 2970 360 3555
	 0.000 1.000 1.000 1.000 0.000
3 0 0 1 0 7 50 -1 -1 4.000 0 1 0 3
	1 1 1.00 60.00 120.00
	 1800 2070 1710 2160 1755 2385
	 0.000 1.000 0.000
3 0 0 1 0 7 50 -1 -1 4.000 0 1 0 3
	1 1 1.00 60.00 120.00
	 1800 2655 1755 2700 1800 2925
	 0.000 1.000 0.000
3 0 0 1 0 7 50 -1 -1 4.000 0 1 0 5
	1 1 1.00 60.00 120.00
	 2610 2835 2430 2835 2250 2610 1935 2700 1845 2925
	 0.000 1.000 1.000 1.000 0.000
3 0 0 1 0 7 50 -1 -1 4.000 0 1 0 6
	1 1 1.00 60.00 120.00
	 900 900 675 1035 675 1710 1710 1350 1710 1530 1710 1755
	 0.000 1.000 1.000 1.000 1.000 0.000
3 0 0 1 0 7 50 -1 -1 4.000 0 1 0 5
	1 1 1.00 60.00 120.00
	 2790 1125 2790 1530 1890 1350 1890 1530 1890 1755
	 0.000 1.000 1.000 1.000 0.000
3 0 0 1 0 7 50 -1 -1 4.000 0 1 0 4
	1 1 1.00 60.00 120.00
	 2925 1890 2475 1890 1935 2115 1845 2385
	 0.000 1.000 1.000 0.000
3 0 0 1 0 7 50 -1 -1 4.000 0 1 0 2
	1 1 1.00 60.00 120.00
	 1800 3195 1800 3555
	 0.000 0.000
4 2 0 50 -1 16 6 0.0000 4 75 180 405 1575 127\001
4 0 0 50 -1 16 6 0.0000 4 90 360 1440 585 chaque\001
4 0 0 50 -1 16 6 0.0000 4 75 390 1440 720 \351l\351ment\001
4 0 0 50 -1 16 6 0.0000 4 75 150 1440 855 est\001
4 0 0 50 -1 16 6 0.0000 4 105 420 1440 990 reg\351n\351r\351\001
4 0 0 50 -1 16 6 0.0000 4 75 480 1440 1125 toutes les\001
4 0 0 50 -1 16 6 0.0000 4 75 150 1440 1260 4 s\001
4 2 0 50 -1 16 6 0.0000 4 75 60 405 585 0\001
4 2 0 50 -1 16 6 0.0000 4 75 60 405 765 1\001
4 2 0 50 -1 16 6 0.0000 4 75 60 405 945 2\001
4 1 0 50 -1 16 6 0.0000 4 75 495 2610 1035 IP serveur\001
4 1 0 50 -1 16 6 0.0000 4 90 360 3375 1035 port srv\001
4 1 0 50 -1 16 8 0.0000 4 105 1095 900 405 secrets / 128 bits\001
4 2 0 50 -1 16 8 0.0000 4 135 1575 3555 450 Impl\351mentation FreeBSD\001
4 1 0 50 -1 16 6 0.0000 4 75 405 2610 765 IP client\001
4 1 0 50 -1 16 6 0.0000 4 90 330 3375 765 port clt\001
4 1 0 50 -1 16 6 0.0000 4 75 720 3060 2700 initial du client\001
4 1 0 50 -1 16 6 0.0000 4 90 1020 3060 2565 num\351ro de s\351quence\001
4 0 0 50 -1 16 6 0.0000 4 75 750 2205 2115 index sur 2 bits\001
4 0 0 50 -1 16 8 0.0000 4 105 300 1935 1980 MD5\001
4 1 0 50 -1 16 8 0.0000 4 105 300 3330 1575 MSS\001
4 2 0 50 -1 16 6 0.0000 4 75 60 3015 1755 0\001
4 2 0 50 -1 16 6 0.0000 4 75 60 3015 1935 1\001
4 2 0 50 -1 16 6 0.0000 4 75 60 3015 2115 2\001
4 2 0 50 -1 16 6 0.0000 4 75 60 3015 2295 3\001
4 0 0 50 -1 16 6 0.0000 4 75 870 1845 3330 25 bits seulement\001
4 0 0 50 -1 16 6 0.0000 4 75 750 225 1890 index sur 7 bits\001
4 0 0 50 -1 16 8 0.0000 4 105 225 3420 3735 ack\001
