#FIG 3.2  Produced by xfig version 3.2.5c
Portrait
Center
Metric
A4      
100.00
Single
-2
1200 2
2 1 0 1 -1 -1 50 0 -1 0.000 0 0 -1 0 0 2
	 225 450 3825 450
2 1 0 1 -1 -1 50 0 -1 0.000 0 0 -1 0 0 2
	 225 900 3825 900
2 1 0 1 -1 -1 50 0 -1 0.000 0 0 -1 0 0 2
	 225 1350 3825 1350
2 1 0 1 -1 -1 50 0 -1 0.000 0 0 -1 0 0 2
	 225 675 3825 675
2 1 0 1 -1 -1 50 0 -1 0.000 0 0 -1 0 0 2
	 2025 225 2025 900
2 1 0 1 -1 -1 50 0 -1 0.000 0 0 -1 0 0 2
	 225 1800 3825 1800
2 1 0 1 -1 -1 50 0 -1 0.000 0 0 -1 0 0 2
	 225 2250 3825 2250
2 2 0 1 0 6 51 -1 38 0.000 0 0 -1 0 0 5
	 225 225 3825 225 3825 2700 225 2700 225 225
2 2 0 1 0 0 52 -1 20 0.000 0 0 -1 0 0 5
	 270 270 3870 270 3870 2745 270 2745 270 270
4 1 -1 50 0 16 8 0.0000 4 105 720 2925 405 Parameters\001
4 1 -1 50 0 16 8 0.0000 4 105 960 2925 630 Nb. of answers\001
4 1 -1 50 0 16 8 0.0000 4 105 1020 2925 855 Nb. of additional\001
4 1 -1 50 0 16 8 0.0000 4 105 1050 2025 1170 Question section\001
4 1 -1 50 0 16 8 0.0000 4 105 960 2025 1620 Answer section\001
4 1 -1 50 0 16 8 0.0000 4 135 1050 2025 2070 Authority section\001
4 1 -1 50 0 16 8 0.0000 4 105 1830 2025 2520 Additional information section\001
4 1 -1 50 0 16 8 0.0000 4 135 975 1125 855 Nb. of authority\001
4 1 -1 50 0 16 8 0.0000 4 135 1305 1125 630 Number of questions\001
4 1 -1 50 0 16 8 0.0000 4 105 795 1125 405 Identification\001
4 2 -1 50 0 16 8 0.0000 4 90 150 3825 180 31\001
4 0 -1 50 0 16 8 0.0000 4 90 150 2925 180 24\001
4 0 -1 50 0 16 8 0.0000 4 90 150 2025 180 16\001
4 0 -1 50 0 16 8 0.0000 4 90 75 1125 180 8\001
4 0 -1 50 0 16 8 0.0000 4 90 75 225 180 0\001
