#FIG 3.2  Produced by xfig version 3.2.5c
Portrait
Center
Metric
A4      
100.00
Single
-2
1200 2
6 1620 990 2880 1080
3 0 0 1 0 7 50 -1 -1 0.000 0 0 0 6
	 1620 990 1665 1035 1710 1035 2160 1035 2205 1035 2250 1080
	 0.000 1.000 1.000 1.000 1.000 0.000
3 0 0 1 0 7 50 -1 -1 0.000 0 0 0 6
	 2880 990 2835 1035 2790 1035 2340 1035 2295 1035 2250 1080
	 0.000 1.000 1.000 1.000 1.000 0.000
-6
6 270 990 1530 1080
3 0 0 1 0 7 50 -1 -1 0.000 0 0 0 6
	 270 990 315 1035 360 1035 810 1035 855 1035 900 1080
	 0.000 1.000 1.000 1.000 1.000 0.000
3 0 0 1 0 7 50 -1 -1 0.000 0 0 0 6
	 1530 990 1485 1035 1440 1035 990 1035 945 1035 900 1080
	 0.000 1.000 1.000 1.000 1.000 0.000
-6
2 2 0 1 0 0 52 -1 20 0.000 0 0 -1 0 0 5
	 270 720 2970 720 2970 945 270 945 270 720
2 1 0 1 -1 -1 0 0 -1 0.000 0 0 -1 0 0 4
	 225 675 225 900 2925 900 2925 675
2 1 0 1 -1 -1 0 0 -1 0.000 0 0 -1 0 0 2
	 1575 810 1575 900
2 2 0 1 0 1 51 -1 38 0.000 0 0 -1 0 0 5
	 225 675 2925 675 2925 900 225 900 225 675
4 2 -1 0 0 16 7 0.0000 4 90 60 180 810 0\001
4 0 -1 0 0 16 7 0.0000 4 90 120 3015 810 31\001
4 1 -1 0 0 16 7 0.0000 4 90 345 900 1215 r\351seau\001
4 1 -1 0 0 16 7 0.0000 4 90 435 2250 1215 machine\001
