#FIG 3.2  Produced by xfig version 3.2.5c
Landscape
Center
Metric
A4      
100.00
Single
-2
1200 2
2 4 0 1 0 31 51 -1 38 0.000 0 0 7 0 0 5
	 1350 855 450 855 450 450 1350 450 1350 855
2 4 0 1 0 31 51 -1 38 0.000 0 0 7 0 0 5
	 2430 1485 1530 1485 1530 1080 2430 1080 2430 1485
2 4 0 1 0 0 52 -1 20 0.000 0 0 7 0 0 5
	 1395 900 495 900 495 495 1395 495 1395 900
2 4 0 1 0 0 52 -1 20 0.000 0 0 7 0 0 5
	 3555 900 2655 900 2655 495 3555 495 3555 900
2 4 0 1 0 0 52 -1 20 0.000 0 0 7 0 0 5
	 2475 1530 1575 1530 1575 1125 2475 1125 2475 1530
2 4 0 1 0 13 51 -1 38 0.000 0 0 7 0 0 5
	 3510 855 2610 855 2610 450 3510 450 3510 855
3 0 0 1 0 7 50 -1 -1 0.000 0 1 0 5
	1 1 1.00 60.00 120.00
	 990 855 990 990 990 1215 1170 1215 1530 1215
	 0.000 1.000 1.000 1.000 0.000
3 0 0 1 0 7 50 -1 -1 0.000 0 1 0 5
	1 1 1.00 60.00 120.00
	 2430 1215 2790 1215 2970 1215 2970 1080 2970 855
	 0.000 1.000 1.000 1.000 0.000
3 0 0 1 0 7 50 -1 -1 0.000 0 1 0 5
	1 1 1.00 60.00 120.00
	 3150 855 3150 1170 3150 1305 2970 1305 2430 1305
	 0.000 1.000 1.000 1.000 0.000
3 0 0 1 0 7 50 -1 -1 0.000 0 1 0 5
	1 1 1.00 60.00 120.00
	 1530 1305 1080 1305 810 1305 810 1170 810 855
	 0.000 1.000 1.000 1.000 0.000
3 0 0 1 0 7 50 -1 -1 0.000 0 1 0 2
	1 1 1.00 60.00 120.00
	 2610 675 1350 675
	 0.000 0.000
4 1 0 50 -1 17 6 0.0000 4 75 750 2070 630 d\351sautorisation\001
4 0 0 50 -1 17 6 0.0000 4 75 750 1035 1035 authentification\001
4 0 0 50 -1 17 6 0.0000 4 75 750 2790 1440 d\351sassociation\001
4 2 0 50 -1 17 6 0.0000 4 75 750 1260 1440 d\351sautorisation\001
4 2 0 50 -1 17 6 0.0000 4 75 570 2880 1035 association\001
4 1 0 50 -1 16 8 0.0000 4 105 915 900 630 non authentifi\351\001
4 1 0 50 -1 16 8 0.0000 4 105 750 900 795 non associ\351\001
4 1 0 50 -1 16 8 0.0000 4 105 645 3060 630 authentifi\351\001
4 1 0 50 -1 16 8 0.0000 4 105 480 3060 795 associ\351\001
4 1 0 50 -1 16 8 0.0000 4 105 645 1980 1260 authentifi\351\001
4 1 0 50 -1 16 8 0.0000 4 105 750 1980 1425 non associ\351\001
