#FIG 3.2  Produced by xfig version 3.2.5c
Portrait
Center
Metric
A4      
100.00
Single
-2
1200 2
0 32 #c6b797
0 33 #eff8ff
0 34 #dccba6
0 35 #404040
0 36 #808080
0 37 #c0c0c0
0 38 #e0e0e0
0 39 #8e8f8e
0 40 #aaaaaa
0 41 #555555
0 42 #c7c3c7
0 43 #565151
0 44 #8e8e8e
0 45 #d7d7d7
0 46 #85807d
0 47 #d2d2d2
0 48 #3a3a3a
0 49 #4573aa
0 50 #aeaeae
0 51 #7b79a5
0 52 #444444
0 53 #73758c
0 54 #f7f7f7
0 55 #414541
0 56 #635dce
0 57 #bebebe
0 58 #515151
0 59 #e7e3e7
0 60 #000049
0 61 #797979
0 62 #303430
0 63 #414141
0 64 #c7b696
6 2475 900 2970 1395
# Router small icon
# drawn by P. David
6 2475 900 2970 1395
1 3 0 1 7 1 50 -1 20 0.000 1 0.0000 2700 1125 225 225 2700 1125 2925 1125
1 3 0 0 0 0 51 -1 20 0.000 1 0.0000 2745 1170 225 225 2745 1170 2970 1170
2 1 0 2 6 7 49 -1 -1 0.000 0 0 7 1 0 3
	1 1 1.00 45.00 60.00
	 2745 945 2745 1080 2880 1080
2 1 0 2 6 7 49 -1 -1 0.000 0 0 7 1 0 3
	1 1 1.00 45.00 60.00
	 2880 1170 2745 1170 2745 1305
2 1 0 2 6 7 49 -1 -1 0.000 0 0 7 1 0 3
	1 1 1.00 45.00 60.00
	 2655 1305 2655 1170 2520 1170
2 1 0 2 6 7 49 -1 -1 0.000 0 0 7 1 0 3
	1 1 1.00 45.00 60.00
	 2520 1080 2655 1080 2655 945
-6
-6
6 900 990 1395 1485
# Router small icon
# drawn by P. David
6 900 990 1395 1485
1 3 0 1 7 1 50 -1 20 0.000 1 0.0000 1125 1215 225 225 1125 1215 1350 1215
1 3 0 0 0 0 51 -1 20 0.000 1 0.0000 1170 1260 225 225 1170 1260 1395 1260
2 1 0 2 6 7 49 -1 -1 0.000 0 0 7 1 0 3
	1 1 1.00 45.00 60.00
	 1170 1035 1170 1170 1305 1170
2 1 0 2 6 7 49 -1 -1 0.000 0 0 7 1 0 3
	1 1 1.00 45.00 60.00
	 1305 1260 1170 1260 1170 1395
2 1 0 2 6 7 49 -1 -1 0.000 0 0 7 1 0 3
	1 1 1.00 45.00 60.00
	 1080 1395 1080 1260 945 1260
2 1 0 2 6 7 49 -1 -1 0.000 0 0 7 1 0 3
	1 1 1.00 45.00 60.00
	 945 1170 1080 1170 1080 1035
-6
-6
6 1800 1665 2295 2160
# Router small icon
# drawn by P. David
6 1800 1665 2295 2160
1 3 0 1 7 1 50 -1 20 0.000 1 0.0000 2025 1890 225 225 2025 1890 2250 1890
1 3 0 0 0 0 51 -1 20 0.000 1 0.0000 2070 1935 225 225 2070 1935 2295 1935
2 1 0 2 6 7 49 -1 -1 0.000 0 0 7 1 0 3
	1 1 1.00 45.00 60.00
	 2070 1710 2070 1845 2205 1845
2 1 0 2 6 7 49 -1 -1 0.000 0 0 7 1 0 3
	1 1 1.00 45.00 60.00
	 2205 1935 2070 1935 2070 2070
2 1 0 2 6 7 49 -1 -1 0.000 0 0 7 1 0 3
	1 1 1.00 45.00 60.00
	 1980 2070 1980 1935 1845 1935
2 1 0 2 6 7 49 -1 -1 0.000 0 0 7 1 0 3
	1 1 1.00 45.00 60.00
	 1845 1845 1980 1845 1980 1710
-6
-6
# Desktop computer
6 2295 2430 2685 2925
6 2327 2438 2658 2741
2 2 0 1 0 38 20 0 20 0.000 2 0 7 0 0 5
	 2327 2438 2658 2438 2658 2714 2327 2714 2327 2438
2 2 0 0 0 35 19 0 22 0.000 1 0 -1 0 0 5
	 2588 2465 2561 2465 2561 2686 2588 2686 2588 2465
2 2 0 0 0 35 19 0 24 0.000 1 0 -1 0 0 5
	 2561 2465 2533 2465 2533 2686 2561 2686 2561 2465
2 2 0 0 0 35 19 0 26 0.000 1 0 -1 0 0 5
	 2533 2465 2492 2465 2492 2686 2533 2686 2533 2465
2 2 0 0 0 35 19 0 28 0.000 1 0 -1 0 0 5
	 2492 2465 2451 2465 2451 2686 2492 2686 2492 2465
2 2 0 0 0 35 19 0 30 0.000 1 0 -1 0 0 5
	 2451 2465 2424 2465 2424 2686 2451 2686 2451 2465
2 2 0 0 0 35 19 0 33 0.000 1 0 -1 0 0 5
	 2424 2465 2395 2465 2395 2686 2424 2686 2424 2465
2 2 0 0 0 35 19 0 33 0.000 1 0 -1 0 0 5
	 2395 2465 2368 2465 2368 2686 2395 2686 2395 2465
2 2 0 1 0 36 20 0 20 0.000 2 0 7 0 0 5
	 2424 2714 2561 2714 2561 2727 2424 2727 2424 2714
2 2 0 1 0 36 20 0 20 0.000 2 0 -1 0 0 5
	 2410 2727 2575 2727 2575 2741 2410 2741 2410 2727
2 2 0 0 0 35 19 0 20 0.000 1 0 7 0 0 5
	 2616 2465 2588 2465 2588 2686 2616 2686 2616 2465
3 5 0 0 0 37 18 0 20 0.000 0 0 0 4
	 2354 2465 2354 2686 2368 2672 2368 2479
	 0.000 0.000 0.000 0.000
3 5 0 0 0 7 18 0 20 0.000 0 0 0 5
	 2354 2686 2368 2672 2495 2678 2616 2672 2629 2686
	 0.000 0.000 -1.000 0.000 0.000
3 5 0 0 0 37 18 0 20 0.000 0 0 0 4
	 2629 2465 2629 2686 2616 2672 2616 2479
	 0.000 0.000 0.000 0.000
3 5 0 0 0 36 18 0 20 0.000 0 0 0 5
	 2354 2465 2368 2479 2495 2474 2616 2479 2629 2465
	 0.000 0.000 -1.000 0.000 0.000
-6
6 2299 2837 2684 2921
2 3 0 1 0 38 20 0 20 0.000 2 0 7 0 0 7
	 2341 2837 2643 2837 2684 2907 2684 2921 2299 2921 2299 2907
	 2341 2837
2 1 0 1 0 37 19 0 20 0.000 2 0 -1 0 0 4
	 2299 2907 2299 2921 2684 2921 2684 2907
2 3 0 0 0 7 19 0 20 0.000 2 0 -1 0 0 5
	 2354 2852 2327 2893 2575 2893 2561 2852 2354 2852
2 2 0 0 0 36 18 0 20 0.000 2 0 -1 0 0 5
	 2327 2893 2575 2893 2575 2898 2327 2898 2327 2893
2 3 0 0 0 37 18 0 20 0.000 2 0 -1 0 0 9
	 2349 2852 2327 2893 2368 2893 2374 2879 2364 2879 2370 2866
	 2361 2866 2368 2852 2349 2852
2 3 0 0 0 37 18 0 20 0.000 2 0 -1 0 0 10
	 2575 2893 2533 2893 2533 2879 2542 2879 2541 2866 2547 2866
	 2549 2866 2546 2852 2564 2852 2575 2893
2 3 0 0 0 7 19 0 20 0.000 2 0 -1 0 0 5
	 2629 2852 2575 2852 2588 2893 2658 2893 2629 2852
2 3 0 0 0 37 18 0 20 0.000 2 0 -1 0 0 7
	 2658 2893 2645 2893 2629 2860 2577 2860 2575 2852 2635 2852
	 2658 2893
2 2 0 0 0 36 18 0 20 0.000 2 0 -1 0 0 5
	 2588 2893 2658 2893 2658 2898 2588 2898 2588 2893
2 3 0 0 0 36 18 0 20 0.000 2 0 -1 0 0 5
	 2588 2893 2588 2898 2575 2856 2575 2852 2588 2893
-6
6 2334 2741 2650 2824
6 2538 2756 2634 2783
6 2538 2756 2634 2783
2 1 0 1 36 -1 19 0 -1 0.000 2 0 -1 0 0 5
	 2538 2769 2538 2762 2567 2762 2567 2756 2604 2756
2 1 0 1 36 -1 19 0 -1 0.000 2 0 -1 0 0 3
	 2567 2783 2567 2769 2604 2769
2 1 0 1 36 -1 19 0 -1 0.000 2 0 -1 0 0 2
	 2604 2762 2634 2762
2 1 0 1 7 -1 19 0 -1 0.000 2 0 -1 0 0 2
	 2604 2756 2604 2762
2 1 0 1 7 -1 19 0 -1 0.000 2 0 -1 0 0 2
	 2538 2769 2567 2769
2 1 0 1 7 -1 19 0 -1 0.000 2 0 -1 0 0 5
	 2567 2783 2604 2783 2604 2769 2634 2769 2634 2762
2 1 0 1 36 -1 19 0 -1 0.000 2 0 -1 0 0 3
	 2611 2783 2627 2783 2627 2777
2 1 0 1 7 -1 19 0 -1 0.000 2 0 -1 0 0 3
	 2611 2783 2611 2777 2627 2777
-6
-6
2 2 0 1 0 35 20 0 20 0.000 2 0 -1 0 0 5
	 2334 2824 2375 2824 2375 2817 2334 2817 2334 2824
2 2 0 1 0 35 20 0 20 0.000 2 0 -1 0 0 5
	 2609 2824 2650 2824 2650 2817 2609 2817 2609 2824
2 2 0 1 0 38 20 0 20 0.000 2 0 -1 0 0 5
	 2334 2741 2650 2741 2650 2817 2334 2817 2334 2741
-6
-6
# Desktop computer
6 495 2430 885 2925
6 527 2438 858 2741
2 2 0 1 0 38 20 0 20 0.000 2 0 7 0 0 5
	 527 2438 858 2438 858 2714 527 2714 527 2438
2 2 0 0 0 35 19 0 22 0.000 1 0 -1 0 0 5
	 788 2465 761 2465 761 2686 788 2686 788 2465
2 2 0 0 0 35 19 0 24 0.000 1 0 -1 0 0 5
	 761 2465 733 2465 733 2686 761 2686 761 2465
2 2 0 0 0 35 19 0 26 0.000 1 0 -1 0 0 5
	 733 2465 692 2465 692 2686 733 2686 733 2465
2 2 0 0 0 35 19 0 28 0.000 1 0 -1 0 0 5
	 692 2465 651 2465 651 2686 692 2686 692 2465
2 2 0 0 0 35 19 0 30 0.000 1 0 -1 0 0 5
	 651 2465 624 2465 624 2686 651 2686 651 2465
2 2 0 0 0 35 19 0 33 0.000 1 0 -1 0 0 5
	 624 2465 595 2465 595 2686 624 2686 624 2465
2 2 0 0 0 35 19 0 33 0.000 1 0 -1 0 0 5
	 595 2465 568 2465 568 2686 595 2686 595 2465
2 2 0 1 0 36 20 0 20 0.000 2 0 7 0 0 5
	 624 2714 761 2714 761 2727 624 2727 624 2714
2 2 0 1 0 36 20 0 20 0.000 2 0 -1 0 0 5
	 610 2727 775 2727 775 2741 610 2741 610 2727
2 2 0 0 0 35 19 0 20 0.000 1 0 7 0 0 5
	 816 2465 788 2465 788 2686 816 2686 816 2465
3 5 0 0 0 37 18 0 20 0.000 0 0 0 4
	 554 2465 554 2686 568 2672 568 2479
	 0.000 0.000 0.000 0.000
3 5 0 0 0 7 18 0 20 0.000 0 0 0 5
	 554 2686 568 2672 695 2678 816 2672 829 2686
	 0.000 0.000 -1.000 0.000 0.000
3 5 0 0 0 37 18 0 20 0.000 0 0 0 4
	 829 2465 829 2686 816 2672 816 2479
	 0.000 0.000 0.000 0.000
3 5 0 0 0 36 18 0 20 0.000 0 0 0 5
	 554 2465 568 2479 695 2474 816 2479 829 2465
	 0.000 0.000 -1.000 0.000 0.000
-6
6 499 2837 884 2921
2 3 0 1 0 38 20 0 20 0.000 2 0 7 0 0 7
	 541 2837 843 2837 884 2907 884 2921 499 2921 499 2907
	 541 2837
2 1 0 1 0 37 19 0 20 0.000 2 0 -1 0 0 4
	 499 2907 499 2921 884 2921 884 2907
2 3 0 0 0 7 19 0 20 0.000 2 0 -1 0 0 5
	 554 2852 527 2893 775 2893 761 2852 554 2852
2 2 0 0 0 36 18 0 20 0.000 2 0 -1 0 0 5
	 527 2893 775 2893 775 2898 527 2898 527 2893
2 3 0 0 0 37 18 0 20 0.000 2 0 -1 0 0 9
	 549 2852 527 2893 568 2893 574 2879 564 2879 570 2866
	 561 2866 568 2852 549 2852
2 3 0 0 0 37 18 0 20 0.000 2 0 -1 0 0 10
	 775 2893 733 2893 733 2879 742 2879 741 2866 747 2866
	 749 2866 746 2852 764 2852 775 2893
2 3 0 0 0 7 19 0 20 0.000 2 0 -1 0 0 5
	 829 2852 775 2852 788 2893 858 2893 829 2852
2 3 0 0 0 37 18 0 20 0.000 2 0 -1 0 0 7
	 858 2893 845 2893 829 2860 777 2860 775 2852 835 2852
	 858 2893
2 2 0 0 0 36 18 0 20 0.000 2 0 -1 0 0 5
	 788 2893 858 2893 858 2898 788 2898 788 2893
2 3 0 0 0 36 18 0 20 0.000 2 0 -1 0 0 5
	 788 2893 788 2898 775 2856 775 2852 788 2893
-6
6 534 2741 850 2824
6 738 2756 834 2783
6 738 2756 834 2783
2 1 0 1 36 -1 19 0 -1 0.000 2 0 -1 0 0 5
	 738 2769 738 2762 767 2762 767 2756 804 2756
2 1 0 1 36 -1 19 0 -1 0.000 2 0 -1 0 0 3
	 767 2783 767 2769 804 2769
2 1 0 1 36 -1 19 0 -1 0.000 2 0 -1 0 0 2
	 804 2762 834 2762
2 1 0 1 7 -1 19 0 -1 0.000 2 0 -1 0 0 2
	 804 2756 804 2762
2 1 0 1 7 -1 19 0 -1 0.000 2 0 -1 0 0 2
	 738 2769 767 2769
2 1 0 1 7 -1 19 0 -1 0.000 2 0 -1 0 0 5
	 767 2783 804 2783 804 2769 834 2769 834 2762
2 1 0 1 36 -1 19 0 -1 0.000 2 0 -1 0 0 3
	 811 2783 827 2783 827 2777
2 1 0 1 7 -1 19 0 -1 0.000 2 0 -1 0 0 3
	 811 2783 811 2777 827 2777
-6
-6
2 2 0 1 0 35 20 0 20 0.000 2 0 -1 0 0 5
	 534 2824 575 2824 575 2817 534 2817 534 2824
2 2 0 1 0 35 20 0 20 0.000 2 0 -1 0 0 5
	 809 2824 850 2824 850 2817 809 2817 809 2824
2 2 0 1 0 38 20 0 20 0.000 2 0 -1 0 0 5
	 534 2741 850 2741 850 2817 534 2817 534 2741
-6
-6
# Desktop computer
6 270 225 660 720
6 302 233 633 536
2 2 0 1 0 38 20 0 20 0.000 2 0 7 0 0 5
	 302 233 633 233 633 509 302 509 302 233
2 2 0 0 0 35 19 0 22 0.000 1 0 -1 0 0 5
	 563 260 536 260 536 481 563 481 563 260
2 2 0 0 0 35 19 0 24 0.000 1 0 -1 0 0 5
	 536 260 508 260 508 481 536 481 536 260
2 2 0 0 0 35 19 0 26 0.000 1 0 -1 0 0 5
	 508 260 467 260 467 481 508 481 508 260
2 2 0 0 0 35 19 0 28 0.000 1 0 -1 0 0 5
	 467 260 426 260 426 481 467 481 467 260
2 2 0 0 0 35 19 0 30 0.000 1 0 -1 0 0 5
	 426 260 399 260 399 481 426 481 426 260
2 2 0 0 0 35 19 0 33 0.000 1 0 -1 0 0 5
	 399 260 370 260 370 481 399 481 399 260
2 2 0 0 0 35 19 0 33 0.000 1 0 -1 0 0 5
	 370 260 343 260 343 481 370 481 370 260
2 2 0 1 0 36 20 0 20 0.000 2 0 7 0 0 5
	 399 509 536 509 536 522 399 522 399 509
2 2 0 1 0 36 20 0 20 0.000 2 0 -1 0 0 5
	 385 522 550 522 550 536 385 536 385 522
2 2 0 0 0 35 19 0 20 0.000 1 0 7 0 0 5
	 591 260 563 260 563 481 591 481 591 260
3 5 0 0 0 37 18 0 20 0.000 0 0 0 4
	 329 260 329 481 343 467 343 274
	 0.000 0.000 0.000 0.000
3 5 0 0 0 7 18 0 20 0.000 0 0 0 5
	 329 481 343 467 470 473 591 467 604 481
	 0.000 0.000 -1.000 0.000 0.000
3 5 0 0 0 37 18 0 20 0.000 0 0 0 4
	 604 260 604 481 591 467 591 274
	 0.000 0.000 0.000 0.000
3 5 0 0 0 36 18 0 20 0.000 0 0 0 5
	 329 260 343 274 470 269 591 274 604 260
	 0.000 0.000 -1.000 0.000 0.000
-6
6 274 632 659 716
2 3 0 1 0 38 20 0 20 0.000 2 0 7 0 0 7
	 316 632 618 632 659 702 659 716 274 716 274 702
	 316 632
2 1 0 1 0 37 19 0 20 0.000 2 0 -1 0 0 4
	 274 702 274 716 659 716 659 702
2 3 0 0 0 7 19 0 20 0.000 2 0 -1 0 0 5
	 329 647 302 688 550 688 536 647 329 647
2 2 0 0 0 36 18 0 20 0.000 2 0 -1 0 0 5
	 302 688 550 688 550 693 302 693 302 688
2 3 0 0 0 37 18 0 20 0.000 2 0 -1 0 0 9
	 324 647 302 688 343 688 349 674 339 674 345 661
	 336 661 343 647 324 647
2 3 0 0 0 37 18 0 20 0.000 2 0 -1 0 0 10
	 550 688 508 688 508 674 517 674 516 661 522 661
	 524 661 521 647 539 647 550 688
2 3 0 0 0 7 19 0 20 0.000 2 0 -1 0 0 5
	 604 647 550 647 563 688 633 688 604 647
2 3 0 0 0 37 18 0 20 0.000 2 0 -1 0 0 7
	 633 688 620 688 604 655 552 655 550 647 610 647
	 633 688
2 2 0 0 0 36 18 0 20 0.000 2 0 -1 0 0 5
	 563 688 633 688 633 693 563 693 563 688
2 3 0 0 0 36 18 0 20 0.000 2 0 -1 0 0 5
	 563 688 563 693 550 651 550 647 563 688
-6
6 309 536 625 619
6 513 551 609 578
6 513 551 609 578
2 1 0 1 36 -1 19 0 -1 0.000 2 0 -1 0 0 5
	 513 564 513 557 542 557 542 551 579 551
2 1 0 1 36 -1 19 0 -1 0.000 2 0 -1 0 0 3
	 542 578 542 564 579 564
2 1 0 1 36 -1 19 0 -1 0.000 2 0 -1 0 0 2
	 579 557 609 557
2 1 0 1 7 -1 19 0 -1 0.000 2 0 -1 0 0 2
	 579 551 579 557
2 1 0 1 7 -1 19 0 -1 0.000 2 0 -1 0 0 2
	 513 564 542 564
2 1 0 1 7 -1 19 0 -1 0.000 2 0 -1 0 0 5
	 542 578 579 578 579 564 609 564 609 557
2 1 0 1 36 -1 19 0 -1 0.000 2 0 -1 0 0 3
	 586 578 602 578 602 572
2 1 0 1 7 -1 19 0 -1 0.000 2 0 -1 0 0 3
	 586 578 586 572 602 572
-6
-6
2 2 0 1 0 35 20 0 20 0.000 2 0 -1 0 0 5
	 309 619 350 619 350 612 309 612 309 619
2 2 0 1 0 35 20 0 20 0.000 2 0 -1 0 0 5
	 584 619 625 619 625 612 584 612 584 619
2 2 0 1 0 38 20 0 20 0.000 2 0 -1 0 0 5
	 309 536 625 536 625 612 309 612 309 536
-6
-6
6 2925 135 4725 1305
1 2 0 1 0 11 50 -1 36 0.000 1 0.0000 3678 1022 398 240 3281 782 4076 1263
1 2 0 1 0 11 50 -1 36 0.000 1 0.0000 3438 541 199 283 3637 824 3239 259
1 2 0 1 0 11 50 -1 36 0.000 1 0.0000 3772 415 282 241 3490 656 4055 175
1 2 0 1 0 11 50 -1 36 0.000 1 0.0000 4024 311 220 115 3804 426 4244 196
1 2 0 1 0 11 50 -1 36 0.000 1 0.0000 4432 792 272 261 4160 531 4704 1054
1 2 0 1 0 11 50 -1 36 0.000 1 0.0000 4107 1033 261 251 3846 782 4369 1284
1 2 0 1 0 11 50 -1 36 0.000 1 0.0000 4244 499 314 199 3930 698 4558 300
1 2 0 1 0 11 50 -1 36 0.000 1 0.0000 4317 970 240 209 4076 761 4558 1179
1 2 0 1 0 11 51 -1 36 0.000 1 0.0000 3344 719 398 314 2946 719 3742 719
2 2 0 0 7 11 40 -1 36 0.000 0 0 -1 0 0 5
	 3176 510 4495 510 4495 970 3176 970 3176 510
2 2 0 0 7 11 40 -1 36 0.000 0 0 -1 0 0 5
	 3658 300 4202 300 4202 593 3658 593 3658 300
2 2 0 0 7 11 40 -1 36 0.000 0 0 -1 0 0 5
	 3951 1012 4139 1012 4139 1179 3951 1179 3951 1012
2 2 0 0 7 11 40 -1 36 0.000 0 0 -1 0 0 5
	 3783 845 4411 845 4411 1117 3783 1117 3783 845
2 2 0 0 7 11 40 -1 36 0.000 0 0 -1 0 0 5
	 3448 342 3595 342 3595 573 3448 573 3448 342
2 2 0 0 7 11 40 -1 36 0.000 0 0 -1 0 0 5
	 4327 782 4578 782 4578 949 4327 949 4327 782
2 2 0 0 7 11 40 -1 36 0.000 0 0 -1 0 0 5
	 3783 259 3888 259 3888 363 3783 363 3783 259
4 1 -1 30 0 17 14 0.0000 4 180 795 3825 810 Internet\001
-6
2 1 0 1 -1 -1 60 0 -1 0.000 0 0 -1 0 0 2
	 450 675 450 900
2 1 0 1 -1 -1 60 0 -1 0.000 0 0 -1 0 0 2
	 2700 1125 3330 630
2 1 0 1 -1 -1 60 0 -1 0.000 0 0 -1 0 0 2
	 1125 900 1125 1125
2 1 0 1 -1 -1 60 0 -1 0.000 0 0 -1 0 0 2
	 135 900 1440 900
2 1 0 1 -1 -1 60 0 -1 0.000 0 0 -1 0 0 2
	 90 1575 3330 1575
2 1 0 1 -1 -1 60 0 -1 0.000 0 0 -1 0 0 2
	 1125 1350 1125 1575
2 1 0 1 -1 -1 60 0 -1 0.000 0 0 -1 0 0 2
	 2025 1575 2025 1800
2 1 0 1 -1 -1 60 0 -1 0.000 0 0 -1 0 0 2
	 2025 2025 2025 2250
2 1 0 1 -1 -1 60 0 -1 0.000 0 0 -1 0 0 2
	 2700 1350 2700 1575
2 1 0 1 -1 -1 60 0 -1 0.000 0 0 -1 0 0 2
	 2475 2250 2475 2475
2 1 0 1 -1 -1 60 0 -1 0.000 0 0 -1 0 0 2
	 315 2250 2655 2250
2 1 0 1 -1 -1 60 0 -1 0.000 0 0 -1 0 0 2
	 675 2250 675 2475
4 0 -1 50 0 16 7 0.0000 4 90 630 2745 1530 172.17.0.221\001
4 0 -1 50 0 16 7 0.0000 4 90 570 495 855 172.17.1.21\001
4 0 -1 50 0 16 7 0.0000 4 90 630 2205 1710 172.17.0.254\001
4 0 -1 50 0 16 7 0.0000 4 90 630 2205 2205 172.17.8.126\001
4 0 -1 50 0 16 7 0.0000 4 90 570 2520 2385 172.17.8.24\001
4 0 -1 50 0 16 7 0.0000 4 90 570 720 2385 172.17.8.33\001
4 0 -1 50 0 16 7 0.0000 4 90 630 1305 1530 172.17.0.250\001
4 0 -1 50 0 16 7 0.0000 4 90 630 1305 1035 172.17.1.126\001
