module wg-cli-manager

go 1.17

require (
	gorm.io/driver/sqlite v1.1.4
	gorm.io/gorm v1.21.13
)

require (
	github.com/jinzhu/inflection v1.0.0 // indirect
	github.com/jinzhu/now v1.1.2 // indirect
	github.com/mattn/go-sqlite3 v1.14.8 // indirect
)
