{
  "google": {
    "API": {
      "projectId": "",
      "keyFilename": ""
    },
    "speech": {
      "config": {
        "encoding": "LINEAR16",
        "sampleRateHertz": 16000
      },
      "singleUtterance": false,
      "interimResults": true
    }
  },
  "polly": {
    "config": {
      "signatureVersion": "v4",
      "region": "us-east-1"
    },
    "synthesize": {
      "OutputFormat": "pcm",
      "SampleRate": "16000"
    },
    "voice": {
      "default": "Joanna",
      "gender": "Female"
    }
  },
  "recordings": {
    "path": "/var/spool/asterisk/recording",
    "inFormat": "wav16",
    "outFormat": "sln16"
  },
  "ami": {
    "host": "localhost",
    "username" : "asterisk",
    "password": "asterisk",
    "port": "5038",
    "events": true
  },
  "ari": {
    "url": "http://localhost:8088",
    "username": "asterisk",
    "password": "asterisk"
  },
  "tailstream": {
    "beginAt": "end",
    "onMove": "follow",
    "detectTruncate": true,
    "onTruncate": "end",
    "endOnError": false
  },
  "language": {
    "da-DK": "da-DK",
    "de-DE": "de-DE",
    "en-AU": "en-AU",
    "en-CA": "en-US",
    "en-GH": "en-US",
    "en-GB": "en-GB",
    "en-IN": "en-IN",
    "en-IE": "en-GB",
    "en-KE": "en-US",
    "en-NZ": "en-US",
    "en-NG": "en-US",
    "en-PH": "en-US",
    "en-ZA": "en-US",
    "en-TZ": "en-US",
    "en-US": "en-US",
    "es-AR": "es-US",
    "es-BO": "es-US",
    "es-CL": "es-US",
    "es-CO": "es-US",
    "es-CR": "es-US",
    "es-EC": "es-US",
    "es-SV": "es-US",
    "es-ES": "es-ES",
    "es-US": "es-US",
    "es-GT": "es-US",
    "es-HN": "es-US",
    "es-MX": "es-US",
    "es-NI": "es-US",
    "es-PA": "es-US",
    "es-PY": "es-US",
    "es-PE": "es-US",
    "es-PR": "es-US",
    "es-DO": "es-US",
    "es-UY": "es-US",
    "es-VE": "es-US",
    "fr-CA": "fr-CA",
    "fr-FR": "fr-FR",
    "is-IS": "is-IS",
    "it-IT": "it-IT",
    "ja-JP": "ja-JP",
    "nb-NO": "nb-NO",
    "nl-NL": "nl-NL",
    "pl-PL": "pl-PL",
    "pt-BR": "pt-BR",
    "pt-PT": "pt-PT",
    "ro-RO": "ro-RO",
    "ru-RU": "ru-RU",
    "sv-SE": "sv-SE",
    "tr-TR": "tr-TR"
  }
}
