<mxfile host="app.diagrams.net" modified="2023-04-03T07:45:45.372Z" agent="Mozilla/5.0 (X11; Linux x86_64) AppleWebKit/537.36 (KHTML, like Gecko) Chrome/107.0.0.0 Safari/537.36" etag="LgeTCrb4_Ws366ji3sc4" version="21.1.0" type="gitlab">
  <diagram name="Page-1" id="W41u09B6PKBnBEuhtytk">
    <mxGraphModel dx="1602" dy="775" grid="1" gridSize="10" guides="1" tooltips="1" connect="1" arrows="1" fold="1" page="1" pageScale="1" pageWidth="850" pageHeight="1100" math="0" shadow="0">
      <root>
        <mxCell id="0" />
        <mxCell id="1" parent="0" />
        <mxCell id="CCU1psCh6oS6EPcrCbpZ-1" value="Student" style="shape=umlLifeline;perimeter=lifelinePerimeter;whiteSpace=wrap;html=1;container=0;dropTarget=0;collapsible=0;recursiveResize=0;outlineConnect=0;portConstraint=eastwest;newEdgeStyle={&quot;edgeStyle&quot;:&quot;elbowEdgeStyle&quot;,&quot;elbow&quot;:&quot;vertical&quot;,&quot;curved&quot;:0,&quot;rounded&quot;:0};" vertex="1" parent="1">
          <mxGeometry x="40" y="40" width="100" height="880" as="geometry" />
        </mxCell>
        <mxCell id="CCU1psCh6oS6EPcrCbpZ-2" value="" style="html=1;points=[];perimeter=orthogonalPerimeter;outlineConnect=0;targetShapes=umlLifeline;portConstraint=eastwest;newEdgeStyle={&quot;edgeStyle&quot;:&quot;elbowEdgeStyle&quot;,&quot;elbow&quot;:&quot;vertical&quot;,&quot;curved&quot;:0,&quot;rounded&quot;:0};" vertex="1" parent="CCU1psCh6oS6EPcrCbpZ-1">
          <mxGeometry x="45" y="70" width="10" height="760" as="geometry" />
        </mxCell>
        <mxCell id="CCU1psCh6oS6EPcrCbpZ-3" value="Start" style="html=1;verticalAlign=bottom;startArrow=oval;endArrow=block;startSize=8;edgeStyle=elbowEdgeStyle;elbow=vertical;curved=0;rounded=0;" edge="1" parent="CCU1psCh6oS6EPcrCbpZ-1" target="CCU1psCh6oS6EPcrCbpZ-2">
          <mxGeometry relative="1" as="geometry">
            <mxPoint x="-15" y="70" as="sourcePoint" />
          </mxGeometry>
        </mxCell>
        <mxCell id="CCU1psCh6oS6EPcrCbpZ-4" value="CCA" style="shape=umlLifeline;perimeter=lifelinePerimeter;whiteSpace=wrap;html=1;container=0;dropTarget=0;collapsible=0;recursiveResize=0;outlineConnect=0;portConstraint=eastwest;newEdgeStyle={&quot;edgeStyle&quot;:&quot;elbowEdgeStyle&quot;,&quot;elbow&quot;:&quot;vertical&quot;,&quot;curved&quot;:0,&quot;rounded&quot;:0};" vertex="1" parent="1">
          <mxGeometry x="220" y="40" width="100" height="880" as="geometry" />
        </mxCell>
        <mxCell id="CCU1psCh6oS6EPcrCbpZ-5" value="" style="html=1;points=[];perimeter=orthogonalPerimeter;outlineConnect=0;targetShapes=umlLifeline;portConstraint=eastwest;newEdgeStyle={&quot;edgeStyle&quot;:&quot;elbowEdgeStyle&quot;,&quot;elbow&quot;:&quot;vertical&quot;,&quot;curved&quot;:0,&quot;rounded&quot;:0};" vertex="1" parent="CCU1psCh6oS6EPcrCbpZ-4">
          <mxGeometry x="45" y="80" width="10" height="750" as="geometry" />
        </mxCell>
        <mxCell id="CCU1psCh6oS6EPcrCbpZ-6" value="Open website" style="html=1;verticalAlign=bottom;endArrow=block;edgeStyle=elbowEdgeStyle;elbow=vertical;curved=0;rounded=0;" edge="1" parent="1" source="CCU1psCh6oS6EPcrCbpZ-2" target="CCU1psCh6oS6EPcrCbpZ-5">
          <mxGeometry relative="1" as="geometry">
            <mxPoint x="195" y="130" as="sourcePoint" />
            <Array as="points">
              <mxPoint x="180" y="120" />
            </Array>
          </mxGeometry>
        </mxCell>
        <mxCell id="CCU1psCh6oS6EPcrCbpZ-7" value="Display login page" style="html=1;verticalAlign=bottom;endArrow=block;edgeStyle=elbowEdgeStyle;elbow=vertical;curved=0;rounded=0;" edge="1" parent="1" source="CCU1psCh6oS6EPcrCbpZ-5">
          <mxGeometry relative="1" as="geometry">
            <mxPoint x="175" y="160" as="sourcePoint" />
            <Array as="points">
              <mxPoint x="190" y="160" />
            </Array>
            <mxPoint x="100" y="160" as="targetPoint" />
          </mxGeometry>
        </mxCell>
        <mxCell id="CCU1psCh6oS6EPcrCbpZ-8" value="Database" style="shape=umlLifeline;perimeter=lifelinePerimeter;whiteSpace=wrap;html=1;container=0;dropTarget=0;collapsible=0;recursiveResize=0;outlineConnect=0;portConstraint=eastwest;newEdgeStyle={&quot;edgeStyle&quot;:&quot;elbowEdgeStyle&quot;,&quot;elbow&quot;:&quot;vertical&quot;,&quot;curved&quot;:0,&quot;rounded&quot;:0};" vertex="1" parent="1">
          <mxGeometry x="390" y="40" width="100" height="870" as="geometry" />
        </mxCell>
        <mxCell id="CCU1psCh6oS6EPcrCbpZ-9" value="" style="html=1;points=[];perimeter=orthogonalPerimeter;outlineConnect=0;targetShapes=umlLifeline;portConstraint=eastwest;newEdgeStyle={&quot;edgeStyle&quot;:&quot;elbowEdgeStyle&quot;,&quot;elbow&quot;:&quot;vertical&quot;,&quot;curved&quot;:0,&quot;rounded&quot;:0};" vertex="1" parent="CCU1psCh6oS6EPcrCbpZ-8">
          <mxGeometry x="45" y="150" width="10" height="180" as="geometry" />
        </mxCell>
        <mxCell id="CCU1psCh6oS6EPcrCbpZ-10" value="Head of School" style="shape=umlLifeline;perimeter=lifelinePerimeter;whiteSpace=wrap;html=1;container=0;dropTarget=0;collapsible=0;recursiveResize=0;outlineConnect=0;portConstraint=eastwest;newEdgeStyle={&quot;edgeStyle&quot;:&quot;elbowEdgeStyle&quot;,&quot;elbow&quot;:&quot;vertical&quot;,&quot;curved&quot;:0,&quot;rounded&quot;:0};" vertex="1" parent="1">
          <mxGeometry x="600" y="40" width="100" height="860" as="geometry" />
        </mxCell>
        <mxCell id="CCU1psCh6oS6EPcrCbpZ-11" value="" style="html=1;points=[];perimeter=orthogonalPerimeter;outlineConnect=0;targetShapes=umlLifeline;portConstraint=eastwest;newEdgeStyle={&quot;edgeStyle&quot;:&quot;elbowEdgeStyle&quot;,&quot;elbow&quot;:&quot;vertical&quot;,&quot;curved&quot;:0,&quot;rounded&quot;:0};" vertex="1" parent="CCU1psCh6oS6EPcrCbpZ-10">
          <mxGeometry x="45" y="530" width="10" height="200" as="geometry" />
        </mxCell>
        <mxCell id="CCU1psCh6oS6EPcrCbpZ-12" value="Enter login credentials" style="html=1;verticalAlign=bottom;endArrow=block;edgeStyle=elbowEdgeStyle;elbow=vertical;curved=0;rounded=0;" edge="1" parent="1">
          <mxGeometry relative="1" as="geometry">
            <mxPoint x="100" y="200" as="sourcePoint" />
            <Array as="points">
              <mxPoint x="260" y="200" />
            </Array>
            <mxPoint x="260" y="200" as="targetPoint" />
            <mxPoint as="offset" />
          </mxGeometry>
        </mxCell>
        <mxCell id="CCU1psCh6oS6EPcrCbpZ-13" value="Validate credentials" style="html=1;verticalAlign=bottom;endArrow=block;edgeStyle=elbowEdgeStyle;elbow=vertical;curved=0;rounded=0;" edge="1" parent="1">
          <mxGeometry x="0.0667" relative="1" as="geometry">
            <mxPoint x="280" y="210" as="sourcePoint" />
            <Array as="points">
              <mxPoint x="365" y="210" />
            </Array>
            <mxPoint x="430" y="210" as="targetPoint" />
            <mxPoint as="offset" />
          </mxGeometry>
        </mxCell>
        <mxCell id="CCU1psCh6oS6EPcrCbpZ-14" value="Correct credentials" style="html=1;verticalAlign=bottom;endArrow=block;edgeStyle=elbowEdgeStyle;elbow=vertical;curved=0;rounded=0;" edge="1" parent="1">
          <mxGeometry x="0.0932" y="-4" relative="1" as="geometry">
            <mxPoint x="435" y="264.5" as="sourcePoint" />
            <Array as="points">
              <mxPoint x="360" y="264.5" />
            </Array>
            <mxPoint x="280" y="265" as="targetPoint" />
            <mxPoint as="offset" />
          </mxGeometry>
        </mxCell>
        <mxCell id="CCU1psCh6oS6EPcrCbpZ-15" value="login successful" style="html=1;verticalAlign=bottom;endArrow=block;edgeStyle=elbowEdgeStyle;elbow=vertical;curved=0;rounded=0;" edge="1" parent="1">
          <mxGeometry y="-4" relative="1" as="geometry">
            <mxPoint x="260" y="285" as="sourcePoint" />
            <Array as="points">
              <mxPoint x="180" y="284.5" />
            </Array>
            <mxPoint x="100" y="285" as="targetPoint" />
            <mxPoint x="1" as="offset" />
          </mxGeometry>
        </mxCell>
        <mxCell id="CCU1psCh6oS6EPcrCbpZ-16" value="" style="line;strokeWidth=1;fillColor=none;align=left;verticalAlign=middle;spacingTop=-1;spacingLeft=3;spacingRight=3;rotatable=0;labelPosition=right;points=[];portConstraint=eastwest;strokeColor=inherit;" vertex="1" parent="1">
          <mxGeometry x="20" y="306" width="470" height="8" as="geometry" />
        </mxCell>
        <mxCell id="CCU1psCh6oS6EPcrCbpZ-17" value="Incorrect credentials" style="html=1;verticalAlign=bottom;endArrow=block;edgeStyle=elbowEdgeStyle;elbow=vertical;curved=0;rounded=0;" edge="1" parent="1">
          <mxGeometry x="0.0932" y="-4" relative="1" as="geometry">
            <mxPoint x="435" y="340" as="sourcePoint" />
            <Array as="points">
              <mxPoint x="360" y="340" />
            </Array>
            <mxPoint x="280" y="340.5" as="targetPoint" />
            <mxPoint as="offset" />
          </mxGeometry>
        </mxCell>
        <mxCell id="CCU1psCh6oS6EPcrCbpZ-18" value="Invalid login" style="html=1;verticalAlign=bottom;endArrow=block;edgeStyle=elbowEdgeStyle;elbow=vertical;curved=0;rounded=0;" edge="1" parent="1">
          <mxGeometry x="0.1242" y="-2" relative="1" as="geometry">
            <mxPoint x="260" y="354.5" as="sourcePoint" />
            <Array as="points">
              <mxPoint x="180" y="354" />
            </Array>
            <mxPoint x="100" y="354.5" as="targetPoint" />
            <mxPoint as="offset" />
          </mxGeometry>
        </mxCell>
        <mxCell id="CCU1psCh6oS6EPcrCbpZ-19" value="Display homepage" style="html=1;verticalAlign=bottom;endArrow=block;edgeStyle=elbowEdgeStyle;elbow=vertical;curved=0;rounded=0;" edge="1" parent="1">
          <mxGeometry x="-0.0909" y="-6" relative="1" as="geometry">
            <mxPoint x="261" y="426" as="sourcePoint" />
            <Array as="points">
              <mxPoint x="186" y="426" />
            </Array>
            <mxPoint x="96" y="426" as="targetPoint" />
            <mxPoint as="offset" />
          </mxGeometry>
        </mxCell>
        <mxCell id="CCU1psCh6oS6EPcrCbpZ-20" value="Select propose form" style="html=1;verticalAlign=bottom;endArrow=block;edgeStyle=elbowEdgeStyle;elbow=vertical;curved=0;rounded=0;" edge="1" parent="1">
          <mxGeometry x="0.107" y="5" relative="1" as="geometry">
            <mxPoint x="100" y="475" as="sourcePoint" />
            <Array as="points">
              <mxPoint x="263" y="474.5" />
            </Array>
            <mxPoint x="263" y="474.5" as="targetPoint" />
            <mxPoint x="1" y="1" as="offset" />
          </mxGeometry>
        </mxCell>
        <mxCell id="CCU1psCh6oS6EPcrCbpZ-21" value="Form approval" style="html=1;verticalAlign=bottom;endArrow=block;edgeStyle=elbowEdgeStyle;elbow=vertical;curved=0;rounded=0;" edge="1" parent="1" source="CCU1psCh6oS6EPcrCbpZ-5" target="CCU1psCh6oS6EPcrCbpZ-11">
          <mxGeometry x="0.0137" y="10" relative="1" as="geometry">
            <mxPoint x="110" y="490" as="sourcePoint" />
            <Array as="points">
              <mxPoint x="490" y="580" />
              <mxPoint x="490" y="550" />
              <mxPoint x="460" y="510" />
              <mxPoint x="510" y="520" />
              <mxPoint x="410" y="480" />
            </Array>
            <mxPoint x="640" y="540" as="targetPoint" />
            <mxPoint as="offset" />
          </mxGeometry>
        </mxCell>
        <mxCell id="CCU1psCh6oS6EPcrCbpZ-22" value="Display form" style="html=1;verticalAlign=bottom;endArrow=block;edgeStyle=elbowEdgeStyle;elbow=vertical;curved=0;rounded=0;" edge="1" parent="1">
          <mxGeometry x="-0.0909" y="-6" relative="1" as="geometry">
            <mxPoint x="265" y="516" as="sourcePoint" />
            <Array as="points">
              <mxPoint x="190" y="516" />
            </Array>
            <mxPoint x="100" y="516" as="targetPoint" />
            <mxPoint as="offset" />
          </mxGeometry>
        </mxCell>
        <mxCell id="CCU1psCh6oS6EPcrCbpZ-23" value="Submit form" style="html=1;verticalAlign=bottom;endArrow=block;edgeStyle=elbowEdgeStyle;elbow=vertical;curved=0;rounded=0;" edge="1" parent="1">
          <mxGeometry relative="1" as="geometry">
            <mxPoint x="100" y="560" as="sourcePoint" />
            <Array as="points">
              <mxPoint x="260" y="560" />
            </Array>
            <mxPoint x="260" y="560" as="targetPoint" />
            <mxPoint as="offset" />
          </mxGeometry>
        </mxCell>
        <mxCell id="CCU1psCh6oS6EPcrCbpZ-24" value="conditional" style="shape=umlFrame;whiteSpace=wrap;html=1;pointerEvents=0;" vertex="1" parent="1">
          <mxGeometry x="20" y="450" width="880" height="400" as="geometry" />
        </mxCell>
        <mxCell id="CCU1psCh6oS6EPcrCbpZ-25" value="If approved" style="html=1;verticalAlign=bottom;endArrow=block;edgeStyle=elbowEdgeStyle;elbow=vertical;curved=0;rounded=0;" edge="1" parent="1" target="CCU1psCh6oS6EPcrCbpZ-38">
          <mxGeometry x="0.0541" relative="1" as="geometry">
            <mxPoint x="656" y="620" as="sourcePoint" />
            <Array as="points">
              <mxPoint x="666" y="620" />
            </Array>
            <mxPoint x="820" y="620" as="targetPoint" />
            <mxPoint as="offset" />
          </mxGeometry>
        </mxCell>
        <mxCell id="CCU1psCh6oS6EPcrCbpZ-26" value="conditional" style="shape=umlFrame;whiteSpace=wrap;html=1;pointerEvents=0;" vertex="1" parent="1">
          <mxGeometry x="50" y="590" width="820" height="170" as="geometry" />
        </mxCell>
        <mxCell id="CCU1psCh6oS6EPcrCbpZ-27" value="conditional" style="shape=umlFrame;whiteSpace=wrap;html=1;pointerEvents=0;strokeColor=#000000;" vertex="1" parent="1">
          <mxGeometry x="20" y="240" width="470" height="160" as="geometry" />
        </mxCell>
        <mxCell id="CCU1psCh6oS6EPcrCbpZ-28" value="" style="html=1;verticalAlign=bottom;endArrow=block;edgeStyle=elbowEdgeStyle;elbow=vertical;curved=0;rounded=0;" edge="1" parent="1" source="CCU1psCh6oS6EPcrCbpZ-5" target="CCU1psCh6oS6EPcrCbpZ-2">
          <mxGeometry x="-0.0857" relative="1" as="geometry">
            <mxPoint x="260" y="630" as="sourcePoint" />
            <Array as="points">
              <mxPoint x="130" y="670" />
              <mxPoint x="180" y="630" />
              <mxPoint x="190" y="640" />
            </Array>
            <mxPoint x="100" y="670" as="targetPoint" />
            <mxPoint as="offset" />
          </mxGeometry>
        </mxCell>
        <mxCell id="CCU1psCh6oS6EPcrCbpZ-29" value="" style="line;strokeWidth=1;fillColor=none;align=left;verticalAlign=middle;spacingTop=-1;spacingLeft=3;spacingRight=3;rotatable=0;labelPosition=right;points=[];portConstraint=eastwest;strokeColor=inherit;" vertex="1" parent="1">
          <mxGeometry x="50" y="680" width="820" height="8" as="geometry" />
        </mxCell>
        <mxCell id="CCU1psCh6oS6EPcrCbpZ-30" value="If not approve" style="html=1;verticalAlign=bottom;endArrow=block;edgeStyle=elbowEdgeStyle;elbow=vertical;curved=0;rounded=0;" edge="1" parent="1" target="CCU1psCh6oS6EPcrCbpZ-5">
          <mxGeometry x="0.1351" relative="1" as="geometry">
            <mxPoint x="640" y="730" as="sourcePoint" />
            <Array as="points">
              <mxPoint x="575" y="730" />
            </Array>
            <mxPoint x="450" y="730" as="targetPoint" />
            <mxPoint as="offset" />
          </mxGeometry>
        </mxCell>
        <mxCell id="CCU1psCh6oS6EPcrCbpZ-31" value="" style="html=1;points=[];perimeter=orthogonalPerimeter;outlineConnect=0;targetShapes=umlLifeline;portConstraint=eastwest;newEdgeStyle={&quot;edgeStyle&quot;:&quot;elbowEdgeStyle&quot;,&quot;elbow&quot;:&quot;vertical&quot;,&quot;curved&quot;:0,&quot;rounded&quot;:0};" vertex="1" parent="1">
          <mxGeometry x="435" y="600" width="10" height="80" as="geometry" />
        </mxCell>
        <mxCell id="CCU1psCh6oS6EPcrCbpZ-32" value="Create club and assigned club advisor" style="html=1;verticalAlign=bottom;endArrow=block;edgeStyle=elbowEdgeStyle;elbow=vertical;curved=0;rounded=0;" edge="1" parent="1" source="CCU1psCh6oS6EPcrCbpZ-38">
          <mxGeometry x="-0.1176" relative="1" as="geometry">
            <mxPoint x="810" y="660" as="sourcePoint" />
            <Array as="points">
              <mxPoint x="545" y="660" />
              <mxPoint x="365" y="670" />
              <mxPoint x="395" y="650" />
            </Array>
            <mxPoint x="445" y="660" as="targetPoint" />
            <mxPoint as="offset" />
          </mxGeometry>
        </mxCell>
        <mxCell id="CCU1psCh6oS6EPcrCbpZ-33" value="Resubmit form" style="html=1;verticalAlign=bottom;endArrow=block;edgeStyle=elbowEdgeStyle;elbow=vertical;curved=0;rounded=0;" edge="1" parent="1">
          <mxGeometry x="0.0303" relative="1" as="geometry">
            <mxPoint x="265" y="740" as="sourcePoint" />
            <Array as="points">
              <mxPoint x="190" y="740" />
            </Array>
            <mxPoint x="100" y="740" as="targetPoint" />
            <mxPoint as="offset" />
          </mxGeometry>
        </mxCell>
        <mxCell id="CCU1psCh6oS6EPcrCbpZ-34" value="" style="line;strokeWidth=1;fillColor=none;align=left;verticalAlign=middle;spacingTop=-1;spacingLeft=3;spacingRight=3;rotatable=0;labelPosition=right;points=[];portConstraint=eastwest;strokeColor=inherit;" vertex="1" parent="1">
          <mxGeometry x="20" y="782" width="880" height="8" as="geometry" />
        </mxCell>
        <mxCell id="CCU1psCh6oS6EPcrCbpZ-35" value="logout" style="html=1;verticalAlign=bottom;endArrow=block;edgeStyle=elbowEdgeStyle;elbow=vertical;curved=0;rounded=0;" edge="1" parent="1">
          <mxGeometry x="0.0303" relative="1" as="geometry">
            <mxPoint x="265" y="830" as="sourcePoint" />
            <Array as="points">
              <mxPoint x="190" y="830" />
            </Array>
            <mxPoint x="100" y="830" as="targetPoint" />
            <mxPoint as="offset" />
          </mxGeometry>
        </mxCell>
        <mxCell id="CCU1psCh6oS6EPcrCbpZ-36" value="Display dashboard" style="text;html=1;align=center;verticalAlign=middle;resizable=0;points=[];autosize=1;strokeColor=none;fillColor=none;" vertex="1" parent="1">
          <mxGeometry x="120" y="635" width="120" height="30" as="geometry" />
        </mxCell>
        <mxCell id="CCU1psCh6oS6EPcrCbpZ-37" value="Admin" style="shape=umlLifeline;perimeter=lifelinePerimeter;whiteSpace=wrap;html=1;container=0;dropTarget=0;collapsible=0;recursiveResize=0;outlineConnect=0;portConstraint=eastwest;newEdgeStyle={&quot;edgeStyle&quot;:&quot;elbowEdgeStyle&quot;,&quot;elbow&quot;:&quot;vertical&quot;,&quot;curved&quot;:0,&quot;rounded&quot;:0};" vertex="1" parent="1">
          <mxGeometry x="770" y="40" width="100" height="870" as="geometry" />
        </mxCell>
        <mxCell id="CCU1psCh6oS6EPcrCbpZ-38" value="" style="html=1;points=[];perimeter=orthogonalPerimeter;outlineConnect=0;targetShapes=umlLifeline;portConstraint=eastwest;newEdgeStyle={&quot;edgeStyle&quot;:&quot;elbowEdgeStyle&quot;,&quot;elbow&quot;:&quot;vertical&quot;,&quot;curved&quot;:0,&quot;rounded&quot;:0};" vertex="1" parent="CCU1psCh6oS6EPcrCbpZ-37">
          <mxGeometry x="45" y="530" width="10" height="200" as="geometry" />
        </mxCell>
      </root>
    </mxGraphModel>
  </diagram>
</mxfile>
