Replace Part R9 CMP-2002-03057-1 in C:\Users\cheidronelab\Documents\Altium\Projects\EnclustraBaseBoard\EnclustraBaseBoard\CurrentSensors.SchDoc with CMP-2002-03057-1 from Resistor1K.IntLib
Replace Part R10 CMP-2002-03057-1 in C:\Users\cheidronelab\Documents\Altium\Projects\EnclustraBaseBoard\EnclustraBaseBoard\CurrentSensors.SchDoc with CMP-2002-03057-1 from Resistor1K.IntLib
Replace Part R12 CMP-2002-03057-1 in C:\Users\cheidronelab\Documents\Altium\Projects\EnclustraBaseBoard\EnclustraBaseBoard\CurrentSensors.SchDoc with CMP-2002-03057-1 from Resistor1K.IntLib
Replace Part R15 CMP-2002-03057-1 in C:\Users\cheidronelab\Documents\Altium\Projects\EnclustraBaseBoard\EnclustraBaseBoard\CurrentSensors.SchDoc with CMP-2002-03057-1 from Resistor1K.IntLib
