%TF.GenerationSoftware,Altium Limited,Altium Designer,20.0.13 (296)*%
G04 Layer_Color=255*
%FSLAX26Y26*%
%MOIN*%
%TF.FileFunction,Pads,Top*%
%TF.Part,Single*%
G01*
G75*
%TA.AperFunction,SMDPad,CuDef*%
G04:AMPARAMS|DCode=12|XSize=43.307mil|YSize=11.811mil|CornerRadius=2.953mil|HoleSize=0mil|Usage=FLASHONLY|Rotation=180.000|XOffset=0mil|YOffset=0mil|HoleType=Round|Shape=RoundedRectangle|*
%AMROUNDEDRECTD12*
21,1,0.043307,0.005905,0,0,180.0*
21,1,0.037401,0.011811,0,0,180.0*
1,1,0.005906,-0.018701,0.002953*
1,1,0.005906,0.018701,0.002953*
1,1,0.005906,0.018701,-0.002953*
1,1,0.005906,-0.018701,-0.002953*
%
%ADD12ROUNDEDRECTD12*%
%ADD13O,0.009842X0.029528*%
%ADD14R,0.027559X0.025591*%
%ADD15R,0.025984X0.024409*%
%ADD16R,0.070866X0.013780*%
%ADD17R,0.025591X0.027559*%
%ADD18R,0.016535X0.024409*%
%ADD19R,0.024409X0.016535*%
%ADD20R,0.043307X0.043307*%
%ADD21R,0.043307X0.043307*%
%ADD22R,0.025591X0.023622*%
%ADD23R,0.055118X0.059055*%
%ADD24R,0.059055X0.055118*%
%ADD25R,0.025591X0.025591*%
%ADD26R,0.044094X0.022835*%
%ADD27R,0.017716X0.017716*%
%ADD28R,0.025591X0.025591*%
%ADD29R,0.029921X0.028346*%
%ADD30R,0.015748X0.035433*%
%ADD31R,0.017716X0.019685*%
G04:AMPARAMS|DCode=32|XSize=7.874mil|YSize=21.654mil|CornerRadius=1.968mil|HoleSize=0mil|Usage=FLASHONLY|Rotation=90.000|XOffset=0mil|YOffset=0mil|HoleType=Round|Shape=RoundedRectangle|*
%AMROUNDEDRECTD32*
21,1,0.007874,0.017716,0,0,90.0*
21,1,0.003937,0.021654,0,0,90.0*
1,1,0.003937,0.008858,0.001968*
1,1,0.003937,0.008858,-0.001968*
1,1,0.003937,-0.008858,-0.001968*
1,1,0.003937,-0.008858,0.001968*
%
%ADD32ROUNDEDRECTD32*%
%ADD33R,0.024409X0.025984*%
%ADD34R,0.027559X0.037402*%
%ADD35O,0.029528X0.009842*%
G04:AMPARAMS|DCode=36|XSize=11.811mil|YSize=23.622mil|CornerRadius=1.949mil|HoleSize=0mil|Usage=FLASHONLY|Rotation=0.000|XOffset=0mil|YOffset=0mil|HoleType=Round|Shape=RoundedRectangle|*
%AMROUNDEDRECTD36*
21,1,0.011811,0.019724,0,0,0.0*
21,1,0.007913,0.023622,0,0,0.0*
1,1,0.003898,0.003957,-0.009862*
1,1,0.003898,-0.003957,-0.009862*
1,1,0.003898,-0.003957,0.009862*
1,1,0.003898,0.003957,0.009862*
%
%ADD36ROUNDEDRECTD36*%
%ADD37R,0.021654X0.019685*%
%ADD38R,0.019685X0.021654*%
%ADD39R,0.098425X0.098425*%
%ADD40R,0.033465X0.025591*%
%ADD41R,0.050000X0.029921*%
G04:AMPARAMS|DCode=42|XSize=43.307mil|YSize=11.811mil|CornerRadius=2.953mil|HoleSize=0mil|Usage=FLASHONLY|Rotation=90.000|XOffset=0mil|YOffset=0mil|HoleType=Round|Shape=RoundedRectangle|*
%AMROUNDEDRECTD42*
21,1,0.043307,0.005905,0,0,90.0*
21,1,0.037401,0.011811,0,0,90.0*
1,1,0.005906,0.002953,0.018701*
1,1,0.005906,0.002953,-0.018701*
1,1,0.005906,-0.002953,-0.018701*
1,1,0.005906,-0.002953,0.018701*
%
%ADD42ROUNDEDRECTD42*%
%ADD43O,0.035433X0.011024*%
%ADD44R,0.053150X0.015748*%
%ADD45R,0.037402X0.027559*%
%ADD46R,0.145669X0.145669*%
%ADD47O,0.011024X0.035433*%
%ADD48R,0.041339X0.025591*%
%ADD49R,0.011811X0.061024*%
%ADD50R,0.047244X0.108268*%
%ADD51R,0.074803X0.059055*%
%ADD52R,0.059055X0.755905*%
%ADD53R,0.011811X0.043307*%
%ADD54R,0.062992X0.122047*%
%ADD55R,0.043307X0.011811*%
%ADD56R,0.122047X0.062992*%
%ADD57R,0.039370X0.047244*%
%ADD58O,0.066929X0.013780*%
%ADD59R,0.029528X0.031496*%
%ADD60O,0.023622X0.009842*%
G04:AMPARAMS|DCode=80|XSize=10mil|YSize=10mil|CornerRadius=0mil|HoleSize=0mil|Usage=FLASHONLY|Rotation=0.000|XOffset=0mil|YOffset=0mil|HoleType=Round|Shape=Octagon|*
%AMOCTAGOND80*
4,1,8,0.005000,-0.002500,0.005000,0.002500,0.002500,0.005000,-0.002500,0.005000,-0.005000,0.002500,-0.005000,-0.002500,-0.002500,-0.005000,0.002500,-0.005000,0.005000,-0.002500,0.0*
%
%ADD80OCTAGOND80*%

%TA.AperFunction,ViaPad*%
%ADD81C,0.157480*%
%ADD82C,0.153543*%
%ADD83C,0.192913*%
%ADD84R,0.177165X0.177165*%
%TA.AperFunction,ComponentPad*%
%ADD85C,0.092520*%
%ADD86R,0.092520X0.092520*%
%ADD87C,0.023622*%
%ADD88C,0.090000*%
%ADD89C,0.072835*%
%ADD90C,0.055118*%
%ADD91R,0.055118X0.055118*%
%ADD92C,0.096457*%
%ADD93C,0.127953*%
%ADD94C,0.043307*%
%ADD95C,0.062992*%
%ADD96C,0.057087*%
%ADD97C,0.041339*%
%ADD98R,0.041339X0.041339*%
%ADD99C,0.059055*%
%ADD100R,0.059055X0.059055*%
%ADD101R,0.061024X0.161417*%
%ADD102R,0.051181X0.139764*%
%ADD103R,0.139764X0.051181*%
%ADD104R,0.055118X0.055118*%
D12*
X1093638Y1582442D02*
D03*
X1298362Y1779292D02*
D03*
Y1936772D02*
D03*
Y2113938D02*
D03*
Y2822600D02*
D03*
Y2861970D02*
D03*
Y2921024D02*
D03*
X1093638Y1720236D02*
D03*
Y2428898D02*
D03*
Y2527324D02*
D03*
Y2724174D02*
D03*
X2748390Y1543070D02*
D03*
X2953114Y1562756D02*
D03*
X2748390D02*
D03*
X2953114Y1582440D02*
D03*
X2748390D02*
D03*
X2953114Y1602126D02*
D03*
X2748390D02*
D03*
X2953114Y1621810D02*
D03*
X2748390D02*
D03*
X2953114Y1641496D02*
D03*
X2748390D02*
D03*
X2953114Y1661180D02*
D03*
X2748390D02*
D03*
X2953114Y1680866D02*
D03*
X2748390D02*
D03*
X2953114Y1700550D02*
D03*
X2748390D02*
D03*
X2953114Y1720236D02*
D03*
X2748390D02*
D03*
X2953114Y1739922D02*
D03*
X2748390D02*
D03*
X2953114Y1759606D02*
D03*
X2748390D02*
D03*
X2953114Y1779292D02*
D03*
X2748390D02*
D03*
X2953114Y1798976D02*
D03*
X2748390D02*
D03*
X2953114Y1818662D02*
D03*
X2748390D02*
D03*
X2953114Y1838346D02*
D03*
X2748390D02*
D03*
X2953114Y1858032D02*
D03*
X2748390D02*
D03*
X2953114Y1877716D02*
D03*
X2748390D02*
D03*
X2953114Y1897402D02*
D03*
X2748390D02*
D03*
X2953114Y1917086D02*
D03*
X2748390D02*
D03*
X2953114Y1936772D02*
D03*
X2748390D02*
D03*
X2953114Y1956456D02*
D03*
X2748390D02*
D03*
X2953114Y1976142D02*
D03*
X2748390D02*
D03*
X2953114Y1995826D02*
D03*
X2748390D02*
D03*
X2953114Y2015512D02*
D03*
X2748390D02*
D03*
X2953114Y2035196D02*
D03*
X2748390D02*
D03*
X2953114Y2054882D02*
D03*
X2748390D02*
D03*
X2953114Y2074566D02*
D03*
X2748390D02*
D03*
X2953114Y2094252D02*
D03*
X2748390D02*
D03*
X2953114Y2113936D02*
D03*
X2748390D02*
D03*
X2953114Y2133622D02*
D03*
X2748390D02*
D03*
X2953114Y2153306D02*
D03*
X2748390D02*
D03*
X2953114Y2172992D02*
D03*
X2748390D02*
D03*
X2953114Y2192676D02*
D03*
X2748390D02*
D03*
X2953114Y2212362D02*
D03*
X2748390D02*
D03*
X2953114Y2232046D02*
D03*
X2748390D02*
D03*
X2953114Y2251732D02*
D03*
X2748390D02*
D03*
X2953114Y2271418D02*
D03*
X2748390D02*
D03*
X2953114Y2291102D02*
D03*
X2748390D02*
D03*
X2953114Y2310788D02*
D03*
X2748390D02*
D03*
X2953114Y2330472D02*
D03*
X2748390D02*
D03*
X2953114Y2350158D02*
D03*
X2748390D02*
D03*
X2953114Y2369842D02*
D03*
X2748390D02*
D03*
X2953114Y2389528D02*
D03*
X2748390D02*
D03*
X2953114Y2409212D02*
D03*
X2748390D02*
D03*
X2953114Y2428898D02*
D03*
X2748390D02*
D03*
X2953114Y2448582D02*
D03*
X2748390D02*
D03*
X2953114Y2468268D02*
D03*
X2748390D02*
D03*
X2953114Y2487952D02*
D03*
X2748390D02*
D03*
X2953114Y2507638D02*
D03*
X2748390D02*
D03*
X2953114Y2527322D02*
D03*
X2748390D02*
D03*
X2953114Y2547008D02*
D03*
X2748390D02*
D03*
X2953114Y2566692D02*
D03*
X2748390D02*
D03*
X2953114Y2586378D02*
D03*
X2748390D02*
D03*
X2953114Y2606062D02*
D03*
X2748390D02*
D03*
X2953114Y2625748D02*
D03*
X2748390D02*
D03*
X2953114Y2645432D02*
D03*
X2748390D02*
D03*
X2953114Y2665118D02*
D03*
X2748390D02*
D03*
X2953114Y2684802D02*
D03*
X2748390D02*
D03*
X2953114Y2704488D02*
D03*
X2748390D02*
D03*
X2953114Y2724172D02*
D03*
X2748390D02*
D03*
X2953114Y2743858D02*
D03*
X2748390D02*
D03*
X2953114Y2763544D02*
D03*
X2748390D02*
D03*
X2953114Y2783228D02*
D03*
X2748390D02*
D03*
X2953114Y2802914D02*
D03*
X2748390D02*
D03*
X2953114Y2822598D02*
D03*
X2748390D02*
D03*
X2953114Y2842284D02*
D03*
X2748390D02*
D03*
X2953114Y2861968D02*
D03*
X2748390D02*
D03*
X2953114Y2881654D02*
D03*
X2748390D02*
D03*
X2953114Y2901338D02*
D03*
X2748390D02*
D03*
X2953114Y2921024D02*
D03*
X2748390D02*
D03*
X2953114Y2940708D02*
D03*
X2748390D02*
D03*
X2953114Y2960394D02*
D03*
X2748390D02*
D03*
X2953114Y2980078D02*
D03*
X2748390D02*
D03*
X2953114Y2999764D02*
D03*
X2748390D02*
D03*
X2953114Y3019448D02*
D03*
X2748390D02*
D03*
X2953114Y3039134D02*
D03*
X2748390D02*
D03*
X2953114Y3058818D02*
D03*
X2748390D02*
D03*
X2953114Y3078504D02*
D03*
X2748390D02*
D03*
X2953114Y3098188D02*
D03*
X2748390D02*
D03*
X2953114Y3117874D02*
D03*
X2748390D02*
D03*
X2953114Y3137558D02*
D03*
X2748390D02*
D03*
X2953114Y3157244D02*
D03*
X2748390D02*
D03*
X2953114Y3176928D02*
D03*
X2748390D02*
D03*
X1093638Y1543072D02*
D03*
X1298362Y1562756D02*
D03*
X1093638D02*
D03*
X1298362Y1582442D02*
D03*
Y1602126D02*
D03*
X1093638D02*
D03*
X1298362Y1621812D02*
D03*
X1093638D02*
D03*
X1298362Y1641496D02*
D03*
X1093638D02*
D03*
X1298362Y1661182D02*
D03*
X1093638D02*
D03*
X1298362Y1680866D02*
D03*
X1093638D02*
D03*
X1298362Y1700552D02*
D03*
X1093638D02*
D03*
X1298362Y1720236D02*
D03*
Y1739922D02*
D03*
X1093638D02*
D03*
X1298362Y1759608D02*
D03*
X1093638D02*
D03*
Y1779292D02*
D03*
X1298362Y1798978D02*
D03*
X1093638D02*
D03*
X1298362Y1818662D02*
D03*
X1093638D02*
D03*
X1298362Y1838348D02*
D03*
X1093638D02*
D03*
X1298362Y1858032D02*
D03*
X1093638D02*
D03*
X1298362Y1877718D02*
D03*
Y1897402D02*
D03*
X1093638D02*
D03*
X1298362Y1917088D02*
D03*
X1093638D02*
D03*
Y1936772D02*
D03*
X1298362Y1956458D02*
D03*
X1093638D02*
D03*
X1298362Y1976142D02*
D03*
X1093638D02*
D03*
X1298362Y1995828D02*
D03*
X1093638D02*
D03*
X1298362Y2015512D02*
D03*
X1093638D02*
D03*
X1298362Y2035198D02*
D03*
X1093638D02*
D03*
X1298362Y2054882D02*
D03*
X1093638D02*
D03*
X1298362Y2074568D02*
D03*
X1093638D02*
D03*
X1298362Y2094252D02*
D03*
X1093638D02*
D03*
Y2113938D02*
D03*
X1298362Y2133622D02*
D03*
X1093638D02*
D03*
X1298362Y2153308D02*
D03*
X1093638D02*
D03*
X1298362Y2172992D02*
D03*
X1093638D02*
D03*
X1298362Y2192678D02*
D03*
X1093638D02*
D03*
X1298362Y2212362D02*
D03*
X1093638D02*
D03*
X1298362Y2232048D02*
D03*
X1093638D02*
D03*
X1298362Y2251734D02*
D03*
X1093638D02*
D03*
X1298362Y2271418D02*
D03*
X1093638D02*
D03*
X1298362Y2291104D02*
D03*
X1093638D02*
D03*
X1298362Y2310788D02*
D03*
X1093638D02*
D03*
X1298362Y2330474D02*
D03*
X1093638D02*
D03*
X1298362Y2350158D02*
D03*
X1093638D02*
D03*
X1298362Y2369844D02*
D03*
X1093638D02*
D03*
X1298362Y2389528D02*
D03*
X1093638D02*
D03*
X1298362Y2409214D02*
D03*
X1093638D02*
D03*
X1298362Y2428898D02*
D03*
Y2448584D02*
D03*
X1093638D02*
D03*
X1298362Y2468268D02*
D03*
X1093638D02*
D03*
X1298362Y2487954D02*
D03*
X1093638D02*
D03*
X1298362Y2507638D02*
D03*
X1093638D02*
D03*
X1298362Y2527324D02*
D03*
Y2547008D02*
D03*
X1093638D02*
D03*
X1298362Y2566694D02*
D03*
X1093638D02*
D03*
X1298362Y2586378D02*
D03*
X1093638D02*
D03*
X1298362Y2606064D02*
D03*
X1093638D02*
D03*
X1298362Y2625748D02*
D03*
X1093638D02*
D03*
X1298362Y2645434D02*
D03*
X1093638D02*
D03*
X1298362Y2665118D02*
D03*
X1093638D02*
D03*
X1298362Y2684804D02*
D03*
X1093638D02*
D03*
X1298362Y2704488D02*
D03*
X1093638D02*
D03*
X1298362Y2724174D02*
D03*
Y2743860D02*
D03*
X1093638D02*
D03*
X1298362Y2763544D02*
D03*
X1093638D02*
D03*
X1298362Y2783230D02*
D03*
X1093638D02*
D03*
X1298362Y2802914D02*
D03*
X1093638D02*
D03*
Y2822600D02*
D03*
X1298362Y2842284D02*
D03*
X1093638D02*
D03*
Y2861970D02*
D03*
X1298362Y2881654D02*
D03*
X1093638D02*
D03*
X1298362Y2901340D02*
D03*
X1093638D02*
D03*
Y2921024D02*
D03*
X1298362Y2940710D02*
D03*
X1093638D02*
D03*
X1298362Y2960394D02*
D03*
X1093638D02*
D03*
X1298362Y2980080D02*
D03*
X1093638D02*
D03*
X1298362Y2999764D02*
D03*
X1093638D02*
D03*
X1298362Y3019450D02*
D03*
X1093638D02*
D03*
X1298362Y3039134D02*
D03*
X1093638D02*
D03*
X1298362Y3058820D02*
D03*
X1093638D02*
D03*
X1298362Y3078504D02*
D03*
X1093638D02*
D03*
X1298362Y3098190D02*
D03*
X1093638D02*
D03*
X1298362Y3117874D02*
D03*
X1093638D02*
D03*
X1298362Y3137560D02*
D03*
X1093638D02*
D03*
X1298362Y3157244D02*
D03*
X1093638D02*
D03*
X1298362Y3176930D02*
D03*
X1093638D02*
D03*
Y1877718D02*
D03*
D13*
X2228534Y1634826D02*
D03*
X2248218D02*
D03*
X2189164Y1475378D02*
D03*
X2208848D02*
D03*
X2228534D02*
D03*
X2248218D02*
D03*
X2267904D02*
D03*
X2287588D02*
D03*
Y1634826D02*
D03*
X2267904D02*
D03*
X2208848D02*
D03*
X2189164D02*
D03*
D14*
X1442200Y1457000D02*
D03*
X1404800D02*
D03*
X1437600Y1550000D02*
D03*
X1400200D02*
D03*
X3638700Y1131400D02*
D03*
X3676100D02*
D03*
X3636600Y1262100D02*
D03*
X3674000D02*
D03*
X3636600Y1217000D02*
D03*
X3674000D02*
D03*
X3637400Y1304000D02*
D03*
X3674800D02*
D03*
X2062000Y1862100D02*
D03*
X2024600D02*
D03*
X2091000Y1951800D02*
D03*
X2053600D02*
D03*
X2091100Y1999400D02*
D03*
X2053700D02*
D03*
X2158900Y3328600D02*
D03*
X2196300D02*
D03*
X3593000Y1080200D02*
D03*
X3630400D02*
D03*
X2129100Y2425800D02*
D03*
X2091700D02*
D03*
X2130800Y2470700D02*
D03*
X2093400D02*
D03*
X2116300Y3087700D02*
D03*
X2078900D02*
D03*
X3448900Y1497200D02*
D03*
X3411500D02*
D03*
X3449000Y1456700D02*
D03*
X3411600D02*
D03*
X2340600Y1450100D02*
D03*
X2378000D02*
D03*
X2599800Y1429000D02*
D03*
X2562400D02*
D03*
X3674902Y1350600D02*
D03*
X3637500D02*
D03*
X2879800Y906300D02*
D03*
X2842400D02*
D03*
D15*
X1442322Y1412900D02*
D03*
X1407678D02*
D03*
X1439722Y1506600D02*
D03*
X1405078D02*
D03*
X1882900Y2641800D02*
D03*
X1848256D02*
D03*
X1886100Y3338900D02*
D03*
X1851456D02*
D03*
X2630400Y1341800D02*
D03*
X2595756D02*
D03*
X2630300Y1384500D02*
D03*
X2595656D02*
D03*
D16*
X1804520Y709858D02*
D03*
Y678362D02*
D03*
Y583874D02*
D03*
Y615370D02*
D03*
Y300410D02*
D03*
Y331906D02*
D03*
Y205922D02*
D03*
Y237418D02*
D03*
X1705306Y662614D02*
D03*
Y694110D02*
D03*
Y568126D02*
D03*
Y599622D02*
D03*
Y190174D02*
D03*
Y221670D02*
D03*
Y158678D02*
D03*
Y253166D02*
D03*
Y284662D02*
D03*
Y316158D02*
D03*
Y347654D02*
D03*
Y379150D02*
D03*
Y410646D02*
D03*
Y442142D02*
D03*
Y473638D02*
D03*
Y505134D02*
D03*
Y536630D02*
D03*
Y631118D02*
D03*
Y725606D02*
D03*
X1804520Y741354D02*
D03*
Y646866D02*
D03*
Y552378D02*
D03*
Y520882D02*
D03*
Y489386D02*
D03*
Y457890D02*
D03*
Y426394D02*
D03*
Y394898D02*
D03*
Y363402D02*
D03*
Y268914D02*
D03*
Y174426D02*
D03*
D17*
X3519200Y987800D02*
D03*
Y950400D02*
D03*
X2391200Y2187100D02*
D03*
Y2224500D02*
D03*
X2391400Y1681600D02*
D03*
Y1644200D02*
D03*
X2437500Y1683100D02*
D03*
Y1645700D02*
D03*
X2109300Y1499100D02*
D03*
Y1536500D02*
D03*
X3010700Y1898600D02*
D03*
Y1936000D02*
D03*
X1852400Y3557200D02*
D03*
Y3594600D02*
D03*
D18*
X2045046Y1907400D02*
D03*
X2088354D02*
D03*
X1658746Y3692800D02*
D03*
X1702054D02*
D03*
X3875954Y1611500D02*
D03*
X3832646D02*
D03*
D19*
X1740500Y3663246D02*
D03*
Y3706554D02*
D03*
X2453700Y3206746D02*
D03*
Y3250054D02*
D03*
X2457400Y2647946D02*
D03*
Y2691254D02*
D03*
X2406600Y1518446D02*
D03*
Y1561754D02*
D03*
X2112400Y1390946D02*
D03*
Y1434254D02*
D03*
X2208700Y1727854D02*
D03*
Y1684546D02*
D03*
X2147400Y2866654D02*
D03*
Y2823346D02*
D03*
D20*
X1909200Y2905820D02*
D03*
Y2957000D02*
D03*
Y3040920D02*
D03*
Y3092100D02*
D03*
X235600Y246770D02*
D03*
Y168030D02*
D03*
D21*
X1615410Y3433100D02*
D03*
X1666590D02*
D03*
X1750810Y3433000D02*
D03*
X1801990D02*
D03*
D22*
X232100Y63600D02*
D03*
Y101000D02*
D03*
D23*
X1801598Y2802000D02*
D03*
X1876402D02*
D03*
D24*
X1952678Y2719166D02*
D03*
Y2644362D02*
D03*
X1772500Y3197598D02*
D03*
Y3272402D02*
D03*
X1966900Y3238698D02*
D03*
Y3313502D02*
D03*
X2477600Y1477998D02*
D03*
Y1552802D02*
D03*
X2174700Y1334698D02*
D03*
Y1409502D02*
D03*
X2269000Y1773202D02*
D03*
Y1698398D02*
D03*
D25*
X3628600Y1044784D02*
D03*
Y1005414D02*
D03*
X3453000Y2355784D02*
D03*
Y2316414D02*
D03*
X3407200Y2355300D02*
D03*
Y2315930D02*
D03*
X3091300Y2122084D02*
D03*
Y2082714D02*
D03*
Y2208284D02*
D03*
Y2168914D02*
D03*
X3092100Y2293886D02*
D03*
Y2254516D02*
D03*
D26*
X2405938Y2905400D02*
D03*
Y2955400D02*
D03*
Y3005400D02*
D03*
Y3055400D02*
D03*
Y3105400D02*
D03*
Y3155400D02*
D03*
Y3205400D02*
D03*
Y3255400D02*
D03*
X2198064Y2905400D02*
D03*
Y2955400D02*
D03*
Y3005400D02*
D03*
Y3055400D02*
D03*
Y3105400D02*
D03*
Y3155400D02*
D03*
Y3205400D02*
D03*
Y3255400D02*
D03*
X2200764Y2694500D02*
D03*
Y2644500D02*
D03*
Y2594500D02*
D03*
Y2544500D02*
D03*
Y2494500D02*
D03*
Y2444500D02*
D03*
Y2394500D02*
D03*
Y2344500D02*
D03*
X2408638Y2694500D02*
D03*
Y2644500D02*
D03*
Y2594500D02*
D03*
Y2544500D02*
D03*
Y2494500D02*
D03*
Y2444500D02*
D03*
Y2394500D02*
D03*
Y2344500D02*
D03*
D27*
X2148248Y2632100D02*
D03*
X2116752D02*
D03*
X2128500Y3200400D02*
D03*
X2097004D02*
D03*
X1850004Y3153300D02*
D03*
X1881500D02*
D03*
X1849552Y3187500D02*
D03*
X1881048D02*
D03*
X88096Y1381800D02*
D03*
X56600D02*
D03*
X88096Y1417500D02*
D03*
X56600D02*
D03*
X94500Y2103900D02*
D03*
X63004D02*
D03*
X94800Y2141800D02*
D03*
X63304D02*
D03*
X1861852Y1664300D02*
D03*
X1893348D02*
D03*
X1861852Y1698300D02*
D03*
X1893348D02*
D03*
X95500Y2841100D02*
D03*
X64004D02*
D03*
X1840252Y2403500D02*
D03*
X1871748D02*
D03*
X95548Y2875900D02*
D03*
X64052D02*
D03*
X1840952Y2439100D02*
D03*
X1872448D02*
D03*
D28*
X2101100Y2592400D02*
D03*
X2140470D02*
D03*
X2088716Y3161300D02*
D03*
X2128086D02*
D03*
X2091416Y2379900D02*
D03*
X2130786D02*
D03*
X2092716Y2516800D02*
D03*
X2132086D02*
D03*
X3657930Y2214700D02*
D03*
X3697300D02*
D03*
X3316016Y2064200D02*
D03*
X3355386D02*
D03*
X3176370Y2070600D02*
D03*
X3137000D02*
D03*
D29*
X2006898Y2956100D02*
D03*
X1969102D02*
D03*
X3880498Y894700D02*
D03*
X3842702D02*
D03*
X3873196Y1565200D02*
D03*
X3835400D02*
D03*
D30*
X2072410Y3035008D02*
D03*
X2098000D02*
D03*
X2123590D02*
D03*
Y2948392D02*
D03*
X2098000D02*
D03*
X2072410D02*
D03*
D31*
X168800Y212236D02*
D03*
Y241764D02*
D03*
D32*
X2461326Y1384042D02*
D03*
Y1403728D02*
D03*
X2326852Y1345914D02*
D03*
Y1365600D02*
D03*
X2461326Y1364358D02*
D03*
Y1344672D02*
D03*
X2514474D02*
D03*
Y1364358D02*
D03*
Y1384042D02*
D03*
Y1403728D02*
D03*
X2326852Y1404970D02*
D03*
Y1385284D02*
D03*
X2380000Y1345914D02*
D03*
Y1365600D02*
D03*
Y1385284D02*
D03*
Y1404970D02*
D03*
D33*
X2346900Y1681022D02*
D03*
Y1646378D02*
D03*
X2481300Y1680822D02*
D03*
Y1646178D02*
D03*
X300000Y141678D02*
D03*
X335000D02*
D03*
X419000Y732678D02*
D03*
Y767322D02*
D03*
X453000Y732678D02*
D03*
Y767322D02*
D03*
X537000Y732678D02*
D03*
Y767322D02*
D03*
X571000Y732678D02*
D03*
Y767322D02*
D03*
X655000Y732678D02*
D03*
Y767322D02*
D03*
X689000Y732678D02*
D03*
Y767322D02*
D03*
X774000Y782678D02*
D03*
Y817322D02*
D03*
X808000Y782678D02*
D03*
Y817322D02*
D03*
X300000Y176322D02*
D03*
X335000D02*
D03*
D34*
X2556600Y1560280D02*
D03*
Y1495320D02*
D03*
X2255500Y1415580D02*
D03*
Y1350620D02*
D03*
X2158600Y1694340D02*
D03*
Y1759300D02*
D03*
X3699600Y2292020D02*
D03*
Y2356980D02*
D03*
X3647900Y2291820D02*
D03*
Y2356780D02*
D03*
X3500984Y2164370D02*
D03*
Y2229330D02*
D03*
D35*
X2158652Y1505890D02*
D03*
Y1525574D02*
D03*
X2318100Y1505890D02*
D03*
Y1525574D02*
D03*
X2158652Y1604314D02*
D03*
Y1584630D02*
D03*
Y1564944D02*
D03*
Y1545260D02*
D03*
X2318100D02*
D03*
Y1564944D02*
D03*
Y1584630D02*
D03*
Y1604314D02*
D03*
D36*
X2487900Y1338766D02*
D03*
Y1409634D02*
D03*
X2353426Y1340008D02*
D03*
Y1410876D02*
D03*
D37*
X2034000Y1576500D02*
D03*
X2004472D02*
D03*
X3249836Y2065800D02*
D03*
X3279364D02*
D03*
D38*
X2099500Y1597136D02*
D03*
Y1626664D02*
D03*
D39*
X2238376Y1555102D02*
D03*
D40*
X2003188Y1536280D02*
D03*
Y1471320D02*
D03*
X2064212D02*
D03*
Y1536280D02*
D03*
D41*
X3532000Y1031200D02*
D03*
Y1081200D02*
D03*
Y1131200D02*
D03*
Y1181200D02*
D03*
Y1231200D02*
D03*
Y1281200D02*
D03*
Y1331200D02*
D03*
Y1381200D02*
D03*
X3232000D02*
D03*
Y1331200D02*
D03*
Y1281200D02*
D03*
Y1231200D02*
D03*
Y1181200D02*
D03*
Y1131200D02*
D03*
Y1081200D02*
D03*
Y1031200D02*
D03*
D42*
X2210364Y1169362D02*
D03*
X2013514D02*
D03*
X2111940D02*
D03*
X1974144D02*
D03*
X1600128Y964638D02*
D03*
X1521388D02*
D03*
X1442648D02*
D03*
X1363908D02*
D03*
X1836348D02*
D03*
X1206428Y1169362D02*
D03*
X1226112Y964638D02*
D03*
Y1169362D02*
D03*
X1245798Y964638D02*
D03*
Y1169362D02*
D03*
X1265482Y964638D02*
D03*
Y1169362D02*
D03*
X1285168Y964638D02*
D03*
Y1169362D02*
D03*
X1304852Y964638D02*
D03*
Y1169362D02*
D03*
X1324538Y964638D02*
D03*
Y1169362D02*
D03*
X1344222Y964638D02*
D03*
Y1169362D02*
D03*
X1363908D02*
D03*
X1383592Y964638D02*
D03*
Y1169362D02*
D03*
X1403278Y964638D02*
D03*
Y1169362D02*
D03*
X1422962Y964638D02*
D03*
Y1169362D02*
D03*
X1442648D02*
D03*
X1462332Y964638D02*
D03*
Y1169362D02*
D03*
X1482018Y964638D02*
D03*
Y1169362D02*
D03*
X1501702Y964638D02*
D03*
Y1169362D02*
D03*
X1521388D02*
D03*
X1541072Y964638D02*
D03*
Y1169362D02*
D03*
X1560758Y964638D02*
D03*
Y1169362D02*
D03*
X1580444Y964638D02*
D03*
Y1169362D02*
D03*
X1600128D02*
D03*
X1619814Y964638D02*
D03*
Y1169362D02*
D03*
X1639498Y964638D02*
D03*
Y1169362D02*
D03*
X1659184Y964638D02*
D03*
Y1169362D02*
D03*
X1678868Y964638D02*
D03*
Y1169362D02*
D03*
X1698554Y964638D02*
D03*
Y1169362D02*
D03*
X1718238Y964638D02*
D03*
Y1169362D02*
D03*
X1737924Y964638D02*
D03*
Y1169362D02*
D03*
X1757608Y964638D02*
D03*
Y1169362D02*
D03*
X1777294Y964638D02*
D03*
Y1169362D02*
D03*
X1796978Y964638D02*
D03*
Y1169362D02*
D03*
X1816664Y964638D02*
D03*
Y1169362D02*
D03*
X1836348D02*
D03*
X1856034Y964638D02*
D03*
Y1169362D02*
D03*
X1875718Y964638D02*
D03*
Y1169362D02*
D03*
X1895404Y964638D02*
D03*
Y1169362D02*
D03*
X1915088Y964638D02*
D03*
Y1169362D02*
D03*
X1934774Y964638D02*
D03*
Y1169362D02*
D03*
X1954458Y964638D02*
D03*
Y1169362D02*
D03*
X1974144Y964638D02*
D03*
X1993828D02*
D03*
Y1169362D02*
D03*
X2013514Y964638D02*
D03*
X2033198D02*
D03*
Y1169362D02*
D03*
X2052884Y964638D02*
D03*
Y1169362D02*
D03*
X2072570Y964638D02*
D03*
Y1169362D02*
D03*
X2092254Y964638D02*
D03*
Y1169362D02*
D03*
X2111940Y964638D02*
D03*
X2131624D02*
D03*
Y1169362D02*
D03*
X2151310Y964638D02*
D03*
Y1169362D02*
D03*
X2170994Y964638D02*
D03*
Y1169362D02*
D03*
X2190680Y964638D02*
D03*
Y1169362D02*
D03*
X2210364Y964638D02*
D03*
X2230050D02*
D03*
Y1169362D02*
D03*
X2249734Y964638D02*
D03*
Y1169362D02*
D03*
X2269420Y964638D02*
D03*
Y1169362D02*
D03*
X2289104Y964638D02*
D03*
Y1169362D02*
D03*
X2308790Y964638D02*
D03*
Y1169362D02*
D03*
X2328474Y964638D02*
D03*
Y1169362D02*
D03*
X2348160Y964638D02*
D03*
Y1169362D02*
D03*
X2367844Y964638D02*
D03*
Y1169362D02*
D03*
X2387530Y964638D02*
D03*
Y1169362D02*
D03*
X2407214Y964638D02*
D03*
Y1169362D02*
D03*
X2426900Y964638D02*
D03*
Y1169362D02*
D03*
X2446584Y964638D02*
D03*
Y1169362D02*
D03*
X2466270Y964638D02*
D03*
Y1169362D02*
D03*
X2485954Y964638D02*
D03*
Y1169362D02*
D03*
X2505640Y964638D02*
D03*
Y1169362D02*
D03*
X2525324Y964638D02*
D03*
Y1169362D02*
D03*
X2545010Y964638D02*
D03*
Y1169362D02*
D03*
X2564696Y964638D02*
D03*
Y1169362D02*
D03*
X2584380Y964638D02*
D03*
Y1169362D02*
D03*
X2604066Y964638D02*
D03*
Y1169362D02*
D03*
X2623750Y964638D02*
D03*
Y1169362D02*
D03*
X2643436Y964638D02*
D03*
Y1169362D02*
D03*
X2663120Y964638D02*
D03*
Y1169362D02*
D03*
X2682806Y964638D02*
D03*
Y1169362D02*
D03*
X2702490Y964638D02*
D03*
Y1169362D02*
D03*
X2722176Y964638D02*
D03*
Y1169362D02*
D03*
X2741860Y964638D02*
D03*
Y1169362D02*
D03*
X2761546Y964638D02*
D03*
Y1169362D02*
D03*
X2781230Y964638D02*
D03*
Y1169362D02*
D03*
X2800916Y964638D02*
D03*
Y1169362D02*
D03*
X2820600Y964638D02*
D03*
Y1169362D02*
D03*
X2840286Y964638D02*
D03*
Y1169362D02*
D03*
D43*
X3363190Y2142718D02*
D03*
Y2162402D02*
D03*
Y2182088D02*
D03*
Y2201772D02*
D03*
X3146654Y2142718D02*
D03*
Y2162402D02*
D03*
Y2182088D02*
D03*
Y2201772D02*
D03*
Y2221458D02*
D03*
Y2241144D02*
D03*
Y2260828D02*
D03*
Y2280514D02*
D03*
Y2300198D02*
D03*
X3363190D02*
D03*
Y2280514D02*
D03*
Y2260828D02*
D03*
Y2241144D02*
D03*
Y2221458D02*
D03*
D44*
X3755800Y2167336D02*
D03*
Y2192926D02*
D03*
Y2244108D02*
D03*
Y2218516D02*
D03*
Y2141746D02*
D03*
D45*
X3775880Y1993800D02*
D03*
X3710920D02*
D03*
D46*
X3254922Y2221458D02*
D03*
D47*
X3333662Y2113190D02*
D03*
X3313978D02*
D03*
X3294292D02*
D03*
X3274606D02*
D03*
X3254922D02*
D03*
X3235236D02*
D03*
X3215552D02*
D03*
X3195866D02*
D03*
X3176182D02*
D03*
Y2329726D02*
D03*
X3195866D02*
D03*
X3215552D02*
D03*
X3235236D02*
D03*
X3254922D02*
D03*
X3274606D02*
D03*
X3294292D02*
D03*
X3313978D02*
D03*
X3333662D02*
D03*
D48*
X3640292Y2091402D02*
D03*
Y2054000D02*
D03*
Y2016598D02*
D03*
X3551708D02*
D03*
Y2054000D02*
D03*
Y2091402D02*
D03*
D49*
X839174Y301378D02*
D03*
X819488D02*
D03*
X799804D02*
D03*
X780118D02*
D03*
X760434D02*
D03*
X740748D02*
D03*
X721064D02*
D03*
X701378D02*
D03*
X681692D02*
D03*
X662008D02*
D03*
X642322D02*
D03*
X622638D02*
D03*
X602952D02*
D03*
X583268D02*
D03*
X563582D02*
D03*
X543898D02*
D03*
X524212D02*
D03*
X504528D02*
D03*
X484842D02*
D03*
X465158D02*
D03*
X445472D02*
D03*
X425788D02*
D03*
X406102D02*
D03*
X386418D02*
D03*
X366732D02*
D03*
X347048D02*
D03*
X327362D02*
D03*
X307678D02*
D03*
X287992D02*
D03*
X189566D02*
D03*
X169882D02*
D03*
X150196D02*
D03*
X130512D02*
D03*
X110826D02*
D03*
X829330Y598622D02*
D03*
X809646D02*
D03*
X789960D02*
D03*
X770276D02*
D03*
X750590D02*
D03*
X730906D02*
D03*
X711220D02*
D03*
X691536D02*
D03*
X671850D02*
D03*
X652166D02*
D03*
X632480D02*
D03*
X612796D02*
D03*
X593110D02*
D03*
X573426D02*
D03*
X553740D02*
D03*
X534056D02*
D03*
X514370D02*
D03*
X494686D02*
D03*
X475000D02*
D03*
X455316D02*
D03*
X435630D02*
D03*
X415944D02*
D03*
X396260D02*
D03*
X376574D02*
D03*
X356890D02*
D03*
X337204D02*
D03*
X317520D02*
D03*
X297834D02*
D03*
X278150D02*
D03*
X179724D02*
D03*
X160040D02*
D03*
X140354D02*
D03*
X120670D02*
D03*
D50*
X882480Y331890D02*
D03*
X67520D02*
D03*
D51*
X3862100Y2232296D02*
D03*
Y2153556D02*
D03*
D52*
X2252156Y450016D02*
D03*
D53*
X1206428Y964638D02*
D03*
D54*
X2966270Y1067000D02*
D03*
X1080444D02*
D03*
D55*
X2953114Y1543070D02*
D03*
X1298362Y1543072D02*
D03*
D56*
X2850752Y3302914D02*
D03*
Y1417086D02*
D03*
X1196000Y3302914D02*
D03*
Y1417088D02*
D03*
D57*
X3811936Y1498036D02*
D03*
X3878864D02*
D03*
X3811936Y1277564D02*
D03*
X3878864D02*
D03*
X3883064Y969964D02*
D03*
X3816136D02*
D03*
X3883064Y1190438D02*
D03*
X3816136D02*
D03*
D58*
X2390604Y1855752D02*
D03*
Y1881342D02*
D03*
Y1906934D02*
D03*
Y1932524D02*
D03*
Y1958114D02*
D03*
Y1983704D02*
D03*
Y2009296D02*
D03*
Y2034886D02*
D03*
Y2060476D02*
D03*
Y2086068D02*
D03*
Y2111658D02*
D03*
Y2137248D02*
D03*
X2166196Y1855752D02*
D03*
Y1881342D02*
D03*
Y1906934D02*
D03*
Y1932524D02*
D03*
Y1958114D02*
D03*
Y1983704D02*
D03*
Y2009296D02*
D03*
Y2034886D02*
D03*
Y2060476D02*
D03*
Y2086068D02*
D03*
Y2111658D02*
D03*
Y2137248D02*
D03*
D59*
X3875400Y1695938D02*
D03*
Y1650662D02*
D03*
D60*
X1945744Y1673528D02*
D03*
Y1653842D02*
D03*
Y1634158D02*
D03*
Y1614472D02*
D03*
X2063856Y1673528D02*
D03*
Y1653842D02*
D03*
Y1634158D02*
D03*
Y1614472D02*
D03*
D80*
X702700Y3227100D02*
D03*
X505300Y3349300D02*
D03*
X313500Y3384100D02*
D03*
D81*
X475000Y3576200D02*
D03*
D82*
X1848000Y2093000D02*
D03*
D83*
X1354000Y145000D02*
D03*
X240000Y910000D02*
D03*
X155000Y3780000D02*
D03*
D84*
X2996000Y3701000D02*
D03*
D85*
X2547800Y681840D02*
D03*
D86*
Y161760D02*
D03*
D87*
X3850400Y3279544D02*
D03*
Y3397656D02*
D03*
D88*
X3582900Y1689600D02*
D03*
Y1889600D02*
D03*
X3682900Y1789600D02*
D03*
X3782900Y1689600D02*
D03*
Y1889600D02*
D03*
D89*
X3704842Y3013008D02*
D03*
Y2912614D02*
D03*
Y2589780D02*
D03*
Y2489386D02*
D03*
D90*
X3295000Y2976000D02*
D03*
X3195000Y2926000D02*
D03*
X3295000Y2876000D02*
D03*
X3195000Y2826000D02*
D03*
X3295000Y2776000D02*
D03*
X3195000Y2726000D02*
D03*
X3295000Y2676000D02*
D03*
X3195000Y2626000D02*
D03*
X3295000Y2576000D02*
D03*
X3400680Y3253860D02*
D03*
X3321940D02*
D03*
X3400680Y3332600D02*
D03*
X3321940D02*
D03*
X3243200D02*
D03*
X3558160Y3253860D02*
D03*
X3636900D02*
D03*
X3715640D02*
D03*
Y3332600D02*
D03*
X3636900D02*
D03*
X3558160D02*
D03*
X3479420Y3253860D02*
D03*
Y3332600D02*
D03*
D91*
X3195000Y2526000D02*
D03*
D92*
X3424922Y3060252D02*
D03*
Y2441748D02*
D03*
D93*
X3545000Y2976000D02*
D03*
Y2526000D02*
D03*
D94*
X868700Y509056D02*
D03*
D95*
X81300D02*
D03*
X3370660Y76000D02*
D03*
X3016330D02*
D03*
X2662000D02*
D03*
X2307668D02*
D03*
X1886408D02*
D03*
X3193496Y824032D02*
D03*
X2839164D02*
D03*
X2484834D02*
D03*
X2130504D02*
D03*
X1709244D02*
D03*
X1591134Y253166D02*
D03*
Y536630D02*
D03*
D96*
X3755800Y2094500D02*
D03*
Y2291352D02*
D03*
D97*
X3579000Y2181000D02*
D03*
Y2231000D02*
D03*
Y2281000D02*
D03*
X3382300Y1986300D02*
D03*
X3332300D02*
D03*
X3382300Y1936300D02*
D03*
X3332300D02*
D03*
X3282300Y1986300D02*
D03*
X3232300D02*
D03*
X3282300Y1936300D02*
D03*
X3232300D02*
D03*
X3182300Y1986300D02*
D03*
Y1936300D02*
D03*
X3381200Y1677900D02*
D03*
X3331200D02*
D03*
X3381200Y1627900D02*
D03*
X3331200D02*
D03*
X3281200Y1677900D02*
D03*
X3231200D02*
D03*
X3281200Y1627900D02*
D03*
X3231200D02*
D03*
X3181200Y1677900D02*
D03*
Y1627900D02*
D03*
X3180600Y1784100D02*
D03*
Y1834100D02*
D03*
X3230600Y1784100D02*
D03*
X3280600D02*
D03*
X3230600Y1834100D02*
D03*
X3280600D02*
D03*
X3330600Y1784100D02*
D03*
X3380600D02*
D03*
X3330600Y1834100D02*
D03*
X3380600D02*
D03*
D98*
X3579000Y2331000D02*
D03*
D99*
X3270600Y3840500D02*
D03*
Y3740500D02*
D03*
D100*
Y3640500D02*
D03*
D101*
X3441136Y3693500D02*
D03*
D102*
X3687200D02*
D03*
D103*
X3559246Y3882476D02*
D03*
D104*
X3243200Y3253860D02*
D03*
%TF.MD5,2199dae462262871e8b1c7441396cacc*%
M02*
