Removed Parameter LatestRevisionDate:29-May-2009 from Part R29
Removed Parameter LatestRevisionDate:29-May-2009 from Part R31
Removed Parameter LatestRevisionDate:29-May-2009 from Part R34
Removed Parameter LatestRevisionDate:29-May-2009 from Part R35
Removed Parameter LatestRevisionDate:29-May-2009 from Part R36
Removed Parameter LatestRevisionDate:29-May-2009 from Part R37
Removed Parameter LatestRevisionNote:IPC-7351 Footprint Added. from Part R29
Removed Parameter LatestRevisionNote:IPC-7351 Footprint Added. from Part R31
Removed Parameter LatestRevisionNote:IPC-7351 Footprint Added. from Part R34
Removed Parameter LatestRevisionNote:IPC-7351 Footprint Added. from Part R35
Removed Parameter LatestRevisionNote:IPC-7351 Footprint Added. from Part R36
Removed Parameter LatestRevisionNote:IPC-7351 Footprint Added. from Part R37
Removed Parameter Published:8-Jun-2000 from Part R29
Removed Parameter Published:8-Jun-2000 from Part R31
Removed Parameter Published:8-Jun-2000 from Part R34
Removed Parameter Published:8-Jun-2000 from Part R35
Removed Parameter Published:8-Jun-2000 from Part R36
Removed Parameter Published:8-Jun-2000 from Part R37
Removed Parameter Publisher:Altium Limited from Part R29
Removed Parameter Publisher:Altium Limited from Part R31
Removed Parameter Publisher:Altium Limited from Part R34
Removed Parameter Publisher:Altium Limited from Part R35
Removed Parameter Publisher:Altium Limited from Part R36
Removed Parameter Publisher:Altium Limited from Part R37
Removed Parameter Value:10K from Part R29
Removed Parameter Value:10K from Part R31
Removed Parameter Value:10K from Part R34
Removed Parameter Value:10K from Part R35
Removed Parameter Value:10K from Part R36
Removed Parameter Value:10K from Part R37
Change Component Parameter Comment in R29 Old= New=ERJ-2RKF1002X
Change Component Parameter Description in R29 Old=Resistor New=Chip Resistor, 10 KOhm, +/- 1%, 100 mW, -55 to 155 degC, 0402 (1005 Metric), RoHS, Tape and Reel
Change Value of Parameter PackageDescription in Part R29 Old=Chip Resistor New=2-Pin Surface Mount Device, Body 1 x 0.5 mm
Change Value of Parameter PackageReference in Part R29 Old=J1-0603 New=0402
Change Component Parameter Comment in R31 Old= New=ERJ-2RKF1002X
Change Component Parameter Description in R31 Old=Resistor New=Chip Resistor, 10 KOhm, +/- 1%, 100 mW, -55 to 155 degC, 0402 (1005 Metric), RoHS, Tape and Reel
Change Value of Parameter PackageDescription in Part R31 Old=Chip Resistor New=2-Pin Surface Mount Device, Body 1 x 0.5 mm
Change Value of Parameter PackageReference in Part R31 Old=J1-0603 New=0402
Change Component Parameter Comment in R34 Old= New=ERJ-2RKF1002X
Change Component Parameter Description in R34 Old=Resistor New=Chip Resistor, 10 KOhm, +/- 1%, 100 mW, -55 to 155 degC, 0402 (1005 Metric), RoHS, Tape and Reel
Change Value of Parameter PackageDescription in Part R34 Old=Chip Resistor New=2-Pin Surface Mount Device, Body 1 x 0.5 mm
Change Value of Parameter PackageReference in Part R34 Old=J1-0603 New=0402
Change Component Parameter Comment in R35 Old= New=ERJ-2RKF1002X
Change Component Parameter Description in R35 Old=Resistor New=Chip Resistor, 10 KOhm, +/- 1%, 100 mW, -55 to 155 degC, 0402 (1005 Metric), RoHS, Tape and Reel
Change Value of Parameter PackageDescription in Part R35 Old=Chip Resistor New=2-Pin Surface Mount Device, Body 1 x 0.5 mm
Change Value of Parameter PackageReference in Part R35 Old=J1-0603 New=0402
Change Component Parameter Comment in R36 Old= New=ERJ-2RKF1002X
Change Component Parameter Description in R36 Old=Resistor New=Chip Resistor, 10 KOhm, +/- 1%, 100 mW, -55 to 155 degC, 0402 (1005 Metric), RoHS, Tape and Reel
Change Value of Parameter PackageDescription in Part R36 Old=Chip Resistor New=2-Pin Surface Mount Device, Body 1 x 0.5 mm
Change Value of Parameter PackageReference in Part R36 Old=J1-0603 New=0402
Change Component Parameter Comment in R37 Old= New=ERJ-2RKF1002X
Change Component Parameter Description in R37 Old=Resistor New=Chip Resistor, 10 KOhm, +/- 1%, 100 mW, -55 to 155 degC, 0402 (1005 Metric), RoHS, Tape and Reel
Change Value of Parameter PackageDescription in Part R37 Old=Chip Resistor New=2-Pin Surface Mount Device, Body 1 x 0.5 mm
Change Value of Parameter PackageReference in Part R37 Old=J1-0603 New=0402
Added Parameter Case\/Package=0402 to Part R29
Added Parameter Case\/Package=0402 to Part R31
Added Parameter Case\/Package=0402 to Part R34
Added Parameter Case\/Package=0402 to Part R35
Added Parameter Case\/Package=0402 to Part R36
Added Parameter Case\/Package=0402 to Part R37
Added Parameter Case Code (Imperial)=0402 to Part R29
Added Parameter Case Code (Imperial)=0402 to Part R31
Added Parameter Case Code (Imperial)=0402 to Part R34
Added Parameter Case Code (Imperial)=0402 to Part R35
Added Parameter Case Code (Imperial)=0402 to Part R36
Added Parameter Case Code (Imperial)=0402 to Part R37
Added Parameter Case Code (Metric)=1005 to Part R29
Added Parameter Case Code (Metric)=1005 to Part R31
Added Parameter Case Code (Metric)=1005 to Part R34
Added Parameter Case Code (Metric)=1005 to Part R35
Added Parameter Case Code (Metric)=1005 to Part R36
Added Parameter Case Code (Metric)=1005 to Part R37
Added Parameter ComponentLink1Description=Manufacturer URL to Part R29
Added Parameter ComponentLink1Description=Manufacturer URL to Part R31
Added Parameter ComponentLink1Description=Manufacturer URL to Part R34
Added Parameter ComponentLink1Description=Manufacturer URL to Part R35
Added Parameter ComponentLink1Description=Manufacturer URL to Part R36
Added Parameter ComponentLink1Description=Manufacturer URL to Part R37
Added Parameter ComponentLink1URL=http://www.panasonic.com/ to Part R29
Added Parameter ComponentLink1URL=http://www.panasonic.com/ to Part R31
Added Parameter ComponentLink1URL=http://www.panasonic.com/ to Part R34
Added Parameter ComponentLink1URL=http://www.panasonic.com/ to Part R35
Added Parameter ComponentLink1URL=http://www.panasonic.com/ to Part R36
Added Parameter ComponentLink1URL=http://www.panasonic.com/ to Part R37
Added Parameter ComponentLink2Description=Datasheet to Part R29
Added Parameter ComponentLink2Description=Datasheet to Part R31
Added Parameter ComponentLink2Description=Datasheet to Part R34
Added Parameter ComponentLink2Description=Datasheet to Part R35
Added Parameter ComponentLink2Description=Datasheet to Part R36
Added Parameter ComponentLink2Description=Datasheet to Part R37
Added Parameter ComponentLink2URL=http://industrial.panasonic.com/cdbs/www-data/pdf/RDA0000/AOA0000C86.pdf to Part R29
Added Parameter ComponentLink2URL=http://industrial.panasonic.com/cdbs/www-data/pdf/RDA0000/AOA0000C86.pdf to Part R31
Added Parameter ComponentLink2URL=http://industrial.panasonic.com/cdbs/www-data/pdf/RDA0000/AOA0000C86.pdf to Part R34
Added Parameter ComponentLink2URL=http://industrial.panasonic.com/cdbs/www-data/pdf/RDA0000/AOA0000C86.pdf to Part R35
Added Parameter ComponentLink2URL=http://industrial.panasonic.com/cdbs/www-data/pdf/RDA0000/AOA0000C86.pdf to Part R36
Added Parameter ComponentLink2URL=http://industrial.panasonic.com/cdbs/www-data/pdf/RDA0000/AOA0000C86.pdf to Part R37
Added Parameter DatasheetVersion=04/2015 to Part R29
Added Parameter DatasheetVersion=04/2015 to Part R31
Added Parameter DatasheetVersion=04/2015 to Part R34
Added Parameter DatasheetVersion=04/2015 to Part R35
Added Parameter DatasheetVersion=04/2015 to Part R36
Added Parameter DatasheetVersion=04/2015 to Part R37
Added Parameter Height=0.35 mm to Part R29
Added Parameter Height=0.35 mm to Part R31
Added Parameter Height=0.35 mm to Part R34
Added Parameter Height=0.35 mm to Part R35
Added Parameter Height=0.35 mm to Part R36
Added Parameter Height=0.35 mm to Part R37
Added Parameter Length=1 mm to Part R29
Added Parameter Length=1 mm to Part R31
Added Parameter Length=1 mm to Part R34
Added Parameter Length=1 mm to Part R35
Added Parameter Length=1 mm to Part R36
Added Parameter Length=1 mm to Part R37
Added Parameter Manufacturer=Basic Passives to Part R29
Added Parameter Manufacturer=Basic Passives to Part R31
Added Parameter Manufacturer=Basic Passives to Part R34
Added Parameter Manufacturer=Basic Passives to Part R35
Added Parameter Manufacturer=Basic Passives to Part R36
Added Parameter Manufacturer=Basic Passives to Part R37
Added Parameter Max Operating Temperature=155 degC to Part R29
Added Parameter Max Operating Temperature=155 degC to Part R31
Added Parameter Max Operating Temperature=155 degC to Part R34
Added Parameter Max Operating Temperature=155 degC to Part R35
Added Parameter Max Operating Temperature=155 degC to Part R36
Added Parameter Max Operating Temperature=155 degC to Part R37
Added Parameter Min Operating Temperature=-55 degC to Part R29
Added Parameter Min Operating Temperature=-55 degC to Part R31
Added Parameter Min Operating Temperature=-55 degC to Part R34
Added Parameter Min Operating Temperature=-55 degC to Part R35
Added Parameter Min Operating Temperature=-55 degC to Part R36
Added Parameter Min Operating Temperature=-55 degC to Part R37
Added Parameter Mount=Surface Mount to Part R29
Added Parameter Mount=Surface Mount to Part R31
Added Parameter Mount=Surface Mount to Part R34
Added Parameter Mount=Surface Mount to Part R35
Added Parameter Mount=Surface Mount to Part R36
Added Parameter Mount=Surface Mount to Part R37
Added Parameter Mounting Technology=Surface Mount to Part R29
Added Parameter Mounting Technology=Surface Mount to Part R31
Added Parameter Mounting Technology=Surface Mount to Part R34
Added Parameter Mounting Technology=Surface Mount to Part R35
Added Parameter Mounting Technology=Surface Mount to Part R36
Added Parameter Mounting Technology=Surface Mount to Part R37
Added Parameter Package Quantity=10000 to Part R29
Added Parameter Package Quantity=10000 to Part R31
Added Parameter Package Quantity=10000 to Part R34
Added Parameter Package Quantity=10000 to Part R35
Added Parameter Package Quantity=10000 to Part R36
Added Parameter Package Quantity=10000 to Part R37
Added Parameter Packaging=Tape and Reel to Part R29
Added Parameter Packaging=Tape and Reel to Part R31
Added Parameter Packaging=Tape and Reel to Part R34
Added Parameter Packaging=Tape and Reel to Part R35
Added Parameter Packaging=Tape and Reel to Part R36
Added Parameter Packaging=Tape and Reel to Part R37
Added Parameter PartNumber=ERJ-2RKF1002X to Part R29
Added Parameter PartNumber=ERJ-2RKF1002X to Part R31
Added Parameter PartNumber=ERJ-2RKF1002X to Part R34
Added Parameter PartNumber=ERJ-2RKF1002X to Part R35
Added Parameter PartNumber=ERJ-2RKF1002X to Part R36
Added Parameter PartNumber=ERJ-2RKF1002X to Part R37
Added Parameter Pins=2 to Part R29
Added Parameter Pins=2 to Part R31
Added Parameter Pins=2 to Part R34
Added Parameter Pins=2 to Part R35
Added Parameter Pins=2 to Part R36
Added Parameter Pins=2 to Part R37
Added Parameter Power Rating=100 mW to Part R29
Added Parameter Power Rating=100 mW to Part R31
Added Parameter Power Rating=100 mW to Part R34
Added Parameter Power Rating=100 mW to Part R35
Added Parameter Power Rating=100 mW to Part R36
Added Parameter Power Rating=100 mW to Part R37
Added Parameter Radiation Hardening=No to Part R29
Added Parameter Radiation Hardening=No to Part R31
Added Parameter Radiation Hardening=No to Part R34
Added Parameter Radiation Hardening=No to Part R35
Added Parameter Radiation Hardening=No to Part R36
Added Parameter Radiation Hardening=No to Part R37
Added Parameter REACH SVHC=Yes to Part R29
Added Parameter REACH SVHC=Yes to Part R31
Added Parameter REACH SVHC=Yes to Part R34
Added Parameter REACH SVHC=Yes to Part R35
Added Parameter REACH SVHC=Yes to Part R36
Added Parameter REACH SVHC=Yes to Part R37
Added Parameter Resistance=10 KOhm to Part R29
Added Parameter Resistance=10 KOhm to Part R31
Added Parameter Resistance=10 KOhm to Part R34
Added Parameter Resistance=10 KOhm to Part R35
Added Parameter Resistance=10 KOhm to Part R36
Added Parameter Resistance=10 KOhm to Part R37
Added Parameter RoHSCompliant=true to Part R29
Added Parameter RoHSCompliant=true to Part R31
Added Parameter RoHSCompliant=true to Part R34
Added Parameter RoHSCompliant=true to Part R35
Added Parameter RoHSCompliant=true to Part R36
Added Parameter RoHSCompliant=true to Part R37
Added Parameter Tolerance=1% to Part R29
Added Parameter Tolerance=1% to Part R31
Added Parameter Tolerance=1% to Part R34
Added Parameter Tolerance=1% to Part R35
Added Parameter Tolerance=1% to Part R36
Added Parameter Tolerance=1% to Part R37
Added Parameter Voltage Rating=50 V to Part R29
Added Parameter Voltage Rating=50 V to Part R31
Added Parameter Voltage Rating=50 V to Part R34
Added Parameter Voltage Rating=50 V to Part R35
Added Parameter Voltage Rating=50 V to Part R36
Added Parameter Voltage Rating=50 V to Part R37
Added Parameter Width=0.5 mm to Part R29
Added Parameter Width=0.5 mm to Part R31
Added Parameter Width=0.5 mm to Part R34
Added Parameter Width=0.5 mm to Part R35
Added Parameter Width=0.5 mm to Part R36
Added Parameter Width=0.5 mm to Part R37
Change Component Parameter Library Reference in R37 Old=Res3 New=CMP-2002-00607-3
Change Component Parameter Library Reference in R36 Old=Res3 New=CMP-2002-00607-3
Change Component Parameter Library Reference in R35 Old=Res3 New=CMP-2002-00607-3
Change Component Parameter Library Reference in R34 Old=Res3 New=CMP-2002-00607-3
Change Component Parameter Library Reference in R31 Old=Res3 New=CMP-2002-00607-3
Change Component Parameter Library Reference in R29 Old=Res3 New=CMP-2002-00607-3
