Added Differential Pair: Name=FMC_CLK0_M2C
Added Differential Pair: Name=FMC_CLK1_M2C
Added Differential Pair: Name=FMC_HB10
Added Differential Pair: Name=FMC_HB12
Added Differential Pair: Name=FMC_HB14
Added Differential Pair: Name=FMC_HB15
Added Differential Pair: Name=FMC_HB16
Added Differential Pair: Name=FMC_LA08
Added Differential Pair: Name=FMC_LA09
Added Differential Pair: Name=FMC_LA10
Added Differential Pair: Name=FMC_LA11
Added Differential Pair: Name=FMC_LA12
Added Differential Pair: Name=FMC_LA13
Added Differential Pair: Name=FMC_LA14
Added Differential Pair: Name=FMC_LA15
Added Differential Pair: Name=FMC_LA16
Added Differential Pair: Name=FMC_LA18_CC
Added Differential Pair: Name=FMC_LA21
Added Differential Pair: Name=FMC_LA22
Added Differential Pair: Name=FMC_LA23
Added Differential Pair: Name=FMC_LA24
Added Differential Pair: Name=FMC_LA25
Added Differential Pair: Name=FMC_LA26
Added Differential Pair: Name=FMC_LA27
Added Differential Pair: Name=FMC_LA28
Added Differential Pair: Name=FMC_LA29
Added Differential Pair: Name=FMC_LA30
Added Differential Pair: Name=FMC_LA31
Added Differential Pair: Name=FMC_LA32
Added Differential Pair: Name=FMC_LA33
