Replace Part R5 CMP-2002-00607-3 in C:\Users\cheidronelab\Documents\Altium\Projects\EnclustraBaseBoard\EnclustraBaseBoard\CurrentSensors.SchDoc with CMP-2002-00607-3 from Components - 22.01.20 - 22.51.SchLib
Replace Part R9 CMP-2002-00607-3 in C:\Users\cheidronelab\Documents\Altium\Projects\EnclustraBaseBoard\EnclustraBaseBoard\CurrentSensors.SchDoc with CMP-2002-00607-3 from Components - 22.01.20 - 22.51.SchLib
Replace Part R10 CMP-2002-00607-3 in C:\Users\cheidronelab\Documents\Altium\Projects\EnclustraBaseBoard\EnclustraBaseBoard\CurrentSensors.SchDoc with CMP-2002-00607-3 from Components - 22.01.20 - 22.51.SchLib
Replace Part R12 CMP-2002-00607-3 in C:\Users\cheidronelab\Documents\Altium\Projects\EnclustraBaseBoard\EnclustraBaseBoard\CurrentSensors.SchDoc with CMP-2002-00607-3 from Components - 22.01.20 - 22.51.SchLib
Replace Part R15 CMP-2002-00607-3 in C:\Users\cheidronelab\Documents\Altium\Projects\EnclustraBaseBoard\EnclustraBaseBoard\CurrentSensors.SchDoc with CMP-2002-00607-3 from Components - 22.01.20 - 22.51.SchLib
Replace Part R16 CMP-2002-00607-3 in C:\Users\cheidronelab\Documents\Altium\Projects\EnclustraBaseBoard\EnclustraBaseBoard\CurrentSensors.SchDoc with CMP-2002-00607-3 from Components - 22.01.20 - 22.51.SchLib
Replace Part R17 CMP-2002-00607-3 in C:\Users\cheidronelab\Documents\Altium\Projects\EnclustraBaseBoard\EnclustraBaseBoard\CurrentSensors.SchDoc with CMP-2002-00607-3 from Components - 22.01.20 - 22.51.SchLib
Replace Part R18 CMP-2002-00607-3 in C:\Users\cheidronelab\Documents\Altium\Projects\EnclustraBaseBoard\EnclustraBaseBoard\CurrentSensors.SchDoc with CMP-2002-00607-3 from Components - 22.01.20 - 22.51.SchLib
