Removed Pin From Net: NetName=IMU_INT Pin=CONN_B-145
Removed Pin From Net: NetName=IMU_FSYNC Pin=CONN_B-147
Added Pin To Net: NetName=FMC_LA21_P Pin=CONN_B-145
Added Pin To Net: NetName=FMC_LA21_N Pin=CONN_B-147
Added Pin To Net: NetName=IMU_FSYNC Pin=CONN_C-69
Added Pin To Net: NetName=IMU_INT Pin=CONN_C-71
