Removed Member From Class: ClassName=PowerLEDs Member=C110
Change Component Designator: OldDesignator=C110 NewDesignator=C135
Change Net Name : Old Net Name=NetC110_2 New Net Name=NetC135_2
Added Member To Class: ClassName=Connectors4 Member=Component C100 GRM21BR61E106KA73L
Added Member To Class: ClassName=PowerLEDs Member=Component C135 GRM21BR61E106KA73L
