PCBNEW-LibModule-V1  2020-08-15 22:34:20
# encoding utf-8
Units mm
$INDEX
ZEDF9P01B
$EndINDEX
$MODULE ZEDF9P01B
Po 0 0 0 15 5f3854dc 00000000 ~~
Li ZEDF9P01B
Cd ZED-F9P-01B-1
Kw Integrated Circuit
Sc 0
At SMD
AR 
Op 0 0 0
T0 0.000 0.775 1.27 1.27 0 0.254 N V 21 N "IC**"
T1 0.000 0.775 1.27 1.27 0 0.254 N I 21 N "ZEDF9P01B"
DS -11 8.5 11 8.5 0.2 24
DS 11 8.5 11 -8.5 0.2 24
DS 11 -8.5 -11 -8.5 0.2 24
DS -11 -8.5 -11 8.5 0.2 24
DS -11 8.5 11 8.5 0.1 21
DS 11 8.5 11 -8.5 0.1 21
DS 11 -8.5 -11 -8.5 0.1 21
DS -11 -8.5 -11 8.5 0.1 21
DS -12 -9.5 12 -9.5 0.1 24
DS 12 -9.5 12 11.05 0.1 24
DS 12 11.05 -12 11.05 0.1 24
DS -12 11.05 -12 -9.5 0.1 24
DS -7.2 10 -7.2 10 0.2 21
DS -7.3 10 -7.3 10 0.2 21
DS -7.2 10 -7.2 10 0.2 21
DA -7.25 10 -7.200 10 -1800 0.2 21
DA -7.25 10 -7.300 10 -1800 0.2 21
DA -7.25 10 -7.200 10 -1800 0.2 21
$PAD
Po -7.150 7.45
Sh "1" R 0.800 1.500 0 0 0
At SMD N 00888000
Ne 0 ""
$EndPAD
$PAD
Po -6.050 7.45
Sh "2" R 0.800 1.500 0 0 0
At SMD N 00888000
Ne 0 ""
$EndPAD
$PAD
Po -4.950 7.45
Sh "3" R 0.800 1.500 0 0 0
At SMD N 00888000
Ne 0 ""
$EndPAD
$PAD
Po -3.850 7.45
Sh "4" R 0.800 1.500 0 0 0
At SMD N 00888000
Ne 0 ""
$EndPAD
$PAD
Po -2.750 7.45
Sh "5" R 0.800 1.500 0 0 0
At SMD N 00888000
Ne 0 ""
$EndPAD
$PAD
Po -1.650 7.45
Sh "6" R 0.800 1.500 0 0 0
At SMD N 00888000
Ne 0 ""
$EndPAD
$PAD
Po -0.550 7.45
Sh "7" R 0.800 1.500 0 0 0
At SMD N 00888000
Ne 0 ""
$EndPAD
$PAD
Po 0.550 7.45
Sh "8" R 0.800 1.500 0 0 0
At SMD N 00888000
Ne 0 ""
$EndPAD
$PAD
Po 1.650 7.45
Sh "9" R 0.800 1.500 0 0 0
At SMD N 00888000
Ne 0 ""
$EndPAD
$PAD
Po 2.750 7.45
Sh "10" R 0.800 1.500 0 0 0
At SMD N 00888000
Ne 0 ""
$EndPAD
$PAD
Po 3.850 7.45
Sh "11" R 0.800 1.500 0 0 0
At SMD N 00888000
Ne 0 ""
$EndPAD
$PAD
Po 4.950 7.45
Sh "12" R 0.800 1.500 0 0 0
At SMD N 00888000
Ne 0 ""
$EndPAD
$PAD
Po 6.050 7.45
Sh "13" R 0.800 1.500 0 0 0
At SMD N 00888000
Ne 0 ""
$EndPAD
$PAD
Po 7.150 7.45
Sh "14" R 0.800 1.500 0 0 0
At SMD N 00888000
Ne 0 ""
$EndPAD
$PAD
Po 9.950 6.6
Sh "15" R 0.800 1.500 0 0 900
At SMD N 00888000
Ne 0 ""
$EndPAD
$PAD
Po 9.950 5.5
Sh "16" R 0.800 1.500 0 0 900
At SMD N 00888000
Ne 0 ""
$EndPAD
$PAD
Po 9.950 4.4
Sh "17" R 0.800 1.500 0 0 900
At SMD N 00888000
Ne 0 ""
$EndPAD
$PAD
Po 9.950 3.3
Sh "18" R 0.800 1.500 0 0 900
At SMD N 00888000
Ne 0 ""
$EndPAD
$PAD
Po 9.950 2.2
Sh "19" R 0.800 1.500 0 0 900
At SMD N 00888000
Ne 0 ""
$EndPAD
$PAD
Po 9.950 1.1
Sh "20" R 0.800 1.500 0 0 900
At SMD N 00888000
Ne 0 ""
$EndPAD
$PAD
Po 9.950 -0
Sh "21" R 0.800 1.500 0 0 900
At SMD N 00888000
Ne 0 ""
$EndPAD
$PAD
Po 9.950 -1.1
Sh "22" R 0.800 1.500 0 0 900
At SMD N 00888000
Ne 0 ""
$EndPAD
$PAD
Po 9.950 -2.2
Sh "23" R 0.800 1.500 0 0 900
At SMD N 00888000
Ne 0 ""
$EndPAD
$PAD
Po 9.950 -3.3
Sh "24" R 0.800 1.500 0 0 900
At SMD N 00888000
Ne 0 ""
$EndPAD
$PAD
Po 9.950 -4.4
Sh "25" R 0.800 1.500 0 0 900
At SMD N 00888000
Ne 0 ""
$EndPAD
$PAD
Po 9.950 -5.5
Sh "26" R 0.800 1.500 0 0 900
At SMD N 00888000
Ne 0 ""
$EndPAD
$PAD
Po 9.950 -6.6
Sh "27" R 0.800 1.500 0 0 900
At SMD N 00888000
Ne 0 ""
$EndPAD
$PAD
Po 7.150 -7.45
Sh "28" R 0.800 1.500 0 0 0
At SMD N 00888000
Ne 0 ""
$EndPAD
$PAD
Po 6.050 -7.45
Sh "29" R 0.800 1.500 0 0 0
At SMD N 00888000
Ne 0 ""
$EndPAD
$PAD
Po 4.950 -7.45
Sh "30" R 0.800 1.500 0 0 0
At SMD N 00888000
Ne 0 ""
$EndPAD
$PAD
Po 3.850 -7.45
Sh "31" R 0.800 1.500 0 0 0
At SMD N 00888000
Ne 0 ""
$EndPAD
$PAD
Po 2.750 -7.45
Sh "32" R 0.800 1.500 0 0 0
At SMD N 00888000
Ne 0 ""
$EndPAD
$PAD
Po 1.650 -7.45
Sh "33" R 0.800 1.500 0 0 0
At SMD N 00888000
Ne 0 ""
$EndPAD
$PAD
Po 0.550 -7.45
Sh "34" R 0.800 1.500 0 0 0
At SMD N 00888000
Ne 0 ""
$EndPAD
$PAD
Po -0.550 -7.45
Sh "35" R 0.800 1.500 0 0 0
At SMD N 00888000
Ne 0 ""
$EndPAD
$PAD
Po -1.650 -7.45
Sh "36" R 0.800 1.500 0 0 0
At SMD N 00888000
Ne 0 ""
$EndPAD
$PAD
Po -2.750 -7.45
Sh "37" R 0.800 1.500 0 0 0
At SMD N 00888000
Ne 0 ""
$EndPAD
$PAD
Po -3.850 -7.45
Sh "38" R 0.800 1.500 0 0 0
At SMD N 00888000
Ne 0 ""
$EndPAD
$PAD
Po -4.950 -7.45
Sh "39" R 0.800 1.500 0 0 0
At SMD N 00888000
Ne 0 ""
$EndPAD
$PAD
Po -6.050 -7.45
Sh "40" R 0.800 1.500 0 0 0
At SMD N 00888000
Ne 0 ""
$EndPAD
$PAD
Po -7.150 -7.45
Sh "41" R 0.800 1.500 0 0 0
At SMD N 00888000
Ne 0 ""
$EndPAD
$PAD
Po -9.950 -6.6
Sh "42" R 0.800 1.500 0 0 900
At SMD N 00888000
Ne 0 ""
$EndPAD
$PAD
Po -9.950 -5.5
Sh "43" R 0.800 1.500 0 0 900
At SMD N 00888000
Ne 0 ""
$EndPAD
$PAD
Po -9.950 -4.4
Sh "44" R 0.800 1.500 0 0 900
At SMD N 00888000
Ne 0 ""
$EndPAD
$PAD
Po -9.950 -3.3
Sh "45" R 0.800 1.500 0 0 900
At SMD N 00888000
Ne 0 ""
$EndPAD
$PAD
Po -9.950 -2.2
Sh "46" R 0.800 1.500 0 0 900
At SMD N 00888000
Ne 0 ""
$EndPAD
$PAD
Po -9.950 -1.1
Sh "47" R 0.800 1.500 0 0 900
At SMD N 00888000
Ne 0 ""
$EndPAD
$PAD
Po -9.950 -0
Sh "48" R 0.800 1.500 0 0 900
At SMD N 00888000
Ne 0 ""
$EndPAD
$PAD
Po -9.950 1.1
Sh "49" R 0.800 1.500 0 0 900
At SMD N 00888000
Ne 0 ""
$EndPAD
$PAD
Po -9.950 2.2
Sh "50" R 0.800 1.500 0 0 900
At SMD N 00888000
Ne 0 ""
$EndPAD
$PAD
Po -9.950 3.3
Sh "51" R 0.800 1.500 0 0 900
At SMD N 00888000
Ne 0 ""
$EndPAD
$PAD
Po -9.950 4.4
Sh "52" R 0.800 1.500 0 0 900
At SMD N 00888000
Ne 0 ""
$EndPAD
$PAD
Po -9.950 5.5
Sh "53" R 0.800 1.500 0 0 900
At SMD N 00888000
Ne 0 ""
$EndPAD
$PAD
Po -9.950 6.6
Sh "54" R 0.800 1.500 0 0 900
At SMD N 00888000
Ne 0 ""
$EndPAD
$PAD
Po -7.350 5.25
Sh "55" R 1.100 1.100 0 0 0
At SMD N 00888000
Ne 0 ""
$EndPAD
$PAD
Po -7.350 3.15
Sh "56" R 1.100 1.100 0 0 0
At SMD N 00888000
Ne 0 ""
$EndPAD
$PAD
Po -7.350 1.05
Sh "57" R 1.100 1.100 0 0 0
At SMD N 00888000
Ne 0 ""
$EndPAD
$PAD
Po -7.350 -1.05
Sh "58" R 1.100 1.100 0 0 0
At SMD N 00888000
Ne 0 ""
$EndPAD
$PAD
Po -7.350 -3.15
Sh "59" R 1.100 1.100 0 0 0
At SMD N 00888000
Ne 0 ""
$EndPAD
$PAD
Po -7.350 -5.25
Sh "60" R 1.100 1.100 0 0 0
At SMD N 00888000
Ne 0 ""
$EndPAD
$PAD
Po -5.250 -5.25
Sh "61" R 1.100 1.100 0 0 0
At SMD N 00888000
Ne 0 ""
$EndPAD
$PAD
Po -5.250 -3.15
Sh "62" R 1.100 1.100 0 0 0
At SMD N 00888000
Ne 0 ""
$EndPAD
$PAD
Po -5.250 -1.05
Sh "63" R 1.100 1.100 0 0 0
At SMD N 00888000
Ne 0 ""
$EndPAD
$PAD
Po -5.250 1.05
Sh "64" R 1.100 1.100 0 0 0
At SMD N 00888000
Ne 0 ""
$EndPAD
$PAD
Po -5.250 3.15
Sh "65" R 1.100 1.100 0 0 0
At SMD N 00888000
Ne 0 ""
$EndPAD
$PAD
Po -5.250 5.25
Sh "66" R 1.100 1.100 0 0 0
At SMD N 00888000
Ne 0 ""
$EndPAD
$PAD
Po -3.150 5.25
Sh "67" R 1.100 1.100 0 0 0
At SMD N 00888000
Ne 0 ""
$EndPAD
$PAD
Po -3.150 3.15
Sh "68" R 1.100 1.100 0 0 0
At SMD N 00888000
Ne 0 ""
$EndPAD
$PAD
Po -3.150 1.05
Sh "69" R 1.100 1.100 0 0 0
At SMD N 00888000
Ne 0 ""
$EndPAD
$PAD
Po -3.150 -1.05
Sh "70" R 1.100 1.100 0 0 0
At SMD N 00888000
Ne 0 ""
$EndPAD
$PAD
Po -3.150 -3.15
Sh "71" R 1.100 1.100 0 0 0
At SMD N 00888000
Ne 0 ""
$EndPAD
$PAD
Po -3.150 -5.25
Sh "72" R 1.100 1.100 0 0 0
At SMD N 00888000
Ne 0 ""
$EndPAD
$PAD
Po -1.050 -5.25
Sh "73" R 1.100 1.100 0 0 0
At SMD N 00888000
Ne 0 ""
$EndPAD
$PAD
Po -1.050 -3.15
Sh "74" R 1.100 1.100 0 0 0
At SMD N 00888000
Ne 0 ""
$EndPAD
$PAD
Po -1.050 -1.05
Sh "75" R 1.100 1.100 0 0 0
At SMD N 00888000
Ne 0 ""
$EndPAD
$PAD
Po -1.050 1.05
Sh "76" R 1.100 1.100 0 0 0
At SMD N 00888000
Ne 0 ""
$EndPAD
$PAD
Po -1.050 3.15
Sh "77" R 1.100 1.100 0 0 0
At SMD N 00888000
Ne 0 ""
$EndPAD
$PAD
Po -1.050 5.25
Sh "78" R 1.100 1.100 0 0 0
At SMD N 00888000
Ne 0 ""
$EndPAD
$PAD
Po 1.050 5.25
Sh "79" R 1.100 1.100 0 0 0
At SMD N 00888000
Ne 0 ""
$EndPAD
$PAD
Po 1.050 3.15
Sh "80" R 1.100 1.100 0 0 0
At SMD N 00888000
Ne 0 ""
$EndPAD
$PAD
Po 1.050 1.05
Sh "81" R 1.100 1.100 0 0 0
At SMD N 00888000
Ne 0 ""
$EndPAD
$PAD
Po 1.050 -1.05
Sh "82" R 1.100 1.100 0 0 0
At SMD N 00888000
Ne 0 ""
$EndPAD
$PAD
Po 1.050 -3.15
Sh "83" R 1.100 1.100 0 0 0
At SMD N 00888000
Ne 0 ""
$EndPAD
$PAD
Po 1.050 -5.25
Sh "84" R 1.100 1.100 0 0 0
At SMD N 00888000
Ne 0 ""
$EndPAD
$PAD
Po 3.150 -5.25
Sh "85" R 1.100 1.100 0 0 0
At SMD N 00888000
Ne 0 ""
$EndPAD
$PAD
Po 3.150 -3.15
Sh "86" R 1.100 1.100 0 0 0
At SMD N 00888000
Ne 0 ""
$EndPAD
$PAD
Po 3.150 -1.05
Sh "87" R 1.100 1.100 0 0 0
At SMD N 00888000
Ne 0 ""
$EndPAD
$PAD
Po 3.150 1.05
Sh "88" R 1.100 1.100 0 0 0
At SMD N 00888000
Ne 0 ""
$EndPAD
$PAD
Po 3.150 3.15
Sh "89" R 1.100 1.100 0 0 0
At SMD N 00888000
Ne 0 ""
$EndPAD
$PAD
Po 3.150 5.25
Sh "90" R 1.100 1.100 0 0 0
At SMD N 00888000
Ne 0 ""
$EndPAD
$PAD
Po 5.250 5.25
Sh "91" R 1.100 1.100 0 0 0
At SMD N 00888000
Ne 0 ""
$EndPAD
$PAD
Po 5.250 3.15
Sh "92" R 1.100 1.100 0 0 0
At SMD N 00888000
Ne 0 ""
$EndPAD
$PAD
Po 5.250 1.05
Sh "93" R 1.100 1.100 0 0 0
At SMD N 00888000
Ne 0 ""
$EndPAD
$PAD
Po 5.250 -1.05
Sh "94" R 1.100 1.100 0 0 0
At SMD N 00888000
Ne 0 ""
$EndPAD
$PAD
Po 5.250 -3.15
Sh "95" R 1.100 1.100 0 0 0
At SMD N 00888000
Ne 0 ""
$EndPAD
$PAD
Po 5.250 -5.25
Sh "96" R 1.100 1.100 0 0 0
At SMD N 00888000
Ne 0 ""
$EndPAD
$PAD
Po 7.350 -5.25
Sh "97" R 1.100 1.100 0 0 0
At SMD N 00888000
Ne 0 ""
$EndPAD
$PAD
Po 7.350 -3.15
Sh "98" R 1.100 1.100 0 0 0
At SMD N 00888000
Ne 0 ""
$EndPAD
$PAD
Po 7.350 -1.05
Sh "99" R 1.100 1.100 0 0 0
At SMD N 00888000
Ne 0 ""
$EndPAD
$PAD
Po 7.350 1.05
Sh "100" R 1.100 1.100 0 0 0
At SMD N 00888000
Ne 0 ""
$EndPAD
$PAD
Po 7.350 3.15
Sh "101" R 1.100 1.100 0 0 0
At SMD N 00888000
Ne 0 ""
$EndPAD
$PAD
Po 7.350 5.25
Sh "102" R 1.100 1.100 0 0 0
At SMD N 00888000
Ne 0 ""
$EndPAD
$EndMODULE ZEDF9P01B
$EndLIBRARY
