Replace Part R2 CMP-2002-00607-3 in C:\Users\cheidronelab\Documents\Altium\Projects\EnclustraBaseBoard\EnclustraBaseBoard\Power.SchDoc with CMP-2002-00607-3 from Components - 22.01.20 - 22.51.SchLib
Replace Part R3 CMP-2002-00607-3 in C:\Users\cheidronelab\Documents\Altium\Projects\EnclustraBaseBoard\EnclustraBaseBoard\Power.SchDoc with CMP-2002-00607-3 from Components - 22.01.20 - 22.51.SchLib
Replace Part R4 CMP-2002-00607-3 in C:\Users\cheidronelab\Documents\Altium\Projects\EnclustraBaseBoard\EnclustraBaseBoard\Power.SchDoc with CMP-2002-00607-3 from Components - 22.01.20 - 22.51.SchLib
