Added Component: Designator=Connector L(HiroseSide)
Add component. Clean all parameters for all variants
Added Component: Designator=Connector R(HiroseSide)
Add component. Clean all parameters for all variants
Added Class: Name=Sheet1
Added Room: Name=Sheet1
