Added Differential Pair: Name=FMC_LA08
Added Differential Pair: Name=FMC_LA09
Added Differential Pair: Name=FMC_LA10
Added Differential Pair: Name=FMC_LA11
Added Differential Pair: Name=FMC_LA12
Added Member To Class: ClassName=90Ohm Member=FMC_LA08
Added Member To Class: ClassName=90Ohm Member=FMC_LA09
Added Member To Class: ClassName=90Ohm Member=FMC_LA10
Added Member To Class: ClassName=90Ohm Member=FMC_LA11
Added Member To Class: ClassName=90Ohm Member=FMC_LA12
