Removed Pin From Net: NetName=CD_GND Pin=SW2-1
Removed Pin From Net: NetName=CD_GND Pin=SW2-2
Removed Pin From Net: NetName=CD_GND Pin=SW2-3
Removed Pin From Net: NetName=CD_GND Pin=SW2-4
Removed Pin From Net: NetName=CD_GND Pin=SW2-5
Removed Pin From Net: NetName=CD_GND Pin=SW2-6
Removed Pin From Net: NetName=CD_GND Pin=SW2-7
Removed Pin From Net: NetName=CD_GND Pin=SW2-8
Removed Pin From Net: NetName=NetR65_2 Pin=SW2-9
Removed Pin From Net: NetName=NetR64_2 Pin=SW2-10
Removed Pin From Net: NetName=NetR63_2 Pin=SW2-11
Removed Pin From Net: NetName=NetR62_2 Pin=SW2-12
Removed Pin From Net: NetName=NetR61_2 Pin=SW2-13
Removed Pin From Net: NetName=NetR60_2 Pin=SW2-14
Removed Pin From Net: NetName=NetR59_2 Pin=SW2-15
Removed Pin From Net: NetName=NetR58_2 Pin=SW2-16
Change Component Footprint: Designator=SW2 Old Footprint=CTS-219-8LPST_V New Footprint=416131160808
Change Component Comment : Designator=SW2 Old Comment=219-8LPST New Comment=416131160808
Change component parameters: Designator = "SW2"; Footprint = "416131160808"; UniqueID = "\OSSZDJQD"
Change component parameters. Clean all parameters for all variants
Change component parameters (AddParameter): Name = "ComponentLink1Description"; Value = "Manufacturer URL"; VariantName = "[No Variations]"
Change component parameters (AddParameter): Name = "ComponentLink1URL"; Value = "http://www.we-online.com"; VariantName = "[No Variations]"
Change component parameters (AddParameter): Name = "ComponentLink2Description"; Value = "Datasheet"; VariantName = "[No Variations]"
Change component parameters (AddParameter): Name = "ComponentLink2URL"; Value = "http://katalog.we-online.de/em/datasheet/4161311608xx.pdf"; VariantName = "[No Variations]"
Change component parameters (AddParameter): Name = "Manufacturer"; Value = "Wuerth Elektronik"; VariantName = "[No Variations]"
Change component parameters (AddParameter): Name = "NoPins"; Value = "16"; VariantName = "[No Variations]"
Change component parameters (AddParameter): Name = "PackageReference"; Value = "416131160808"; VariantName = "[No Variations]"
Change component parameters (AddParameter): Name = "PartNumber"; Value = "416131160808"; VariantName = "[No Variations]"
Added Pin To Net: NetName=NetR65_2 Pin=SW2-1
Added Pin To Net: NetName=NetR64_2 Pin=SW2-2
Added Pin To Net: NetName=NetR63_2 Pin=SW2-3
Added Pin To Net: NetName=NetR62_2 Pin=SW2-4
Added Pin To Net: NetName=NetR61_2 Pin=SW2-5
Added Pin To Net: NetName=NetR60_2 Pin=SW2-6
Added Pin To Net: NetName=NetR59_2 Pin=SW2-7
Added Pin To Net: NetName=NetR58_2 Pin=SW2-8
Added Pin To Net: NetName=CD_GND Pin=SW2-9
Added Pin To Net: NetName=CD_GND Pin=SW2-10
Added Pin To Net: NetName=CD_GND Pin=SW2-11
Added Pin To Net: NetName=CD_GND Pin=SW2-12
Added Pin To Net: NetName=CD_GND Pin=SW2-13
Added Pin To Net: NetName=CD_GND Pin=SW2-14
Added Pin To Net: NetName=CD_GND Pin=SW2-15
Added Pin To Net: NetName=CD_GND Pin=SW2-16
