Removed Pin From Net: NetName=SPI_MISO_PS Pin=CONN_C-160
Removed Pin From Net: NetName=SPI_MOSI_PS Pin=CONN_C-162
Removed Pin From Net: NetName=SPI_CS_ZED Pin=CONN_C-164
Removed Pin From Net: NetName=SPI_CLK Pin=CONN_C-166
Added Pin To Net: NetName=SPI_CLK Pin=CONN_C-160
Added Pin To Net: NetName=SPI_CS_ZED Pin=CONN_C-162
Added Pin To Net: NetName=SPI_MOSI_PS Pin=CONN_C-164
Added Pin To Net: NetName=SPI_MISO_PS Pin=CONN_C-166
