Removed Pin From Net: NetName=UART_RX_EXT Pin=CONN_B-145
Removed Pin From Net: NetName=UART_TX_EXT Pin=CONN_B-147
Added Pin To Net: NetName=FMC_LA21_P Pin=CONN_B-145
Added Pin To Net: NetName=FMC_LA21_N Pin=CONN_B-147
