Removed Pin From Net: NetName=GND Pin=L1-2
Removed Pin From Net: NetName=VCC_MAIN_CM Pin=L1-4
Change Component Footprint: Designator=L1 Old Footprint=WE-SL5-HC New Footprint=FIL_DLW5BTM501SQ2L
Change Component Comment : Designator=L1 Old Comment=744273501 New Comment=DLW5BTM501SQ2L
Change Managed Component Library Link : Designator=ANT1 Old VaultGUID= New VaultGUID=B7D15EC3-160A-466F-A46C-7801FE6295A7 Old ItemGUID= New ItemGUID=17A3BE5B-CDB3-4184-94B1-9E166BC82128 Old RevisionGUID= New RevisionGUID=15A4542A-0578-4BE5-83D6-ADA064A34E35
Change Managed Component Library Link : Designator=BT1 Old VaultGUID= New VaultGUID=B7D15EC3-160A-466F-A46C-7801FE6295A7 Old ItemGUID= New ItemGUID=794957AE-4758-4DA3-B354-36949D354910 Old RevisionGUID= New RevisionGUID=72B3A5F3-9255-4799-AC29-E348814B75AF
Change Managed Component Library Link : Designator=C1 Old VaultGUID= New VaultGUID=B7D15EC3-160A-466F-A46C-7801FE6295A7 Old ItemGUID= New ItemGUID=C0BB9692-71F7-44D6-9C77-94276E9877FA Old RevisionGUID= New RevisionGUID=11F13CB0-EC5A-4856-94F0-2FB0271D2BF6
Change Managed Component Library Link : Designator=C2 Old VaultGUID= New VaultGUID=B7D15EC3-160A-466F-A46C-7801FE6295A7 Old ItemGUID= New ItemGUID=2B3599F1-B1A6-4C4B-9FAD-DE4C9E1C6A82 Old RevisionGUID= New RevisionGUID=E211AB85-3B77-4E5D-888B-1362818A2E8F
Change Managed Component Library Link : Designator=C3 Old VaultGUID= New VaultGUID=B7D15EC3-160A-466F-A46C-7801FE6295A7 Old ItemGUID= New ItemGUID=501E2D9C-4BE3-4844-92AF-0A039EC046A2 Old RevisionGUID= New RevisionGUID=2B036562-6D79-4C11-83E5-A5D35C680386
Change Managed Component Library Link : Designator=C4 Old VaultGUID= New VaultGUID=B7D15EC3-160A-466F-A46C-7801FE6295A7 Old ItemGUID= New ItemGUID=95F3E143-EA06-44EF-84F2-36A9B3AD700C Old RevisionGUID= New RevisionGUID=00D6F1AB-B154-4BD4-A8D6-4D6024024DD5
Change Managed Component Library Link : Designator=C5 Old VaultGUID= New VaultGUID=B7D15EC3-160A-466F-A46C-7801FE6295A7 Old ItemGUID= New ItemGUID=E9CAAD23-5DDA-49C8-A679-8CBCADCF8C99 Old RevisionGUID= New RevisionGUID=744C3109-1B1E-4E0F-90CC-10CB5005341E
Change Managed Component Library Link : Designator=C6 Old VaultGUID= New VaultGUID=B7D15EC3-160A-466F-A46C-7801FE6295A7 Old ItemGUID= New ItemGUID=32E2597C-C311-4A44-AE41-B513D7BDCF06 Old RevisionGUID= New RevisionGUID=5CD6881D-1238-471D-B0C5-E0A238E5E0E1
Change Managed Component Library Link : Designator=C7 Old VaultGUID= New VaultGUID=B7D15EC3-160A-466F-A46C-7801FE6295A7 Old ItemGUID= New ItemGUID=32E2597C-C311-4A44-AE41-B513D7BDCF06 Old RevisionGUID= New RevisionGUID=5CD6881D-1238-471D-B0C5-E0A238E5E0E1
Change Managed Component Library Link : Designator=C8 Old VaultGUID= New VaultGUID=B7D15EC3-160A-466F-A46C-7801FE6295A7 Old ItemGUID= New ItemGUID=32E2597C-C311-4A44-AE41-B513D7BDCF06 Old RevisionGUID= New RevisionGUID=5CD6881D-1238-471D-B0C5-E0A238E5E0E1
Change Managed Component Library Link : Designator=C9 Old VaultGUID= New VaultGUID=B7D15EC3-160A-466F-A46C-7801FE6295A7 Old ItemGUID= New ItemGUID=32E2597C-C311-4A44-AE41-B513D7BDCF06 Old RevisionGUID= New RevisionGUID=5CD6881D-1238-471D-B0C5-E0A238E5E0E1
Change Managed Component Library Link : Designator=C10 Old VaultGUID= New VaultGUID=B7D15EC3-160A-466F-A46C-7801FE6295A7 Old ItemGUID= New ItemGUID=32E2597C-C311-4A44-AE41-B513D7BDCF06 Old RevisionGUID= New RevisionGUID=5CD6881D-1238-471D-B0C5-E0A238E5E0E1
Change Managed Component Library Link : Designator=C11 Old VaultGUID= New VaultGUID=B7D15EC3-160A-466F-A46C-7801FE6295A7 Old ItemGUID= New ItemGUID=32E2597C-C311-4A44-AE41-B513D7BDCF06 Old RevisionGUID= New RevisionGUID=5CD6881D-1238-471D-B0C5-E0A238E5E0E1
Change Managed Component Library Link : Designator=C12 Old VaultGUID= New VaultGUID=B7D15EC3-160A-466F-A46C-7801FE6295A7 Old ItemGUID= New ItemGUID=2B3599F1-B1A6-4C4B-9FAD-DE4C9E1C6A82 Old RevisionGUID= New RevisionGUID=E211AB85-3B77-4E5D-888B-1362818A2E8F
Change Managed Component Library Link : Designator=C13 Old VaultGUID= New VaultGUID=B7D15EC3-160A-466F-A46C-7801FE6295A7 Old ItemGUID= New ItemGUID=2B3599F1-B1A6-4C4B-9FAD-DE4C9E1C6A82 Old RevisionGUID= New RevisionGUID=E211AB85-3B77-4E5D-888B-1362818A2E8F
Change Managed Component Library Link : Designator=C14 Old VaultGUID= New VaultGUID=B7D15EC3-160A-466F-A46C-7801FE6295A7 Old ItemGUID= New ItemGUID=C98C359C-CEB5-44E0-92D4-95D40DC1E828 Old RevisionGUID= New RevisionGUID=6C044E54-DA61-4925-9405-30BAD51B2F8C
Change Managed Component Library Link : Designator=C15 Old VaultGUID= New VaultGUID=B7D15EC3-160A-466F-A46C-7801FE6295A7 Old ItemGUID= New ItemGUID=C0BB9692-71F7-44D6-9C77-94276E9877FA Old RevisionGUID= New RevisionGUID=11F13CB0-EC5A-4856-94F0-2FB0271D2BF6
Change Managed Component Library Link : Designator=C16 Old VaultGUID= New VaultGUID=B7D15EC3-160A-466F-A46C-7801FE6295A7 Old ItemGUID= New ItemGUID=C0BB9692-71F7-44D6-9C77-94276E9877FA Old RevisionGUID= New RevisionGUID=11F13CB0-EC5A-4856-94F0-2FB0271D2BF6
Change Managed Component Library Link : Designator=C17 Old VaultGUID= New VaultGUID=B7D15EC3-160A-466F-A46C-7801FE6295A7 Old ItemGUID= New ItemGUID=F0A12FAA-CB52-4C02-A5C8-C4A886C32DEE Old RevisionGUID= New RevisionGUID=0F60DA58-B9A2-42E0-8A46-90D477F2D7E5
Change Managed Component Library Link : Designator=C18 Old VaultGUID= New VaultGUID=B7D15EC3-160A-466F-A46C-7801FE6295A7 Old ItemGUID= New ItemGUID=2B3599F1-B1A6-4C4B-9FAD-DE4C9E1C6A82 Old RevisionGUID= New RevisionGUID=E211AB85-3B77-4E5D-888B-1362818A2E8F
Change Managed Component Library Link : Designator=C19 Old VaultGUID= New VaultGUID=B7D15EC3-160A-466F-A46C-7801FE6295A7 Old ItemGUID= New ItemGUID=6F1B6B58-7D02-4BC2-ADD5-30CA0C710D0D Old RevisionGUID= New RevisionGUID=35875128-28DD-4E66-9F51-7FF48DA4E9AB
Change Managed Component Library Link : Designator=C20 Old VaultGUID= New VaultGUID=B7D15EC3-160A-466F-A46C-7801FE6295A7 Old ItemGUID= New ItemGUID=2B3599F1-B1A6-4C4B-9FAD-DE4C9E1C6A82 Old RevisionGUID= New RevisionGUID=E211AB85-3B77-4E5D-888B-1362818A2E8F
Change Managed Component Library Link : Designator=C21 Old VaultGUID= New VaultGUID=B7D15EC3-160A-466F-A46C-7801FE6295A7 Old ItemGUID= New ItemGUID=6F1B6B58-7D02-4BC2-ADD5-30CA0C710D0D Old RevisionGUID= New RevisionGUID=35875128-28DD-4E66-9F51-7FF48DA4E9AB
Change Managed Component Library Link : Designator=C22 Old VaultGUID= New VaultGUID=B7D15EC3-160A-466F-A46C-7801FE6295A7 Old ItemGUID= New ItemGUID=2B3599F1-B1A6-4C4B-9FAD-DE4C9E1C6A82 Old RevisionGUID= New RevisionGUID=E211AB85-3B77-4E5D-888B-1362818A2E8F
Change Managed Component Library Link : Designator=C23 Old VaultGUID= New VaultGUID=B7D15EC3-160A-466F-A46C-7801FE6295A7 Old ItemGUID= New ItemGUID=6F1B6B58-7D02-4BC2-ADD5-30CA0C710D0D Old RevisionGUID= New RevisionGUID=35875128-28DD-4E66-9F51-7FF48DA4E9AB
Change Managed Component Library Link : Designator=C24 Old VaultGUID= New VaultGUID=B7D15EC3-160A-466F-A46C-7801FE6295A7 Old ItemGUID= New ItemGUID=2B3599F1-B1A6-4C4B-9FAD-DE4C9E1C6A82 Old RevisionGUID= New RevisionGUID=E211AB85-3B77-4E5D-888B-1362818A2E8F
Change Managed Component Library Link : Designator=C25 Old VaultGUID= New VaultGUID=B7D15EC3-160A-466F-A46C-7801FE6295A7 Old ItemGUID= New ItemGUID=6F1B6B58-7D02-4BC2-ADD5-30CA0C710D0D Old RevisionGUID= New RevisionGUID=35875128-28DD-4E66-9F51-7FF48DA4E9AB
Change Managed Component Library Link : Designator=C26 Old VaultGUID= New VaultGUID=B7D15EC3-160A-466F-A46C-7801FE6295A7 Old ItemGUID= New ItemGUID=2B3599F1-B1A6-4C4B-9FAD-DE4C9E1C6A82 Old RevisionGUID= New RevisionGUID=E211AB85-3B77-4E5D-888B-1362818A2E8F
Change Managed Component Library Link : Designator=C27 Old VaultGUID= New VaultGUID=B7D15EC3-160A-466F-A46C-7801FE6295A7 Old ItemGUID= New ItemGUID=6F1B6B58-7D02-4BC2-ADD5-30CA0C710D0D Old RevisionGUID= New RevisionGUID=35875128-28DD-4E66-9F51-7FF48DA4E9AB
Change Managed Component Library Link : Designator=C28 Old VaultGUID= New VaultGUID=B7D15EC3-160A-466F-A46C-7801FE6295A7 Old ItemGUID= New ItemGUID=501E2D9C-4BE3-4844-92AF-0A039EC046A2 Old RevisionGUID= New RevisionGUID=2B036562-6D79-4C11-83E5-A5D35C680386
Change Managed Component Library Link : Designator=C29 Old VaultGUID= New VaultGUID=B7D15EC3-160A-466F-A46C-7801FE6295A7 Old ItemGUID= New ItemGUID=C0BB9692-71F7-44D6-9C77-94276E9877FA Old RevisionGUID= New RevisionGUID=11F13CB0-EC5A-4856-94F0-2FB0271D2BF6
Change Managed Component Library Link : Designator=C30 Old VaultGUID= New VaultGUID=B7D15EC3-160A-466F-A46C-7801FE6295A7 Old ItemGUID= New ItemGUID=95F3E143-EA06-44EF-84F2-36A9B3AD700C Old RevisionGUID= New RevisionGUID=00D6F1AB-B154-4BD4-A8D6-4D6024024DD5
Change Managed Component Library Link : Designator=C31 Old VaultGUID= New VaultGUID=B7D15EC3-160A-466F-A46C-7801FE6295A7 Old ItemGUID= New ItemGUID=95F3E143-EA06-44EF-84F2-36A9B3AD700C Old RevisionGUID= New RevisionGUID=00D6F1AB-B154-4BD4-A8D6-4D6024024DD5
Change Managed Component Library Link : Designator=C32 Old VaultGUID= New VaultGUID=B7D15EC3-160A-466F-A46C-7801FE6295A7 Old ItemGUID= New ItemGUID=501E2D9C-4BE3-4844-92AF-0A039EC046A2 Old RevisionGUID= New RevisionGUID=2B036562-6D79-4C11-83E5-A5D35C680386
Change Managed Component Library Link : Designator=C33 Old VaultGUID= New VaultGUID=B7D15EC3-160A-466F-A46C-7801FE6295A7 Old ItemGUID= New ItemGUID=2B3599F1-B1A6-4C4B-9FAD-DE4C9E1C6A82 Old RevisionGUID= New RevisionGUID=E211AB85-3B77-4E5D-888B-1362818A2E8F
Change Managed Component Library Link : Designator=C34 Old VaultGUID= New VaultGUID=B7D15EC3-160A-466F-A46C-7801FE6295A7 Old ItemGUID= New ItemGUID=501E2D9C-4BE3-4844-92AF-0A039EC046A2 Old RevisionGUID= New RevisionGUID=2B036562-6D79-4C11-83E5-A5D35C680386
Change Managed Component Library Link : Designator=C35 Old VaultGUID= New VaultGUID=B7D15EC3-160A-466F-A46C-7801FE6295A7 Old ItemGUID= New ItemGUID=2B3599F1-B1A6-4C4B-9FAD-DE4C9E1C6A82 Old RevisionGUID= New RevisionGUID=E211AB85-3B77-4E5D-888B-1362818A2E8F
Change Managed Component Library Link : Designator=C36 Old VaultGUID= New VaultGUID=B7D15EC3-160A-466F-A46C-7801FE6295A7 Old ItemGUID= New ItemGUID=501E2D9C-4BE3-4844-92AF-0A039EC046A2 Old RevisionGUID= New RevisionGUID=2B036562-6D79-4C11-83E5-A5D35C680386
Change Managed Component Library Link : Designator=C37 Old VaultGUID= New VaultGUID=B7D15EC3-160A-466F-A46C-7801FE6295A7 Old ItemGUID= New ItemGUID=2B3599F1-B1A6-4C4B-9FAD-DE4C9E1C6A82 Old RevisionGUID= New RevisionGUID=E211AB85-3B77-4E5D-888B-1362818A2E8F
Change Managed Component Library Link : Designator=C38 Old VaultGUID= New VaultGUID=B7D15EC3-160A-466F-A46C-7801FE6295A7 Old ItemGUID= New ItemGUID=95F3E143-EA06-44EF-84F2-36A9B3AD700C Old RevisionGUID= New RevisionGUID=00D6F1AB-B154-4BD4-A8D6-4D6024024DD5
Change Managed Component Library Link : Designator=C39 Old VaultGUID= New VaultGUID=B7D15EC3-160A-466F-A46C-7801FE6295A7 Old ItemGUID= New ItemGUID=95F3E143-EA06-44EF-84F2-36A9B3AD700C Old RevisionGUID= New RevisionGUID=00D6F1AB-B154-4BD4-A8D6-4D6024024DD5
Change Managed Component Library Link : Designator=C40 Old VaultGUID= New VaultGUID=B7D15EC3-160A-466F-A46C-7801FE6295A7 Old ItemGUID= New ItemGUID=95F3E143-EA06-44EF-84F2-36A9B3AD700C Old RevisionGUID= New RevisionGUID=00D6F1AB-B154-4BD4-A8D6-4D6024024DD5
Change Managed Component Library Link : Designator=C41 Old VaultGUID= New VaultGUID=B7D15EC3-160A-466F-A46C-7801FE6295A7 Old ItemGUID= New ItemGUID=95F3E143-EA06-44EF-84F2-36A9B3AD700C Old RevisionGUID= New RevisionGUID=00D6F1AB-B154-4BD4-A8D6-4D6024024DD5
Change Managed Component Library Link : Designator=C42 Old VaultGUID= New VaultGUID=B7D15EC3-160A-466F-A46C-7801FE6295A7 Old ItemGUID= New ItemGUID=2B3599F1-B1A6-4C4B-9FAD-DE4C9E1C6A82 Old RevisionGUID= New RevisionGUID=E211AB85-3B77-4E5D-888B-1362818A2E8F
Change Managed Component Library Link : Designator=C43 Old VaultGUID= New VaultGUID=B7D15EC3-160A-466F-A46C-7801FE6295A7 Old ItemGUID= New ItemGUID=2B3599F1-B1A6-4C4B-9FAD-DE4C9E1C6A82 Old RevisionGUID= New RevisionGUID=E211AB85-3B77-4E5D-888B-1362818A2E8F
Change Managed Component Library Link : Designator=C44 Old VaultGUID= New VaultGUID=B7D15EC3-160A-466F-A46C-7801FE6295A7 Old ItemGUID= New ItemGUID=501E2D9C-4BE3-4844-92AF-0A039EC046A2 Old RevisionGUID= New RevisionGUID=2B036562-6D79-4C11-83E5-A5D35C680386
Change Managed Component Library Link : Designator=C45 Old VaultGUID= New VaultGUID=B7D15EC3-160A-466F-A46C-7801FE6295A7 Old ItemGUID= New ItemGUID=C98C359C-CEB5-44E0-92D4-95D40DC1E828 Old RevisionGUID= New RevisionGUID=6C044E54-DA61-4925-9405-30BAD51B2F8C
Change Managed Component Library Link : Designator=C46 Old VaultGUID= New VaultGUID=B7D15EC3-160A-466F-A46C-7801FE6295A7 Old ItemGUID= New ItemGUID=C0BB9692-71F7-44D6-9C77-94276E9877FA Old RevisionGUID= New RevisionGUID=11F13CB0-EC5A-4856-94F0-2FB0271D2BF6
Change Managed Component Library Link : Designator=C47 Old VaultGUID= New VaultGUID=B7D15EC3-160A-466F-A46C-7801FE6295A7 Old ItemGUID= New ItemGUID=95F3E143-EA06-44EF-84F2-36A9B3AD700C Old RevisionGUID= New RevisionGUID=00D6F1AB-B154-4BD4-A8D6-4D6024024DD5
Change Managed Component Library Link : Designator=C48 Old VaultGUID= New VaultGUID=B7D15EC3-160A-466F-A46C-7801FE6295A7 Old ItemGUID= New ItemGUID=95F3E143-EA06-44EF-84F2-36A9B3AD700C Old RevisionGUID= New RevisionGUID=00D6F1AB-B154-4BD4-A8D6-4D6024024DD5
Change Managed Component Library Link : Designator=C49 Old VaultGUID= New VaultGUID=B7D15EC3-160A-466F-A46C-7801FE6295A7 Old ItemGUID= New ItemGUID=501E2D9C-4BE3-4844-92AF-0A039EC046A2 Old RevisionGUID= New RevisionGUID=2B036562-6D79-4C11-83E5-A5D35C680386
Change Managed Component Library Link : Designator=C50 Old VaultGUID= New VaultGUID=B7D15EC3-160A-466F-A46C-7801FE6295A7 Old ItemGUID= New ItemGUID=501E2D9C-4BE3-4844-92AF-0A039EC046A2 Old RevisionGUID= New RevisionGUID=2B036562-6D79-4C11-83E5-A5D35C680386
Change Managed Component Library Link : Designator=C51 Old VaultGUID= New VaultGUID=B7D15EC3-160A-466F-A46C-7801FE6295A7 Old ItemGUID= New ItemGUID=95F3E143-EA06-44EF-84F2-36A9B3AD700C Old RevisionGUID= New RevisionGUID=00D6F1AB-B154-4BD4-A8D6-4D6024024DD5
Change Managed Component Library Link : Designator=C52 Old VaultGUID= New VaultGUID=B7D15EC3-160A-466F-A46C-7801FE6295A7 Old ItemGUID= New ItemGUID=2B3599F1-B1A6-4C4B-9FAD-DE4C9E1C6A82 Old RevisionGUID= New RevisionGUID=E211AB85-3B77-4E5D-888B-1362818A2E8F
Change Managed Component Library Link : Designator=C53 Old VaultGUID= New VaultGUID=B7D15EC3-160A-466F-A46C-7801FE6295A7 Old ItemGUID= New ItemGUID=90C65F01-9895-4DEF-BCB6-66FF970887DF Old RevisionGUID= New RevisionGUID=CFA8945A-543C-4AAF-A06F-6E8C4635BDA8
Change Managed Component Library Link : Designator=C54 Old VaultGUID= New VaultGUID=B7D15EC3-160A-466F-A46C-7801FE6295A7 Old ItemGUID= New ItemGUID=90C65F01-9895-4DEF-BCB6-66FF970887DF Old RevisionGUID= New RevisionGUID=CFA8945A-543C-4AAF-A06F-6E8C4635BDA8
Change Managed Component Library Link : Designator=C55 Old VaultGUID= New VaultGUID=B7D15EC3-160A-466F-A46C-7801FE6295A7 Old ItemGUID= New ItemGUID=2B3599F1-B1A6-4C4B-9FAD-DE4C9E1C6A82 Old RevisionGUID= New RevisionGUID=E211AB85-3B77-4E5D-888B-1362818A2E8F
Change Managed Component Library Link : Designator=C56 Old VaultGUID= New VaultGUID=B7D15EC3-160A-466F-A46C-7801FE6295A7 Old ItemGUID= New ItemGUID=2B3599F1-B1A6-4C4B-9FAD-DE4C9E1C6A82 Old RevisionGUID= New RevisionGUID=E211AB85-3B77-4E5D-888B-1362818A2E8F
Change Managed Component Library Link : Designator=C57 Old VaultGUID= New VaultGUID=B7D15EC3-160A-466F-A46C-7801FE6295A7 Old ItemGUID= New ItemGUID=2B3599F1-B1A6-4C4B-9FAD-DE4C9E1C6A82 Old RevisionGUID= New RevisionGUID=E211AB85-3B77-4E5D-888B-1362818A2E8F
Change Managed Component Library Link : Designator=C58 Old VaultGUID= New VaultGUID=B7D15EC3-160A-466F-A46C-7801FE6295A7 Old ItemGUID= New ItemGUID=95F3E143-EA06-44EF-84F2-36A9B3AD700C Old RevisionGUID= New RevisionGUID=00D6F1AB-B154-4BD4-A8D6-4D6024024DD5
Change Managed Component Library Link : Designator=C59 Old VaultGUID= New VaultGUID=B7D15EC3-160A-466F-A46C-7801FE6295A7 Old ItemGUID= New ItemGUID=95F3E143-EA06-44EF-84F2-36A9B3AD700C Old RevisionGUID= New RevisionGUID=00D6F1AB-B154-4BD4-A8D6-4D6024024DD5
Change Managed Component Library Link : Designator=C60 Old VaultGUID= New VaultGUID=B7D15EC3-160A-466F-A46C-7801FE6295A7 Old ItemGUID= New ItemGUID=95F3E143-EA06-44EF-84F2-36A9B3AD700C Old RevisionGUID= New RevisionGUID=00D6F1AB-B154-4BD4-A8D6-4D6024024DD5
Change Managed Component Library Link : Designator=C61 Old VaultGUID= New VaultGUID=B7D15EC3-160A-466F-A46C-7801FE6295A7 Old ItemGUID= New ItemGUID=95F3E143-EA06-44EF-84F2-36A9B3AD700C Old RevisionGUID= New RevisionGUID=00D6F1AB-B154-4BD4-A8D6-4D6024024DD5
Change Managed Component Library Link : Designator=C62 Old VaultGUID= New VaultGUID=B7D15EC3-160A-466F-A46C-7801FE6295A7 Old ItemGUID= New ItemGUID=95F3E143-EA06-44EF-84F2-36A9B3AD700C Old RevisionGUID= New RevisionGUID=00D6F1AB-B154-4BD4-A8D6-4D6024024DD5
Change Managed Component Library Link : Designator=C63 Old VaultGUID= New VaultGUID=B7D15EC3-160A-466F-A46C-7801FE6295A7 Old ItemGUID= New ItemGUID=95F3E143-EA06-44EF-84F2-36A9B3AD700C Old RevisionGUID= New RevisionGUID=00D6F1AB-B154-4BD4-A8D6-4D6024024DD5
Change Managed Component Library Link : Designator=C64 Old VaultGUID= New VaultGUID=B7D15EC3-160A-466F-A46C-7801FE6295A7 Old ItemGUID= New ItemGUID=95F3E143-EA06-44EF-84F2-36A9B3AD700C Old RevisionGUID= New RevisionGUID=00D6F1AB-B154-4BD4-A8D6-4D6024024DD5
Change Managed Component Library Link : Designator=C65 Old VaultGUID= New VaultGUID=B7D15EC3-160A-466F-A46C-7801FE6295A7 Old ItemGUID= New ItemGUID=95F3E143-EA06-44EF-84F2-36A9B3AD700C Old RevisionGUID= New RevisionGUID=00D6F1AB-B154-4BD4-A8D6-4D6024024DD5
Change Managed Component Library Link : Designator=C66 Old VaultGUID= New VaultGUID=B7D15EC3-160A-466F-A46C-7801FE6295A7 Old ItemGUID= New ItemGUID=2B3599F1-B1A6-4C4B-9FAD-DE4C9E1C6A82 Old RevisionGUID= New RevisionGUID=E211AB85-3B77-4E5D-888B-1362818A2E8F
Change Managed Component Library Link : Designator=C67 Old VaultGUID= New VaultGUID=B7D15EC3-160A-466F-A46C-7801FE6295A7 Old ItemGUID= New ItemGUID=6F1B6B58-7D02-4BC2-ADD5-30CA0C710D0D Old RevisionGUID= New RevisionGUID=35875128-28DD-4E66-9F51-7FF48DA4E9AB
Change Managed Component Library Link : Designator=C68 Old VaultGUID= New VaultGUID=B7D15EC3-160A-466F-A46C-7801FE6295A7 Old ItemGUID= New ItemGUID=6F1B6B58-7D02-4BC2-ADD5-30CA0C710D0D Old RevisionGUID= New RevisionGUID=35875128-28DD-4E66-9F51-7FF48DA4E9AB
Change Managed Component Library Link : Designator=C69 Old VaultGUID= New VaultGUID=B7D15EC3-160A-466F-A46C-7801FE6295A7 Old ItemGUID= New ItemGUID=6F1B6B58-7D02-4BC2-ADD5-30CA0C710D0D Old RevisionGUID= New RevisionGUID=35875128-28DD-4E66-9F51-7FF48DA4E9AB
Change Managed Component Library Link : Designator=C70 Old VaultGUID= New VaultGUID=B7D15EC3-160A-466F-A46C-7801FE6295A7 Old ItemGUID= New ItemGUID=6F1B6B58-7D02-4BC2-ADD5-30CA0C710D0D Old RevisionGUID= New RevisionGUID=35875128-28DD-4E66-9F51-7FF48DA4E9AB
Change Managed Component Library Link : Designator=C71 Old VaultGUID= New VaultGUID=B7D15EC3-160A-466F-A46C-7801FE6295A7 Old ItemGUID= New ItemGUID=C0BB9692-71F7-44D6-9C77-94276E9877FA Old RevisionGUID= New RevisionGUID=11F13CB0-EC5A-4856-94F0-2FB0271D2BF6
Change Managed Component Library Link : Designator=C72 Old VaultGUID= New VaultGUID=B7D15EC3-160A-466F-A46C-7801FE6295A7 Old ItemGUID= New ItemGUID=90C65F01-9895-4DEF-BCB6-66FF970887DF Old RevisionGUID= New RevisionGUID=CFA8945A-543C-4AAF-A06F-6E8C4635BDA8
Change Managed Component Library Link : Designator=C73 Old VaultGUID= New VaultGUID=B7D15EC3-160A-466F-A46C-7801FE6295A7 Old ItemGUID= New ItemGUID=C0BB9692-71F7-44D6-9C77-94276E9877FA Old RevisionGUID= New RevisionGUID=11F13CB0-EC5A-4856-94F0-2FB0271D2BF6
Change Managed Component Library Link : Designator=C74 Old VaultGUID= New VaultGUID=B7D15EC3-160A-466F-A46C-7801FE6295A7 Old ItemGUID= New ItemGUID=90C65F01-9895-4DEF-BCB6-66FF970887DF Old RevisionGUID= New RevisionGUID=CFA8945A-543C-4AAF-A06F-6E8C4635BDA8
Change Managed Component Library Link : Designator=C75 Old VaultGUID= New VaultGUID=B7D15EC3-160A-466F-A46C-7801FE6295A7 Old ItemGUID= New ItemGUID=90C65F01-9895-4DEF-BCB6-66FF970887DF Old RevisionGUID= New RevisionGUID=CFA8945A-543C-4AAF-A06F-6E8C4635BDA8
Change Managed Component Library Link : Designator=C76 Old VaultGUID= New VaultGUID=B7D15EC3-160A-466F-A46C-7801FE6295A7 Old ItemGUID= New ItemGUID=C0BB9692-71F7-44D6-9C77-94276E9877FA Old RevisionGUID= New RevisionGUID=11F13CB0-EC5A-4856-94F0-2FB0271D2BF6
Change Managed Component Library Link : Designator=C77 Old VaultGUID= New VaultGUID=B7D15EC3-160A-466F-A46C-7801FE6295A7 Old ItemGUID= New ItemGUID=90C65F01-9895-4DEF-BCB6-66FF970887DF Old RevisionGUID= New RevisionGUID=CFA8945A-543C-4AAF-A06F-6E8C4635BDA8
Change Managed Component Library Link : Designator=C78 Old VaultGUID= New VaultGUID=B7D15EC3-160A-466F-A46C-7801FE6295A7 Old ItemGUID= New ItemGUID=C0BB9692-71F7-44D6-9C77-94276E9877FA Old RevisionGUID= New RevisionGUID=11F13CB0-EC5A-4856-94F0-2FB0271D2BF6
Change Managed Component Library Link : Designator=C79 Old VaultGUID= New VaultGUID=B7D15EC3-160A-466F-A46C-7801FE6295A7 Old ItemGUID= New ItemGUID=90C65F01-9895-4DEF-BCB6-66FF970887DF Old RevisionGUID= New RevisionGUID=CFA8945A-543C-4AAF-A06F-6E8C4635BDA8
Change Managed Component Library Link : Designator=C80 Old VaultGUID= New VaultGUID=B7D15EC3-160A-466F-A46C-7801FE6295A7 Old ItemGUID= New ItemGUID=C0BB9692-71F7-44D6-9C77-94276E9877FA Old RevisionGUID= New RevisionGUID=11F13CB0-EC5A-4856-94F0-2FB0271D2BF6
Change Managed Component Library Link : Designator=C81 Old VaultGUID= New VaultGUID=B7D15EC3-160A-466F-A46C-7801FE6295A7 Old ItemGUID= New ItemGUID=90C65F01-9895-4DEF-BCB6-66FF970887DF Old RevisionGUID= New RevisionGUID=CFA8945A-543C-4AAF-A06F-6E8C4635BDA8
Change Managed Component Library Link : Designator=C82 Old VaultGUID= New VaultGUID=B7D15EC3-160A-466F-A46C-7801FE6295A7 Old ItemGUID= New ItemGUID=C0BB9692-71F7-44D6-9C77-94276E9877FA Old RevisionGUID= New RevisionGUID=11F13CB0-EC5A-4856-94F0-2FB0271D2BF6
Change Managed Component Library Link : Designator=C83 Old VaultGUID= New VaultGUID=B7D15EC3-160A-466F-A46C-7801FE6295A7 Old ItemGUID= New ItemGUID=2B3599F1-B1A6-4C4B-9FAD-DE4C9E1C6A82 Old RevisionGUID= New RevisionGUID=E211AB85-3B77-4E5D-888B-1362818A2E8F
Change Managed Component Library Link : Designator=C84 Old VaultGUID= New VaultGUID=B7D15EC3-160A-466F-A46C-7801FE6295A7 Old ItemGUID= New ItemGUID=2B3599F1-B1A6-4C4B-9FAD-DE4C9E1C6A82 Old RevisionGUID= New RevisionGUID=E211AB85-3B77-4E5D-888B-1362818A2E8F
Change Managed Component Library Link : Designator=C85 Old VaultGUID= New VaultGUID=B7D15EC3-160A-466F-A46C-7801FE6295A7 Old ItemGUID= New ItemGUID=2B3599F1-B1A6-4C4B-9FAD-DE4C9E1C6A82 Old RevisionGUID= New RevisionGUID=E211AB85-3B77-4E5D-888B-1362818A2E8F
Change Managed Component Library Link : Designator=C86 Old VaultGUID= New VaultGUID=B7D15EC3-160A-466F-A46C-7801FE6295A7 Old ItemGUID= New ItemGUID=90C65F01-9895-4DEF-BCB6-66FF970887DF Old RevisionGUID= New RevisionGUID=CFA8945A-543C-4AAF-A06F-6E8C4635BDA8
Change Managed Component Library Link : Designator=C87 Old VaultGUID= New VaultGUID=B7D15EC3-160A-466F-A46C-7801FE6295A7 Old ItemGUID= New ItemGUID=501E2D9C-4BE3-4844-92AF-0A039EC046A2 Old RevisionGUID= New RevisionGUID=2B036562-6D79-4C11-83E5-A5D35C680386
Change Managed Component Library Link : Designator=C88 Old VaultGUID= New VaultGUID=B7D15EC3-160A-466F-A46C-7801FE6295A7 Old ItemGUID= New ItemGUID=95F3E143-EA06-44EF-84F2-36A9B3AD700C Old RevisionGUID= New RevisionGUID=00D6F1AB-B154-4BD4-A8D6-4D6024024DD5
Change Managed Component Library Link : Designator=C89 Old VaultGUID= New VaultGUID=B7D15EC3-160A-466F-A46C-7801FE6295A7 Old ItemGUID= New ItemGUID=95F3E143-EA06-44EF-84F2-36A9B3AD700C Old RevisionGUID= New RevisionGUID=00D6F1AB-B154-4BD4-A8D6-4D6024024DD5
Change Managed Component Library Link : Designator=C90 Old VaultGUID= New VaultGUID=B7D15EC3-160A-466F-A46C-7801FE6295A7 Old ItemGUID= New ItemGUID=501E2D9C-4BE3-4844-92AF-0A039EC046A2 Old RevisionGUID= New RevisionGUID=2B036562-6D79-4C11-83E5-A5D35C680386
Change Managed Component Library Link : Designator=C91 Old VaultGUID= New VaultGUID=B7D15EC3-160A-466F-A46C-7801FE6295A7 Old ItemGUID= New ItemGUID=95F3E143-EA06-44EF-84F2-36A9B3AD700C Old RevisionGUID= New RevisionGUID=00D6F1AB-B154-4BD4-A8D6-4D6024024DD5
Change Managed Component Library Link : Designator=C92 Old VaultGUID= New VaultGUID=B7D15EC3-160A-466F-A46C-7801FE6295A7 Old ItemGUID= New ItemGUID=501E2D9C-4BE3-4844-92AF-0A039EC046A2 Old RevisionGUID= New RevisionGUID=2B036562-6D79-4C11-83E5-A5D35C680386
Change Managed Component Library Link : Designator=C93 Old VaultGUID= New VaultGUID=B7D15EC3-160A-466F-A46C-7801FE6295A7 Old ItemGUID= New ItemGUID=95F3E143-EA06-44EF-84F2-36A9B3AD700C Old RevisionGUID= New RevisionGUID=00D6F1AB-B154-4BD4-A8D6-4D6024024DD5
Change Managed Component Library Link : Designator=C94 Old VaultGUID= New VaultGUID=B7D15EC3-160A-466F-A46C-7801FE6295A7 Old ItemGUID= New ItemGUID=95F3E143-EA06-44EF-84F2-36A9B3AD700C Old RevisionGUID= New RevisionGUID=00D6F1AB-B154-4BD4-A8D6-4D6024024DD5
Change Managed Component Library Link : Designator=C95 Old VaultGUID= New VaultGUID=B7D15EC3-160A-466F-A46C-7801FE6295A7 Old ItemGUID= New ItemGUID=501E2D9C-4BE3-4844-92AF-0A039EC046A2 Old RevisionGUID= New RevisionGUID=2B036562-6D79-4C11-83E5-A5D35C680386
Change Managed Component Library Link : Designator=C96 Old VaultGUID= New VaultGUID=B7D15EC3-160A-466F-A46C-7801FE6295A7 Old ItemGUID= New ItemGUID=95F3E143-EA06-44EF-84F2-36A9B3AD700C Old RevisionGUID= New RevisionGUID=00D6F1AB-B154-4BD4-A8D6-4D6024024DD5
Change Managed Component Library Link : Designator=C97 Old VaultGUID= New VaultGUID=B7D15EC3-160A-466F-A46C-7801FE6295A7 Old ItemGUID= New ItemGUID=95F3E143-EA06-44EF-84F2-36A9B3AD700C Old RevisionGUID= New RevisionGUID=00D6F1AB-B154-4BD4-A8D6-4D6024024DD5
Change Managed Component Library Link : Designator=C98 Old VaultGUID= New VaultGUID=B7D15EC3-160A-466F-A46C-7801FE6295A7 Old ItemGUID= New ItemGUID=501E2D9C-4BE3-4844-92AF-0A039EC046A2 Old RevisionGUID= New RevisionGUID=2B036562-6D79-4C11-83E5-A5D35C680386
Change Managed Component Library Link : Designator=C99 Old VaultGUID= New VaultGUID=B7D15EC3-160A-466F-A46C-7801FE6295A7 Old ItemGUID= New ItemGUID=95F3E143-EA06-44EF-84F2-36A9B3AD700C Old RevisionGUID= New RevisionGUID=00D6F1AB-B154-4BD4-A8D6-4D6024024DD5
Change Managed Component Library Link : Designator=C100 Old VaultGUID= New VaultGUID=B7D15EC3-160A-466F-A46C-7801FE6295A7 Old ItemGUID= New ItemGUID=501E2D9C-4BE3-4844-92AF-0A039EC046A2 Old RevisionGUID= New RevisionGUID=2B036562-6D79-4C11-83E5-A5D35C680386
Change Managed Component Library Link : Designator=C101 Old VaultGUID= New VaultGUID=B7D15EC3-160A-466F-A46C-7801FE6295A7 Old ItemGUID= New ItemGUID=95F3E143-EA06-44EF-84F2-36A9B3AD700C Old RevisionGUID= New RevisionGUID=00D6F1AB-B154-4BD4-A8D6-4D6024024DD5
Change Managed Component Library Link : Designator=C102 Old VaultGUID= New VaultGUID=B7D15EC3-160A-466F-A46C-7801FE6295A7 Old ItemGUID= New ItemGUID=95F3E143-EA06-44EF-84F2-36A9B3AD700C Old RevisionGUID= New RevisionGUID=00D6F1AB-B154-4BD4-A8D6-4D6024024DD5
Change Managed Component Library Link : Designator=C103 Old VaultGUID= New VaultGUID=B7D15EC3-160A-466F-A46C-7801FE6295A7 Old ItemGUID= New ItemGUID=501E2D9C-4BE3-4844-92AF-0A039EC046A2 Old RevisionGUID= New RevisionGUID=2B036562-6D79-4C11-83E5-A5D35C680386
Change Managed Component Library Link : Designator=C104 Old VaultGUID= New VaultGUID=B7D15EC3-160A-466F-A46C-7801FE6295A7 Old ItemGUID= New ItemGUID=95F3E143-EA06-44EF-84F2-36A9B3AD700C Old RevisionGUID= New RevisionGUID=00D6F1AB-B154-4BD4-A8D6-4D6024024DD5
Change Managed Component Library Link : Designator=C105 Old VaultGUID= New VaultGUID=B7D15EC3-160A-466F-A46C-7801FE6295A7 Old ItemGUID= New ItemGUID=95F3E143-EA06-44EF-84F2-36A9B3AD700C Old RevisionGUID= New RevisionGUID=00D6F1AB-B154-4BD4-A8D6-4D6024024DD5
Change Managed Component Library Link : Designator=C106 Old VaultGUID= New VaultGUID=B7D15EC3-160A-466F-A46C-7801FE6295A7 Old ItemGUID= New ItemGUID=501E2D9C-4BE3-4844-92AF-0A039EC046A2 Old RevisionGUID= New RevisionGUID=2B036562-6D79-4C11-83E5-A5D35C680386
Change Managed Component Library Link : Designator=C107 Old VaultGUID= New VaultGUID=B7D15EC3-160A-466F-A46C-7801FE6295A7 Old ItemGUID= New ItemGUID=95F3E143-EA06-44EF-84F2-36A9B3AD700C Old RevisionGUID= New RevisionGUID=00D6F1AB-B154-4BD4-A8D6-4D6024024DD5
Change Managed Component Library Link : Designator=C108 Old VaultGUID= New VaultGUID=B7D15EC3-160A-466F-A46C-7801FE6295A7 Old ItemGUID= New ItemGUID=501E2D9C-4BE3-4844-92AF-0A039EC046A2 Old RevisionGUID= New RevisionGUID=2B036562-6D79-4C11-83E5-A5D35C680386
Change Managed Component Library Link : Designator=C109 Old VaultGUID= New VaultGUID=B7D15EC3-160A-466F-A46C-7801FE6295A7 Old ItemGUID= New ItemGUID=95F3E143-EA06-44EF-84F2-36A9B3AD700C Old RevisionGUID= New RevisionGUID=00D6F1AB-B154-4BD4-A8D6-4D6024024DD5
Change Managed Component Library Link : Designator=C110 Old VaultGUID= New VaultGUID=B7D15EC3-160A-466F-A46C-7801FE6295A7 Old ItemGUID= New ItemGUID=95F3E143-EA06-44EF-84F2-36A9B3AD700C Old RevisionGUID= New RevisionGUID=00D6F1AB-B154-4BD4-A8D6-4D6024024DD5
Change Managed Component Library Link : Designator=C111 Old VaultGUID= New VaultGUID=B7D15EC3-160A-466F-A46C-7801FE6295A7 Old ItemGUID= New ItemGUID=501E2D9C-4BE3-4844-92AF-0A039EC046A2 Old RevisionGUID= New RevisionGUID=2B036562-6D79-4C11-83E5-A5D35C680386
Change Managed Component Library Link : Designator=C112 Old VaultGUID= New VaultGUID=B7D15EC3-160A-466F-A46C-7801FE6295A7 Old ItemGUID= New ItemGUID=95F3E143-EA06-44EF-84F2-36A9B3AD700C Old RevisionGUID= New RevisionGUID=00D6F1AB-B154-4BD4-A8D6-4D6024024DD5
Change Managed Component Library Link : Designator=C113 Old VaultGUID= New VaultGUID=B7D15EC3-160A-466F-A46C-7801FE6295A7 Old ItemGUID= New ItemGUID=95F3E143-EA06-44EF-84F2-36A9B3AD700C Old RevisionGUID= New RevisionGUID=00D6F1AB-B154-4BD4-A8D6-4D6024024DD5
Change Managed Component Library Link : Designator=C114 Old VaultGUID= New VaultGUID=B7D15EC3-160A-466F-A46C-7801FE6295A7 Old ItemGUID= New ItemGUID=501E2D9C-4BE3-4844-92AF-0A039EC046A2 Old RevisionGUID= New RevisionGUID=2B036562-6D79-4C11-83E5-A5D35C680386
Change Managed Component Library Link : Designator=C115 Old VaultGUID= New VaultGUID=B7D15EC3-160A-466F-A46C-7801FE6295A7 Old ItemGUID= New ItemGUID=95F3E143-EA06-44EF-84F2-36A9B3AD700C Old RevisionGUID= New RevisionGUID=00D6F1AB-B154-4BD4-A8D6-4D6024024DD5
Change Managed Component Library Link : Designator=C116 Old VaultGUID= New VaultGUID=B7D15EC3-160A-466F-A46C-7801FE6295A7 Old ItemGUID= New ItemGUID=501E2D9C-4BE3-4844-92AF-0A039EC046A2 Old RevisionGUID= New RevisionGUID=2B036562-6D79-4C11-83E5-A5D35C680386
Change Managed Component Library Link : Designator=C117 Old VaultGUID= New VaultGUID=B7D15EC3-160A-466F-A46C-7801FE6295A7 Old ItemGUID= New ItemGUID=95F3E143-EA06-44EF-84F2-36A9B3AD700C Old RevisionGUID= New RevisionGUID=00D6F1AB-B154-4BD4-A8D6-4D6024024DD5
Change Managed Component Library Link : Designator=C118 Old VaultGUID= New VaultGUID=B7D15EC3-160A-466F-A46C-7801FE6295A7 Old ItemGUID= New ItemGUID=95F3E143-EA06-44EF-84F2-36A9B3AD700C Old RevisionGUID= New RevisionGUID=00D6F1AB-B154-4BD4-A8D6-4D6024024DD5
Change Managed Component Library Link : Designator=C119 Old VaultGUID= New VaultGUID=B7D15EC3-160A-466F-A46C-7801FE6295A7 Old ItemGUID= New ItemGUID=501E2D9C-4BE3-4844-92AF-0A039EC046A2 Old RevisionGUID= New RevisionGUID=2B036562-6D79-4C11-83E5-A5D35C680386
Change Managed Component Library Link : Designator=C120 Old VaultGUID= New VaultGUID=B7D15EC3-160A-466F-A46C-7801FE6295A7 Old ItemGUID= New ItemGUID=95F3E143-EA06-44EF-84F2-36A9B3AD700C Old RevisionGUID= New RevisionGUID=00D6F1AB-B154-4BD4-A8D6-4D6024024DD5
Change Managed Component Library Link : Designator=C121 Old VaultGUID= New VaultGUID=B7D15EC3-160A-466F-A46C-7801FE6295A7 Old ItemGUID= New ItemGUID=95F3E143-EA06-44EF-84F2-36A9B3AD700C Old RevisionGUID= New RevisionGUID=00D6F1AB-B154-4BD4-A8D6-4D6024024DD5
Change Managed Component Library Link : Designator=C122 Old VaultGUID= New VaultGUID=B7D15EC3-160A-466F-A46C-7801FE6295A7 Old ItemGUID= New ItemGUID=501E2D9C-4BE3-4844-92AF-0A039EC046A2 Old RevisionGUID= New RevisionGUID=2B036562-6D79-4C11-83E5-A5D35C680386
Change Managed Component Library Link : Designator=C123 Old VaultGUID= New VaultGUID=B7D15EC3-160A-466F-A46C-7801FE6295A7 Old ItemGUID= New ItemGUID=95F3E143-EA06-44EF-84F2-36A9B3AD700C Old RevisionGUID= New RevisionGUID=00D6F1AB-B154-4BD4-A8D6-4D6024024DD5
Change Managed Component Library Link : Designator=C124 Old VaultGUID= New VaultGUID=B7D15EC3-160A-466F-A46C-7801FE6295A7 Old ItemGUID= New ItemGUID=501E2D9C-4BE3-4844-92AF-0A039EC046A2 Old RevisionGUID= New RevisionGUID=2B036562-6D79-4C11-83E5-A5D35C680386
Change Managed Component Library Link : Designator=C125 Old VaultGUID= New VaultGUID=B7D15EC3-160A-466F-A46C-7801FE6295A7 Old ItemGUID= New ItemGUID=95F3E143-EA06-44EF-84F2-36A9B3AD700C Old RevisionGUID= New RevisionGUID=00D6F1AB-B154-4BD4-A8D6-4D6024024DD5
Change Managed Component Library Link : Designator=C126 Old VaultGUID= New VaultGUID=B7D15EC3-160A-466F-A46C-7801FE6295A7 Old ItemGUID= New ItemGUID=95F3E143-EA06-44EF-84F2-36A9B3AD700C Old RevisionGUID= New RevisionGUID=00D6F1AB-B154-4BD4-A8D6-4D6024024DD5
Change Managed Component Library Link : Designator=C127 Old VaultGUID= New VaultGUID=B7D15EC3-160A-466F-A46C-7801FE6295A7 Old ItemGUID= New ItemGUID=501E2D9C-4BE3-4844-92AF-0A039EC046A2 Old RevisionGUID= New RevisionGUID=2B036562-6D79-4C11-83E5-A5D35C680386
Change Managed Component Library Link : Designator=C128 Old VaultGUID= New VaultGUID=B7D15EC3-160A-466F-A46C-7801FE6295A7 Old ItemGUID= New ItemGUID=95F3E143-EA06-44EF-84F2-36A9B3AD700C Old RevisionGUID= New RevisionGUID=00D6F1AB-B154-4BD4-A8D6-4D6024024DD5
Change Managed Component Library Link : Designator=C129 Old VaultGUID= New VaultGUID=B7D15EC3-160A-466F-A46C-7801FE6295A7 Old ItemGUID= New ItemGUID=95F3E143-EA06-44EF-84F2-36A9B3AD700C Old RevisionGUID= New RevisionGUID=00D6F1AB-B154-4BD4-A8D6-4D6024024DD5
Change Managed Component Library Link : Designator=C130 Old VaultGUID= New VaultGUID=B7D15EC3-160A-466F-A46C-7801FE6295A7 Old ItemGUID= New ItemGUID=501E2D9C-4BE3-4844-92AF-0A039EC046A2 Old RevisionGUID= New RevisionGUID=2B036562-6D79-4C11-83E5-A5D35C680386
Change Managed Component Library Link : Designator=C131 Old VaultGUID= New VaultGUID=B7D15EC3-160A-466F-A46C-7801FE6295A7 Old ItemGUID= New ItemGUID=95F3E143-EA06-44EF-84F2-36A9B3AD700C Old RevisionGUID= New RevisionGUID=00D6F1AB-B154-4BD4-A8D6-4D6024024DD5
Change Managed Component Library Link : Designator=C132 Old VaultGUID= New VaultGUID=B7D15EC3-160A-466F-A46C-7801FE6295A7 Old ItemGUID= New ItemGUID=501E2D9C-4BE3-4844-92AF-0A039EC046A2 Old RevisionGUID= New RevisionGUID=2B036562-6D79-4C11-83E5-A5D35C680386
Change Managed Component Library Link : Designator=C133 Old VaultGUID= New VaultGUID=B7D15EC3-160A-466F-A46C-7801FE6295A7 Old ItemGUID= New ItemGUID=95F3E143-EA06-44EF-84F2-36A9B3AD700C Old RevisionGUID= New RevisionGUID=00D6F1AB-B154-4BD4-A8D6-4D6024024DD5
Change Managed Component Library Link : Designator=C134 Old VaultGUID= New VaultGUID=B7D15EC3-160A-466F-A46C-7801FE6295A7 Old ItemGUID= New ItemGUID=95F3E143-EA06-44EF-84F2-36A9B3AD700C Old RevisionGUID= New RevisionGUID=00D6F1AB-B154-4BD4-A8D6-4D6024024DD5
Change Managed Component Library Link : Designator=C135 Old VaultGUID= New VaultGUID=B7D15EC3-160A-466F-A46C-7801FE6295A7 Old ItemGUID= New ItemGUID=501E2D9C-4BE3-4844-92AF-0A039EC046A2 Old RevisionGUID= New RevisionGUID=2B036562-6D79-4C11-83E5-A5D35C680386
Change Managed Component Library Link : Designator=C136 Old VaultGUID= New VaultGUID=B7D15EC3-160A-466F-A46C-7801FE6295A7 Old ItemGUID= New ItemGUID=95F3E143-EA06-44EF-84F2-36A9B3AD700C Old RevisionGUID= New RevisionGUID=00D6F1AB-B154-4BD4-A8D6-4D6024024DD5
Change Managed Component Library Link : Designator=D1 Old VaultGUID= New VaultGUID=B7D15EC3-160A-466F-A46C-7801FE6295A7 Old ItemGUID= New ItemGUID=9CB17EAD-2BDD-462E-B396-FA51CDB0AEF4 Old RevisionGUID= New RevisionGUID=61407D99-38F2-4F09-B7CB-2F825ABF5F44
Change Managed Component Library Link : Designator=D2 Old VaultGUID= New VaultGUID=B7D15EC3-160A-466F-A46C-7801FE6295A7 Old ItemGUID= New ItemGUID=FFC25D15-A8DC-41E8-80EF-11D4B21D8159 Old RevisionGUID= New RevisionGUID=61E95679-C9D9-495A-95C5-C411338BEDC0
Change Managed Component Library Link : Designator=D3 Old VaultGUID= New VaultGUID=B7D15EC3-160A-466F-A46C-7801FE6295A7 Old ItemGUID= New ItemGUID=658C4458-BBC4-4DE0-9402-99C83274C920 Old RevisionGUID= New RevisionGUID=E2AA0242-B2B2-462C-83FA-0A703AAF1C3F
Change Managed Component Library Link : Designator=D4 Old VaultGUID= New VaultGUID=B7D15EC3-160A-466F-A46C-7801FE6295A7 Old ItemGUID= New ItemGUID=658C4458-BBC4-4DE0-9402-99C83274C920 Old RevisionGUID= New RevisionGUID=E2AA0242-B2B2-462C-83FA-0A703AAF1C3F
Change Managed Component Library Link : Designator=D5 Old VaultGUID= New VaultGUID=B7D15EC3-160A-466F-A46C-7801FE6295A7 Old ItemGUID= New ItemGUID=CF6D2DDE-72C8-4FF1-8B03-219B6DB77A1E Old RevisionGUID= New RevisionGUID=DBF0D95C-2D78-48C1-ACA7-81A14481052B
Change Managed Component Library Link : Designator=D6 Old VaultGUID= New VaultGUID=B7D15EC3-160A-466F-A46C-7801FE6295A7 Old ItemGUID= New ItemGUID=CF6D2DDE-72C8-4FF1-8B03-219B6DB77A1E Old RevisionGUID= New RevisionGUID=DBF0D95C-2D78-48C1-ACA7-81A14481052B
Change Managed Component Library Link : Designator=D7 Old VaultGUID= New VaultGUID=B7D15EC3-160A-466F-A46C-7801FE6295A7 Old ItemGUID= New ItemGUID=658C4458-BBC4-4DE0-9402-99C83274C920 Old RevisionGUID= New RevisionGUID=E2AA0242-B2B2-462C-83FA-0A703AAF1C3F
Change Managed Component Library Link : Designator=D8 Old VaultGUID= New VaultGUID=B7D15EC3-160A-466F-A46C-7801FE6295A7 Old ItemGUID= New ItemGUID=AC1CC715-6E21-4D86-A1F4-F629A8FE04BA Old RevisionGUID= New RevisionGUID=720B5FD6-DA10-44D9-9AF3-641520C50AC8
Change Managed Component Library Link : Designator=D9 Old VaultGUID= New VaultGUID=B7D15EC3-160A-466F-A46C-7801FE6295A7 Old ItemGUID= New ItemGUID=658C4458-BBC4-4DE0-9402-99C83274C920 Old RevisionGUID= New RevisionGUID=E2AA0242-B2B2-462C-83FA-0A703AAF1C3F
Change Managed Component Library Link : Designator=D10 Old VaultGUID= New VaultGUID=B7D15EC3-160A-466F-A46C-7801FE6295A7 Old ItemGUID= New ItemGUID=406BC5B5-03C4-44FA-8A26-D1B047554FE8 Old RevisionGUID= New RevisionGUID=E56D1793-A53D-4F71-875C-274DA5F61F41
Change Managed Component Library Link : Designator=D11 Old VaultGUID= New VaultGUID=B7D15EC3-160A-466F-A46C-7801FE6295A7 Old ItemGUID= New ItemGUID=2A9F2EB2-B2D2-4EE1-9A18-7FCB03FC08F4 Old RevisionGUID= New RevisionGUID=B9953E7E-ABB7-4D80-BA01-67FE8DCE8A1F
Change Managed Component Library Link : Designator=D12 Old VaultGUID= New VaultGUID=B7D15EC3-160A-466F-A46C-7801FE6295A7 Old ItemGUID= New ItemGUID=8E6A14BA-42FD-4004-8FF0-006D57CCDAFC Old RevisionGUID= New RevisionGUID=E7E511A2-6327-440E-81D9-361202FCA987
Change Managed Component Library Link : Designator=DS1 Old VaultGUID= New VaultGUID=B7D15EC3-160A-466F-A46C-7801FE6295A7 Old ItemGUID= New ItemGUID=D2E6D31C-768B-49A6-A721-EF4591295531 Old RevisionGUID= New RevisionGUID=DF28B7DB-573E-44C3-A9B7-CC090931279D
Change Managed Component Library Link : Designator=F1 Old VaultGUID= New VaultGUID=B7D15EC3-160A-466F-A46C-7801FE6295A7 Old ItemGUID= New ItemGUID=8782990C-042A-4CF4-8DD9-72EB9824183C Old RevisionGUID= New RevisionGUID=0F87878B-82A7-4EE7-A921-4CD3CA7A2BFD
Change Managed Component Library Link : Designator=FB1 Old VaultGUID= New VaultGUID=B7D15EC3-160A-466F-A46C-7801FE6295A7 Old ItemGUID= New ItemGUID=06B4A1EE-3696-4B74-87CA-D39F83E4616A Old RevisionGUID= New RevisionGUID=D4CC8638-9428-41D5-A370-8D17A8A36F69
Change Managed Component Library Link : Designator=FB2 Old VaultGUID= New VaultGUID=B7D15EC3-160A-466F-A46C-7801FE6295A7 Old ItemGUID= New ItemGUID=06B4A1EE-3696-4B74-87CA-D39F83E4616A Old RevisionGUID= New RevisionGUID=7D149B7C-AD0A-43FA-A185-AE1F8FD5280A
Change Managed Component Library Link : Designator=FB3 Old VaultGUID= New VaultGUID=B7D15EC3-160A-466F-A46C-7801FE6295A7 Old ItemGUID= New ItemGUID=06B4A1EE-3696-4B74-87CA-D39F83E4616A Old RevisionGUID= New RevisionGUID=7D149B7C-AD0A-43FA-A185-AE1F8FD5280A
Change Managed Component Library Link : Designator=FB4 Old VaultGUID= New VaultGUID=B7D15EC3-160A-466F-A46C-7801FE6295A7 Old ItemGUID= New ItemGUID=06B4A1EE-3696-4B74-87CA-D39F83E4616A Old RevisionGUID= New RevisionGUID=7D149B7C-AD0A-43FA-A185-AE1F8FD5280A
Change Managed Component Library Link : Designator=FB5 Old VaultGUID= New VaultGUID=B7D15EC3-160A-466F-A46C-7801FE6295A7 Old ItemGUID= New ItemGUID=06B4A1EE-3696-4B74-87CA-D39F83E4616A Old RevisionGUID= New RevisionGUID=7D149B7C-AD0A-43FA-A185-AE1F8FD5280A
Change Managed Component Library Link : Designator=FB6 Old VaultGUID= New VaultGUID=B7D15EC3-160A-466F-A46C-7801FE6295A7 Old ItemGUID= New ItemGUID=06B4A1EE-3696-4B74-87CA-D39F83E4616A Old RevisionGUID= New RevisionGUID=7D149B7C-AD0A-43FA-A185-AE1F8FD5280A
Change Managed Component Library Link : Designator=FB7 Old VaultGUID= New VaultGUID=B7D15EC3-160A-466F-A46C-7801FE6295A7 Old ItemGUID= New ItemGUID=06B4A1EE-3696-4B74-87CA-D39F83E4616A Old RevisionGUID= New RevisionGUID=7D149B7C-AD0A-43FA-A185-AE1F8FD5280A
Change Managed Component Library Link : Designator=FB8 Old VaultGUID= New VaultGUID=B7D15EC3-160A-466F-A46C-7801FE6295A7 Old ItemGUID= New ItemGUID=06B4A1EE-3696-4B74-87CA-D39F83E4616A Old RevisionGUID= New RevisionGUID=7D149B7C-AD0A-43FA-A185-AE1F8FD5280A
Change Managed Component Library Link : Designator=FB9 Old VaultGUID= New VaultGUID=B7D15EC3-160A-466F-A46C-7801FE6295A7 Old ItemGUID= New ItemGUID=06B4A1EE-3696-4B74-87CA-D39F83E4616A Old RevisionGUID= New RevisionGUID=7D149B7C-AD0A-43FA-A185-AE1F8FD5280A
Change Managed Component Library Link : Designator=FB10 Old VaultGUID= New VaultGUID=B7D15EC3-160A-466F-A46C-7801FE6295A7 Old ItemGUID= New ItemGUID=06B4A1EE-3696-4B74-87CA-D39F83E4616A Old RevisionGUID= New RevisionGUID=7D149B7C-AD0A-43FA-A185-AE1F8FD5280A
Change Managed Component Library Link : Designator=FB11 Old VaultGUID= New VaultGUID=B7D15EC3-160A-466F-A46C-7801FE6295A7 Old ItemGUID= New ItemGUID=06B4A1EE-3696-4B74-87CA-D39F83E4616A Old RevisionGUID= New RevisionGUID=7D149B7C-AD0A-43FA-A185-AE1F8FD5280A
Change Managed Component Library Link : Designator=FB12 Old VaultGUID= New VaultGUID=B7D15EC3-160A-466F-A46C-7801FE6295A7 Old ItemGUID= New ItemGUID=06B4A1EE-3696-4B74-87CA-D39F83E4616A Old RevisionGUID= New RevisionGUID=7D149B7C-AD0A-43FA-A185-AE1F8FD5280A
Change Managed Component Library Link : Designator=FB13 Old VaultGUID= New VaultGUID=B7D15EC3-160A-466F-A46C-7801FE6295A7 Old ItemGUID= New ItemGUID=06B4A1EE-3696-4B74-87CA-D39F83E4616A Old RevisionGUID= New RevisionGUID=7D149B7C-AD0A-43FA-A185-AE1F8FD5280A
Change Managed Component Library Link : Designator=FB14 Old VaultGUID= New VaultGUID=B7D15EC3-160A-466F-A46C-7801FE6295A7 Old ItemGUID= New ItemGUID=06B4A1EE-3696-4B74-87CA-D39F83E4616A Old RevisionGUID= New RevisionGUID=7D149B7C-AD0A-43FA-A185-AE1F8FD5280A
Change Managed Component Library Link : Designator=J1 Old VaultGUID= New VaultGUID=B7D15EC3-160A-466F-A46C-7801FE6295A7 Old ItemGUID= New ItemGUID=A3B5081E-E473-4920-9B07-D242AF7F57CA Old RevisionGUID= New RevisionGUID=5D3CE028-43E1-41E0-A6E9-2C8B30F5413A
Change Managed Component Library Link : Designator=J3 Old VaultGUID= New VaultGUID=B7D15EC3-160A-466F-A46C-7801FE6295A7 Old ItemGUID= New ItemGUID=7E2B50FD-2A3B-49F3-A919-DEBD51006B8D Old RevisionGUID= New RevisionGUID=31ACF149-959E-4052-8F65-535A3444434E
Change Managed Component Library Link : Designator=J6 Old VaultGUID= New VaultGUID=B7D15EC3-160A-466F-A46C-7801FE6295A7 Old ItemGUID= New ItemGUID=543C23AA-755E-4336-AA2E-C1CAA83FABFC Old RevisionGUID= New RevisionGUID=6F27F9FA-E72E-4D4E-B804-500BCB4D46C7
Change Managed Component Library Link : Designator=J7 Old VaultGUID= New VaultGUID=B7D15EC3-160A-466F-A46C-7801FE6295A7 Old ItemGUID= New ItemGUID=543C23AA-755E-4336-AA2E-C1CAA83FABFC Old RevisionGUID= New RevisionGUID=6F27F9FA-E72E-4D4E-B804-500BCB4D46C7
Change Managed Component Library Link : Designator=J8 Old VaultGUID= New VaultGUID=B7D15EC3-160A-466F-A46C-7801FE6295A7 Old ItemGUID= New ItemGUID=543C23AA-755E-4336-AA2E-C1CAA83FABFC Old RevisionGUID= New RevisionGUID=6F27F9FA-E72E-4D4E-B804-500BCB4D46C7
Change Managed Component Library Link : Designator=J9 Old VaultGUID= New VaultGUID=B7D15EC3-160A-466F-A46C-7801FE6295A7 Old ItemGUID= New ItemGUID=543C23AA-755E-4336-AA2E-C1CAA83FABFC Old RevisionGUID= New RevisionGUID=6F27F9FA-E72E-4D4E-B804-500BCB4D46C7
Change Managed Component Library Link : Designator=J11 Old VaultGUID= New VaultGUID=B7D15EC3-160A-466F-A46C-7801FE6295A7 Old ItemGUID= New ItemGUID=826D76B7-1C5C-4B22-9996-784B0E4FF211 Old RevisionGUID= New RevisionGUID=ECA3CFB4-C4D7-457A-A6DD-58A0BB7F258D
Change Managed Component Library Link : Designator=J12 Old VaultGUID= New VaultGUID=B7D15EC3-160A-466F-A46C-7801FE6295A7 Old ItemGUID= New ItemGUID=826D76B7-1C5C-4B22-9996-784B0E4FF211 Old RevisionGUID= New RevisionGUID=ECA3CFB4-C4D7-457A-A6DD-58A0BB7F258D
Change Managed Component Library Link : Designator=J13 Old VaultGUID= New VaultGUID=B7D15EC3-160A-466F-A46C-7801FE6295A7 Old ItemGUID= New ItemGUID=826D76B7-1C5C-4B22-9996-784B0E4FF211 Old RevisionGUID= New RevisionGUID=ECA3CFB4-C4D7-457A-A6DD-58A0BB7F258D
Change Managed Component Library Link : Designator=L2 Old VaultGUID= New VaultGUID=B7D15EC3-160A-466F-A46C-7801FE6295A7 Old ItemGUID= New ItemGUID=D97AFA1C-1EC1-4279-A4D2-6010F391B038 Old RevisionGUID= New RevisionGUID=A5B6EEAC-E4E5-4C59-BF6D-BFCF8D52ECDE
Change Managed Component Library Link : Designator=L3 Old VaultGUID= New VaultGUID=B7D15EC3-160A-466F-A46C-7801FE6295A7 Old ItemGUID= New ItemGUID=1183AC31-0188-49DA-BDED-8BCAA8C5AEDC Old RevisionGUID= New RevisionGUID=62CF36B9-BA6D-415E-88ED-0767B6F1903F
Change Managed Component Library Link : Designator=L4 Old VaultGUID= New VaultGUID=B7D15EC3-160A-466F-A46C-7801FE6295A7 Old ItemGUID= New ItemGUID=1183AC31-0188-49DA-BDED-8BCAA8C5AEDC Old RevisionGUID= New RevisionGUID=62CF36B9-BA6D-415E-88ED-0767B6F1903F
Change Managed Component Library Link : Designator=L5 Old VaultGUID= New VaultGUID=B7D15EC3-160A-466F-A46C-7801FE6295A7 Old ItemGUID= New ItemGUID=1183AC31-0188-49DA-BDED-8BCAA8C5AEDC Old RevisionGUID= New RevisionGUID=62CF36B9-BA6D-415E-88ED-0767B6F1903F
Change Managed Component Library Link : Designator=L6 Old VaultGUID= New VaultGUID=B7D15EC3-160A-466F-A46C-7801FE6295A7 Old ItemGUID= New ItemGUID=B7DFE875-7185-4578-98DB-D0458AF0E4A0 Old RevisionGUID= New RevisionGUID=61B2EFE0-D5E3-4747-B3E3-BBE130BCC9A2
Change Managed Component Library Link : Designator=P1 Old VaultGUID= New VaultGUID=B7D15EC3-160A-466F-A46C-7801FE6295A7 Old ItemGUID= New ItemGUID=95ADA48E-CA57-44CC-A74A-AFF0EE61A17F Old RevisionGUID= New RevisionGUID=203F3019-EF95-4D0A-AAC5-CF40FACAA0F4
Change Managed Component Library Link : Designator=P2 Old VaultGUID= New VaultGUID=B7D15EC3-160A-466F-A46C-7801FE6295A7 Old ItemGUID= New ItemGUID=5338FD11-61D6-4FE6-A522-8579E1E52019 Old RevisionGUID= New RevisionGUID=43F3A04B-91EC-40B9-9042-1FF6BD626C80
Change Managed Component Library Link : Designator=P3 Old VaultGUID= New VaultGUID=B7D15EC3-160A-466F-A46C-7801FE6295A7 Old ItemGUID= New ItemGUID=5A2B3EB5-AA35-481D-888C-981E3A4D9888 Old RevisionGUID= New RevisionGUID=7E8FBD0B-DC4D-4068-A66F-9F32DC32FC46
Change Managed Component Library Link : Designator=Q0 Old VaultGUID= New VaultGUID=B7D15EC3-160A-466F-A46C-7801FE6295A7 Old ItemGUID= New ItemGUID=05072257-A558-4B2B-8719-F12A11AB1F81 Old RevisionGUID= New RevisionGUID=82F6C5C6-306F-4F90-B908-D13C8EC91226
Change Managed Component Library Link : Designator=Q1 Old VaultGUID= New VaultGUID=B7D15EC3-160A-466F-A46C-7801FE6295A7 Old ItemGUID= New ItemGUID=05072257-A558-4B2B-8719-F12A11AB1F81 Old RevisionGUID= New RevisionGUID=82F6C5C6-306F-4F90-B908-D13C8EC91226
Change Managed Component Library Link : Designator=Q2 Old VaultGUID= New VaultGUID=B7D15EC3-160A-466F-A46C-7801FE6295A7 Old ItemGUID= New ItemGUID=05072257-A558-4B2B-8719-F12A11AB1F81 Old RevisionGUID= New RevisionGUID=82F6C5C6-306F-4F90-B908-D13C8EC91226
Change Managed Component Library Link : Designator=Q4 Old VaultGUID= New VaultGUID=B7D15EC3-160A-466F-A46C-7801FE6295A7 Old ItemGUID= New ItemGUID=E4880C0C-78B9-4EF8-9661-D64A35F7776E Old RevisionGUID= New RevisionGUID=568CE6B9-0C9D-4FD1-885A-56DDBCD703A6
Change Managed Component Library Link : Designator=Q5 Old VaultGUID= New VaultGUID=B7D15EC3-160A-466F-A46C-7801FE6295A7 Old ItemGUID= New ItemGUID=46A3D83F-C8B0-417D-93EC-64DF00300996 Old RevisionGUID= New RevisionGUID=DC104C7D-AE9C-490A-820A-B6FF6B26C90D
Change Managed Component Library Link : Designator=Q6 Old VaultGUID= New VaultGUID=B7D15EC3-160A-466F-A46C-7801FE6295A7 Old ItemGUID= New ItemGUID=75F5DB1E-D4A3-4FF3-9EBA-147E4E89FF76 Old RevisionGUID= New RevisionGUID=2BF8EB3E-7A2A-4A0E-8D9B-0F135B3ACC73
Change Managed Component Library Link : Designator=Q7 Old VaultGUID= New VaultGUID=B7D15EC3-160A-466F-A46C-7801FE6295A7 Old ItemGUID= New ItemGUID=75F5DB1E-D4A3-4FF3-9EBA-147E4E89FF76 Old RevisionGUID= New RevisionGUID=2BF8EB3E-7A2A-4A0E-8D9B-0F135B3ACC73
Change Managed Component Library Link : Designator=Q8 Old VaultGUID= New VaultGUID=B7D15EC3-160A-466F-A46C-7801FE6295A7 Old ItemGUID= New ItemGUID=75F5DB1E-D4A3-4FF3-9EBA-147E4E89FF76 Old RevisionGUID= New RevisionGUID=2BF8EB3E-7A2A-4A0E-8D9B-0F135B3ACC73
Change Managed Component Library Link : Designator=R1 Old VaultGUID= New VaultGUID=B7D15EC3-160A-466F-A46C-7801FE6295A7 Old ItemGUID= New ItemGUID=BD68BB09-BC85-4FAD-9F7C-94CB3A863051 Old RevisionGUID= New RevisionGUID=E8308F00-EF03-4C7C-8B16-82109D4DCD5B
Change Managed Component Library Link : Designator=R2 Old VaultGUID= New VaultGUID=B7D15EC3-160A-466F-A46C-7801FE6295A7 Old ItemGUID= New ItemGUID=076CF680-1F18-4AD4-981B-11246F61618B Old RevisionGUID= New RevisionGUID=3BADFF6A-EFDA-4A3B-9EE3-2BFA73328E34
Change Managed Component Library Link : Designator=R3 Old VaultGUID= New VaultGUID=B7D15EC3-160A-466F-A46C-7801FE6295A7 Old ItemGUID= New ItemGUID=0B2B09FA-C079-4047-A0A6-42D8A24FCDA3 Old RevisionGUID= New RevisionGUID=1FE128D7-4918-4A04-8475-1CF3616792F5
Change Managed Component Library Link : Designator=R4 Old VaultGUID= New VaultGUID=B7D15EC3-160A-466F-A46C-7801FE6295A7 Old ItemGUID= New ItemGUID=076CF680-1F18-4AD4-981B-11246F61618B Old RevisionGUID= New RevisionGUID=3BADFF6A-EFDA-4A3B-9EE3-2BFA73328E34
Change Managed Component Library Link : Designator=R5 Old VaultGUID= New VaultGUID=B7D15EC3-160A-466F-A46C-7801FE6295A7 Old ItemGUID= New ItemGUID=E88068F9-4AE1-42FA-93A1-9466810129CC Old RevisionGUID= New RevisionGUID=723EAAB1-94DA-4C7D-B842-00E458C0639B
Change Managed Component Library Link : Designator=R6 Old VaultGUID= New VaultGUID=B7D15EC3-160A-466F-A46C-7801FE6295A7 Old ItemGUID= New ItemGUID=6C5CAF9F-E471-41DB-9DBC-E2CBEB644261 Old RevisionGUID= New RevisionGUID=BC01F951-28AD-4226-864D-A0D06D990F76
Change Managed Component Library Link : Designator=R7 Old VaultGUID= New VaultGUID=B7D15EC3-160A-466F-A46C-7801FE6295A7 Old ItemGUID= New ItemGUID=6C5CAF9F-E471-41DB-9DBC-E2CBEB644261 Old RevisionGUID= New RevisionGUID=BC01F951-28AD-4226-864D-A0D06D990F76
Change Managed Component Library Link : Designator=R8 Old VaultGUID= New VaultGUID=B7D15EC3-160A-466F-A46C-7801FE6295A7 Old ItemGUID= New ItemGUID=6C5CAF9F-E471-41DB-9DBC-E2CBEB644261 Old RevisionGUID= New RevisionGUID=BC01F951-28AD-4226-864D-A0D06D990F76
Change Managed Component Library Link : Designator=R9 Old VaultGUID= New VaultGUID=B7D15EC3-160A-466F-A46C-7801FE6295A7 Old ItemGUID= New ItemGUID=5754EA97-FDC1-4188-933C-2628D587BC66 Old RevisionGUID= New RevisionGUID=668A14E9-C3C3-4873-885E-0E86BE7FD9A1
Change Managed Component Library Link : Designator=R10 Old VaultGUID= New VaultGUID=B7D15EC3-160A-466F-A46C-7801FE6295A7 Old ItemGUID= New ItemGUID=5754EA97-FDC1-4188-933C-2628D587BC66 Old RevisionGUID= New RevisionGUID=668A14E9-C3C3-4873-885E-0E86BE7FD9A1
Change Managed Component Library Link : Designator=R11 Old VaultGUID= New VaultGUID=B7D15EC3-160A-466F-A46C-7801FE6295A7 Old ItemGUID= New ItemGUID=6C5CAF9F-E471-41DB-9DBC-E2CBEB644261 Old RevisionGUID= New RevisionGUID=BC01F951-28AD-4226-864D-A0D06D990F76
Change Managed Component Library Link : Designator=R12 Old VaultGUID= New VaultGUID=B7D15EC3-160A-466F-A46C-7801FE6295A7 Old ItemGUID= New ItemGUID=5754EA97-FDC1-4188-933C-2628D587BC66 Old RevisionGUID= New RevisionGUID=668A14E9-C3C3-4873-885E-0E86BE7FD9A1
Change Managed Component Library Link : Designator=R13 Old VaultGUID= New VaultGUID=B7D15EC3-160A-466F-A46C-7801FE6295A7 Old ItemGUID= New ItemGUID=6C5CAF9F-E471-41DB-9DBC-E2CBEB644261 Old RevisionGUID= New RevisionGUID=BC01F951-28AD-4226-864D-A0D06D990F76
Change Managed Component Library Link : Designator=R14 Old VaultGUID= New VaultGUID=B7D15EC3-160A-466F-A46C-7801FE6295A7 Old ItemGUID= New ItemGUID=6C5CAF9F-E471-41DB-9DBC-E2CBEB644261 Old RevisionGUID= New RevisionGUID=BC01F951-28AD-4226-864D-A0D06D990F76
Change Managed Component Library Link : Designator=R15 Old VaultGUID= New VaultGUID=B7D15EC3-160A-466F-A46C-7801FE6295A7 Old ItemGUID= New ItemGUID=5754EA97-FDC1-4188-933C-2628D587BC66 Old RevisionGUID= New RevisionGUID=668A14E9-C3C3-4873-885E-0E86BE7FD9A1
Change Managed Component Library Link : Designator=R16 Old VaultGUID= New VaultGUID=B7D15EC3-160A-466F-A46C-7801FE6295A7 Old ItemGUID= New ItemGUID=58A6F3F6-9D5B-4D46-86FC-13BF0E858FEE Old RevisionGUID= New RevisionGUID=A110F1CD-8932-4ED5-A838-6D8C09F23CC9
Change Managed Component Library Link : Designator=R17 Old VaultGUID= New VaultGUID=B7D15EC3-160A-466F-A46C-7801FE6295A7 Old ItemGUID= New ItemGUID=076CF680-1F18-4AD4-981B-11246F61618B Old RevisionGUID= New RevisionGUID=3BADFF6A-EFDA-4A3B-9EE3-2BFA73328E34
Change Managed Component Library Link : Designator=R18 Old VaultGUID= New VaultGUID=B7D15EC3-160A-466F-A46C-7801FE6295A7 Old ItemGUID= New ItemGUID=076CF680-1F18-4AD4-981B-11246F61618B Old RevisionGUID= New RevisionGUID=3BADFF6A-EFDA-4A3B-9EE3-2BFA73328E34
Change Managed Component Library Link : Designator=R19 Old VaultGUID= New VaultGUID=B7D15EC3-160A-466F-A46C-7801FE6295A7 Old ItemGUID= New ItemGUID=4CCC1C2B-9841-4427-A481-5FE7DC32F2FC Old RevisionGUID= New RevisionGUID=7EF0F660-7AE6-440B-899A-4A60D968BDDC
Change Managed Component Library Link : Designator=R20 Old VaultGUID= New VaultGUID=B7D15EC3-160A-466F-A46C-7801FE6295A7 Old ItemGUID= New ItemGUID=E88068F9-4AE1-42FA-93A1-9466810129CC Old RevisionGUID= New RevisionGUID=723EAAB1-94DA-4C7D-B842-00E458C0639B
Change Managed Component Library Link : Designator=R21 Old VaultGUID= New VaultGUID=B7D15EC3-160A-466F-A46C-7801FE6295A7 Old ItemGUID= New ItemGUID=E88068F9-4AE1-42FA-93A1-9466810129CC Old RevisionGUID= New RevisionGUID=723EAAB1-94DA-4C7D-B842-00E458C0639B
Change Managed Component Library Link : Designator=R22 Old VaultGUID= New VaultGUID=B7D15EC3-160A-466F-A46C-7801FE6295A7 Old ItemGUID= New ItemGUID=076CF680-1F18-4AD4-981B-11246F61618B Old RevisionGUID= New RevisionGUID=3BADFF6A-EFDA-4A3B-9EE3-2BFA73328E34
Change Managed Component Library Link : Designator=R23 Old VaultGUID= New VaultGUID=B7D15EC3-160A-466F-A46C-7801FE6295A7 Old ItemGUID= New ItemGUID=58A6F3F6-9D5B-4D46-86FC-13BF0E858FEE Old RevisionGUID= New RevisionGUID=A110F1CD-8932-4ED5-A838-6D8C09F23CC9
Change Managed Component Library Link : Designator=R24 Old VaultGUID= New VaultGUID=B7D15EC3-160A-466F-A46C-7801FE6295A7 Old ItemGUID= New ItemGUID=4CCC1C2B-9841-4427-A481-5FE7DC32F2FC Old RevisionGUID= New RevisionGUID=7EF0F660-7AE6-440B-899A-4A60D968BDDC
Change Managed Component Library Link : Designator=R25 Old VaultGUID= New VaultGUID=B7D15EC3-160A-466F-A46C-7801FE6295A7 Old ItemGUID= New ItemGUID=4CCC1C2B-9841-4427-A481-5FE7DC32F2FC Old RevisionGUID= New RevisionGUID=7EF0F660-7AE6-440B-899A-4A60D968BDDC
Change Managed Component Library Link : Designator=R26 Old VaultGUID= New VaultGUID=B7D15EC3-160A-466F-A46C-7801FE6295A7 Old ItemGUID= New ItemGUID=05B6A644-6C86-42C1-ADA9-4D6B742D8A5D Old RevisionGUID= New RevisionGUID=5297753B-C382-48BB-97C2-2244A2616628
Change Managed Component Library Link : Designator=R27 Old VaultGUID= New VaultGUID=B7D15EC3-160A-466F-A46C-7801FE6295A7 Old ItemGUID= New ItemGUID=05B6A644-6C86-42C1-ADA9-4D6B742D8A5D Old RevisionGUID= New RevisionGUID=5297753B-C382-48BB-97C2-2244A2616628
Change Managed Component Library Link : Designator=R28 Old VaultGUID= New VaultGUID=B7D15EC3-160A-466F-A46C-7801FE6295A7 Old ItemGUID= New ItemGUID=05B6A644-6C86-42C1-ADA9-4D6B742D8A5D Old RevisionGUID= New RevisionGUID=5297753B-C382-48BB-97C2-2244A2616628
Change Managed Component Library Link : Designator=R29 Old VaultGUID= New VaultGUID=B7D15EC3-160A-466F-A46C-7801FE6295A7 Old ItemGUID= New ItemGUID=AA38CEAC-0C7F-4AC2-9AC6-335B254E396B Old RevisionGUID= New RevisionGUID=527736FC-610B-4410-AEA9-60F806E49B37
Change Managed Component Library Link : Designator=R30 Old VaultGUID= New VaultGUID=B7D15EC3-160A-466F-A46C-7801FE6295A7 Old ItemGUID= New ItemGUID=1C90B127-203A-4148-934C-450119056C25 Old RevisionGUID= New RevisionGUID=F322A9E3-7B73-4204-927E-668FF4F4387B
Change Managed Component Library Link : Designator=R31 Old VaultGUID= New VaultGUID=B7D15EC3-160A-466F-A46C-7801FE6295A7 Old ItemGUID= New ItemGUID=AA38CEAC-0C7F-4AC2-9AC6-335B254E396B Old RevisionGUID= New RevisionGUID=527736FC-610B-4410-AEA9-60F806E49B37
Change Managed Component Library Link : Designator=R32 Old VaultGUID= New VaultGUID=B7D15EC3-160A-466F-A46C-7801FE6295A7 Old ItemGUID= New ItemGUID=58A6F3F6-9D5B-4D46-86FC-13BF0E858FEE Old RevisionGUID= New RevisionGUID=A110F1CD-8932-4ED5-A838-6D8C09F23CC9
Change Managed Component Library Link : Designator=R33 Old VaultGUID= New VaultGUID=B7D15EC3-160A-466F-A46C-7801FE6295A7 Old ItemGUID= New ItemGUID=58A6F3F6-9D5B-4D46-86FC-13BF0E858FEE Old RevisionGUID= New RevisionGUID=A110F1CD-8932-4ED5-A838-6D8C09F23CC9
Change Managed Component Library Link : Designator=R34 Old VaultGUID= New VaultGUID=B7D15EC3-160A-466F-A46C-7801FE6295A7 Old ItemGUID= New ItemGUID=AA38CEAC-0C7F-4AC2-9AC6-335B254E396B Old RevisionGUID= New RevisionGUID=527736FC-610B-4410-AEA9-60F806E49B37
Change Managed Component Library Link : Designator=R35 Old VaultGUID= New VaultGUID=B7D15EC3-160A-466F-A46C-7801FE6295A7 Old ItemGUID= New ItemGUID=AA38CEAC-0C7F-4AC2-9AC6-335B254E396B Old RevisionGUID= New RevisionGUID=527736FC-610B-4410-AEA9-60F806E49B37
Change Managed Component Library Link : Designator=R36 Old VaultGUID= New VaultGUID=B7D15EC3-160A-466F-A46C-7801FE6295A7 Old ItemGUID= New ItemGUID=AA38CEAC-0C7F-4AC2-9AC6-335B254E396B Old RevisionGUID= New RevisionGUID=527736FC-610B-4410-AEA9-60F806E49B37
Change Managed Component Library Link : Designator=R37 Old VaultGUID= New VaultGUID=B7D15EC3-160A-466F-A46C-7801FE6295A7 Old ItemGUID= New ItemGUID=AA38CEAC-0C7F-4AC2-9AC6-335B254E396B Old RevisionGUID= New RevisionGUID=527736FC-610B-4410-AEA9-60F806E49B37
Change Managed Component Library Link : Designator=R38 Old VaultGUID= New VaultGUID=B7D15EC3-160A-466F-A46C-7801FE6295A7 Old ItemGUID= New ItemGUID=58A6F3F6-9D5B-4D46-86FC-13BF0E858FEE Old RevisionGUID= New RevisionGUID=A110F1CD-8932-4ED5-A838-6D8C09F23CC9
Change Managed Component Library Link : Designator=R39 Old VaultGUID= New VaultGUID=B7D15EC3-160A-466F-A46C-7801FE6295A7 Old ItemGUID= New ItemGUID=58A6F3F6-9D5B-4D46-86FC-13BF0E858FEE Old RevisionGUID= New RevisionGUID=A110F1CD-8932-4ED5-A838-6D8C09F23CC9
Change Managed Component Library Link : Designator=R40 Old VaultGUID= New VaultGUID=B7D15EC3-160A-466F-A46C-7801FE6295A7 Old ItemGUID= New ItemGUID=58A6F3F6-9D5B-4D46-86FC-13BF0E858FEE Old RevisionGUID= New RevisionGUID=A110F1CD-8932-4ED5-A838-6D8C09F23CC9
Change Managed Component Library Link : Designator=R41 Old VaultGUID= New VaultGUID=B7D15EC3-160A-466F-A46C-7801FE6295A7 Old ItemGUID= New ItemGUID=58A6F3F6-9D5B-4D46-86FC-13BF0E858FEE Old RevisionGUID= New RevisionGUID=A110F1CD-8932-4ED5-A838-6D8C09F23CC9
Change Managed Component Library Link : Designator=R42 Old VaultGUID= New VaultGUID=B7D15EC3-160A-466F-A46C-7801FE6295A7 Old ItemGUID= New ItemGUID=58A6F3F6-9D5B-4D46-86FC-13BF0E858FEE Old RevisionGUID= New RevisionGUID=A110F1CD-8932-4ED5-A838-6D8C09F23CC9
Change Managed Component Library Link : Designator=R43 Old VaultGUID= New VaultGUID=B7D15EC3-160A-466F-A46C-7801FE6295A7 Old ItemGUID= New ItemGUID=58A6F3F6-9D5B-4D46-86FC-13BF0E858FEE Old RevisionGUID= New RevisionGUID=A110F1CD-8932-4ED5-A838-6D8C09F23CC9
Change Managed Component Library Link : Designator=R44 Old VaultGUID= New VaultGUID=B7D15EC3-160A-466F-A46C-7801FE6295A7 Old ItemGUID= New ItemGUID=58A6F3F6-9D5B-4D46-86FC-13BF0E858FEE Old RevisionGUID= New RevisionGUID=A110F1CD-8932-4ED5-A838-6D8C09F23CC9
Change Managed Component Library Link : Designator=R45 Old VaultGUID= New VaultGUID=B7D15EC3-160A-466F-A46C-7801FE6295A7 Old ItemGUID= New ItemGUID=58A6F3F6-9D5B-4D46-86FC-13BF0E858FEE Old RevisionGUID= New RevisionGUID=A110F1CD-8932-4ED5-A838-6D8C09F23CC9
Change Managed Component Library Link : Designator=R46 Old VaultGUID= New VaultGUID=B7D15EC3-160A-466F-A46C-7801FE6295A7 Old ItemGUID= New ItemGUID=29873E1D-FF3F-41C3-BEBF-7733D86057B0 Old RevisionGUID= New RevisionGUID=94DD0EE5-CBA9-46B3-9CA2-4BE66BC2E069
Change Managed Component Library Link : Designator=R47 Old VaultGUID= New VaultGUID=B7D15EC3-160A-466F-A46C-7801FE6295A7 Old ItemGUID= New ItemGUID=29873E1D-FF3F-41C3-BEBF-7733D86057B0 Old RevisionGUID= New RevisionGUID=94DD0EE5-CBA9-46B3-9CA2-4BE66BC2E069
Change Managed Component Library Link : Designator=R48 Old VaultGUID= New VaultGUID=B7D15EC3-160A-466F-A46C-7801FE6295A7 Old ItemGUID= New ItemGUID=E88068F9-4AE1-42FA-93A1-9466810129CC Old RevisionGUID= New RevisionGUID=723EAAB1-94DA-4C7D-B842-00E458C0639B
Change Managed Component Library Link : Designator=R49 Old VaultGUID= New VaultGUID=B7D15EC3-160A-466F-A46C-7801FE6295A7 Old ItemGUID= New ItemGUID=E88068F9-4AE1-42FA-93A1-9466810129CC Old RevisionGUID= New RevisionGUID=723EAAB1-94DA-4C7D-B842-00E458C0639B
Change Managed Component Library Link : Designator=R50 Old VaultGUID= New VaultGUID=B7D15EC3-160A-466F-A46C-7801FE6295A7 Old ItemGUID= New ItemGUID=05B6A644-6C86-42C1-ADA9-4D6B742D8A5D Old RevisionGUID= New RevisionGUID=5297753B-C382-48BB-97C2-2244A2616628
Change Managed Component Library Link : Designator=R51 Old VaultGUID= New VaultGUID=B7D15EC3-160A-466F-A46C-7801FE6295A7 Old ItemGUID= New ItemGUID=4CCC1C2B-9841-4427-A481-5FE7DC32F2FC Old RevisionGUID= New RevisionGUID=7EF0F660-7AE6-440B-899A-4A60D968BDDC
Change Managed Component Library Link : Designator=R52 Old VaultGUID= New VaultGUID=B7D15EC3-160A-466F-A46C-7801FE6295A7 Old ItemGUID= New ItemGUID=05B6A644-6C86-42C1-ADA9-4D6B742D8A5D Old RevisionGUID= New RevisionGUID=5297753B-C382-48BB-97C2-2244A2616628
Change Managed Component Library Link : Designator=R53 Old VaultGUID= New VaultGUID=B7D15EC3-160A-466F-A46C-7801FE6295A7 Old ItemGUID= New ItemGUID=4CCC1C2B-9841-4427-A481-5FE7DC32F2FC Old RevisionGUID= New RevisionGUID=7EF0F660-7AE6-440B-899A-4A60D968BDDC
Change Managed Component Library Link : Designator=R54 Old VaultGUID= New VaultGUID=B7D15EC3-160A-466F-A46C-7801FE6295A7 Old ItemGUID= New ItemGUID=4CCC1C2B-9841-4427-A481-5FE7DC32F2FC Old RevisionGUID= New RevisionGUID=7EF0F660-7AE6-440B-899A-4A60D968BDDC
Change Managed Component Library Link : Designator=R56 Old VaultGUID= New VaultGUID=B7D15EC3-160A-466F-A46C-7801FE6295A7 Old ItemGUID= New ItemGUID=4CCC1C2B-9841-4427-A481-5FE7DC32F2FC Old RevisionGUID= New RevisionGUID=7EF0F660-7AE6-440B-899A-4A60D968BDDC
Change Managed Component Library Link : Designator=R57 Old VaultGUID= New VaultGUID=B7D15EC3-160A-466F-A46C-7801FE6295A7 Old ItemGUID= New ItemGUID=AA38CEAC-0C7F-4AC2-9AC6-335B254E396B Old RevisionGUID= New RevisionGUID=527736FC-610B-4410-AEA9-60F806E49B37
Change Managed Component Library Link : Designator=R58 Old VaultGUID= New VaultGUID=B7D15EC3-160A-466F-A46C-7801FE6295A7 Old ItemGUID= New ItemGUID=5754EA97-FDC1-4188-933C-2628D587BC66 Old RevisionGUID= New RevisionGUID=668A14E9-C3C3-4873-885E-0E86BE7FD9A1
Change Managed Component Library Link : Designator=R59 Old VaultGUID= New VaultGUID=B7D15EC3-160A-466F-A46C-7801FE6295A7 Old ItemGUID= New ItemGUID=5754EA97-FDC1-4188-933C-2628D587BC66 Old RevisionGUID= New RevisionGUID=668A14E9-C3C3-4873-885E-0E86BE7FD9A1
Change Managed Component Library Link : Designator=R60 Old VaultGUID= New VaultGUID=B7D15EC3-160A-466F-A46C-7801FE6295A7 Old ItemGUID= New ItemGUID=5754EA97-FDC1-4188-933C-2628D587BC66 Old RevisionGUID= New RevisionGUID=668A14E9-C3C3-4873-885E-0E86BE7FD9A1
Change Managed Component Library Link : Designator=R61 Old VaultGUID= New VaultGUID=B7D15EC3-160A-466F-A46C-7801FE6295A7 Old ItemGUID= New ItemGUID=5754EA97-FDC1-4188-933C-2628D587BC66 Old RevisionGUID= New RevisionGUID=668A14E9-C3C3-4873-885E-0E86BE7FD9A1
Change Managed Component Library Link : Designator=R62 Old VaultGUID= New VaultGUID=B7D15EC3-160A-466F-A46C-7801FE6295A7 Old ItemGUID= New ItemGUID=AA38CEAC-0C7F-4AC2-9AC6-335B254E396B Old RevisionGUID= New RevisionGUID=527736FC-610B-4410-AEA9-60F806E49B37
Change Managed Component Library Link : Designator=R63 Old VaultGUID= New VaultGUID=B7D15EC3-160A-466F-A46C-7801FE6295A7 Old ItemGUID= New ItemGUID=5754EA97-FDC1-4188-933C-2628D587BC66 Old RevisionGUID= New RevisionGUID=668A14E9-C3C3-4873-885E-0E86BE7FD9A1
Change Managed Component Library Link : Designator=R64 Old VaultGUID= New VaultGUID=B7D15EC3-160A-466F-A46C-7801FE6295A7 Old ItemGUID= New ItemGUID=5754EA97-FDC1-4188-933C-2628D587BC66 Old RevisionGUID= New RevisionGUID=668A14E9-C3C3-4873-885E-0E86BE7FD9A1
Change Managed Component Library Link : Designator=R65 Old VaultGUID= New VaultGUID=B7D15EC3-160A-466F-A46C-7801FE6295A7 Old ItemGUID= New ItemGUID=5754EA97-FDC1-4188-933C-2628D587BC66 Old RevisionGUID= New RevisionGUID=668A14E9-C3C3-4873-885E-0E86BE7FD9A1
Change Managed Component Library Link : Designator=R66 Old VaultGUID= New VaultGUID=B7D15EC3-160A-466F-A46C-7801FE6295A7 Old ItemGUID= New ItemGUID=5754EA97-FDC1-4188-933C-2628D587BC66 Old RevisionGUID= New RevisionGUID=668A14E9-C3C3-4873-885E-0E86BE7FD9A1
Change Managed Component Library Link : Designator=R67 Old VaultGUID= New VaultGUID=B7D15EC3-160A-466F-A46C-7801FE6295A7 Old ItemGUID= New ItemGUID=5754EA97-FDC1-4188-933C-2628D587BC66 Old RevisionGUID= New RevisionGUID=668A14E9-C3C3-4873-885E-0E86BE7FD9A1
Change Managed Component Library Link : Designator=R68 Old VaultGUID= New VaultGUID=B7D15EC3-160A-466F-A46C-7801FE6295A7 Old ItemGUID= New ItemGUID=5754EA97-FDC1-4188-933C-2628D587BC66 Old RevisionGUID= New RevisionGUID=668A14E9-C3C3-4873-885E-0E86BE7FD9A1
Change Managed Component Library Link : Designator=R69 Old VaultGUID= New VaultGUID=B7D15EC3-160A-466F-A46C-7801FE6295A7 Old ItemGUID= New ItemGUID=AA38CEAC-0C7F-4AC2-9AC6-335B254E396B Old RevisionGUID= New RevisionGUID=527736FC-610B-4410-AEA9-60F806E49B37
Change Managed Component Library Link : Designator=R70 Old VaultGUID= New VaultGUID=B7D15EC3-160A-466F-A46C-7801FE6295A7 Old ItemGUID= New ItemGUID=AA38CEAC-0C7F-4AC2-9AC6-335B254E396B Old RevisionGUID= New RevisionGUID=527736FC-610B-4410-AEA9-60F806E49B37
Change Managed Component Library Link : Designator=R71 Old VaultGUID= New VaultGUID=B7D15EC3-160A-466F-A46C-7801FE6295A7 Old ItemGUID= New ItemGUID=AA38CEAC-0C7F-4AC2-9AC6-335B254E396B Old RevisionGUID= New RevisionGUID=527736FC-610B-4410-AEA9-60F806E49B37
Change Managed Component Library Link : Designator=R72 Old VaultGUID= New VaultGUID=B7D15EC3-160A-466F-A46C-7801FE6295A7 Old ItemGUID= New ItemGUID=5754EA97-FDC1-4188-933C-2628D587BC66 Old RevisionGUID= New RevisionGUID=668A14E9-C3C3-4873-885E-0E86BE7FD9A1
Change Managed Component Library Link : Designator=R73 Old VaultGUID= New VaultGUID=B7D15EC3-160A-466F-A46C-7801FE6295A7 Old ItemGUID= New ItemGUID=5754EA97-FDC1-4188-933C-2628D587BC66 Old RevisionGUID= New RevisionGUID=668A14E9-C3C3-4873-885E-0E86BE7FD9A1
Change Managed Component Library Link : Designator=R74 Old VaultGUID= New VaultGUID=B7D15EC3-160A-466F-A46C-7801FE6295A7 Old ItemGUID= New ItemGUID=AA38CEAC-0C7F-4AC2-9AC6-335B254E396B Old RevisionGUID= New RevisionGUID=527736FC-610B-4410-AEA9-60F806E49B37
Change Managed Component Library Link : Designator=R75 Old VaultGUID= New VaultGUID=B7D15EC3-160A-466F-A46C-7801FE6295A7 Old ItemGUID= New ItemGUID=B490798F-5323-478D-B2C9-93D4CEF29155 Old RevisionGUID= New RevisionGUID=B9CF315C-D7AA-4EB2-9FA5-FE255B7B174F
Change Managed Component Library Link : Designator=R76 Old VaultGUID= New VaultGUID=B7D15EC3-160A-466F-A46C-7801FE6295A7 Old ItemGUID= New ItemGUID=AA38CEAC-0C7F-4AC2-9AC6-335B254E396B Old RevisionGUID= New RevisionGUID=527736FC-610B-4410-AEA9-60F806E49B37
Change Managed Component Library Link : Designator=R77 Old VaultGUID= New VaultGUID=B7D15EC3-160A-466F-A46C-7801FE6295A7 Old ItemGUID= New ItemGUID=AA38CEAC-0C7F-4AC2-9AC6-335B254E396B Old RevisionGUID= New RevisionGUID=527736FC-610B-4410-AEA9-60F806E49B37
Change Managed Component Library Link : Designator=R78 Old VaultGUID= New VaultGUID=B7D15EC3-160A-466F-A46C-7801FE6295A7 Old ItemGUID= New ItemGUID=B490798F-5323-478D-B2C9-93D4CEF29155 Old RevisionGUID= New RevisionGUID=B9CF315C-D7AA-4EB2-9FA5-FE255B7B174F
Change Managed Component Library Link : Designator=R79 Old VaultGUID= New VaultGUID=B7D15EC3-160A-466F-A46C-7801FE6295A7 Old ItemGUID= New ItemGUID=AA38CEAC-0C7F-4AC2-9AC6-335B254E396B Old RevisionGUID= New RevisionGUID=527736FC-610B-4410-AEA9-60F806E49B37
Change Managed Component Library Link : Designator=R80 Old VaultGUID= New VaultGUID=B7D15EC3-160A-466F-A46C-7801FE6295A7 Old ItemGUID= New ItemGUID=E88068F9-4AE1-42FA-93A1-9466810129CC Old RevisionGUID= New RevisionGUID=723EAAB1-94DA-4C7D-B842-00E458C0639B
Change Managed Component Library Link : Designator=R81 Old VaultGUID= New VaultGUID=B7D15EC3-160A-466F-A46C-7801FE6295A7 Old ItemGUID= New ItemGUID=AA38CEAC-0C7F-4AC2-9AC6-335B254E396B Old RevisionGUID= New RevisionGUID=527736FC-610B-4410-AEA9-60F806E49B37
Change Managed Component Library Link : Designator=R82 Old VaultGUID= New VaultGUID=B7D15EC3-160A-466F-A46C-7801FE6295A7 Old ItemGUID= New ItemGUID=E88068F9-4AE1-42FA-93A1-9466810129CC Old RevisionGUID= New RevisionGUID=723EAAB1-94DA-4C7D-B842-00E458C0639B
Change Managed Component Library Link : Designator=R83 Old VaultGUID= New VaultGUID=B7D15EC3-160A-466F-A46C-7801FE6295A7 Old ItemGUID= New ItemGUID=E88068F9-4AE1-42FA-93A1-9466810129CC Old RevisionGUID= New RevisionGUID=723EAAB1-94DA-4C7D-B842-00E458C0639B
Change Managed Component Library Link : Designator=R84 Old VaultGUID= New VaultGUID=B7D15EC3-160A-466F-A46C-7801FE6295A7 Old ItemGUID= New ItemGUID=AA38CEAC-0C7F-4AC2-9AC6-335B254E396B Old RevisionGUID= New RevisionGUID=527736FC-610B-4410-AEA9-60F806E49B37
Change Managed Component Library Link : Designator=R85 Old VaultGUID= New VaultGUID=B7D15EC3-160A-466F-A46C-7801FE6295A7 Old ItemGUID= New ItemGUID=AA38CEAC-0C7F-4AC2-9AC6-335B254E396B Old RevisionGUID= New RevisionGUID=527736FC-610B-4410-AEA9-60F806E49B37
Change Managed Component Library Link : Designator=R86 Old VaultGUID= New VaultGUID=B7D15EC3-160A-466F-A46C-7801FE6295A7 Old ItemGUID= New ItemGUID=E88068F9-4AE1-42FA-93A1-9466810129CC Old RevisionGUID= New RevisionGUID=723EAAB1-94DA-4C7D-B842-00E458C0639B
Change Managed Component Library Link : Designator=R87 Old VaultGUID= New VaultGUID=B7D15EC3-160A-466F-A46C-7801FE6295A7 Old ItemGUID= New ItemGUID=75D433AC-4355-449E-855E-2AB3AE5B5555 Old RevisionGUID= New RevisionGUID=BD12B5D4-C98A-4C0A-B629-C068DC6039D5
Change Managed Component Library Link : Designator=R88 Old VaultGUID= New VaultGUID=B7D15EC3-160A-466F-A46C-7801FE6295A7 Old ItemGUID= New ItemGUID=5971D112-CF29-4407-AE74-4F9F82927004 Old RevisionGUID= New RevisionGUID=61ED79B3-870C-4C98-A87B-483672E2F2A6
Change Managed Component Library Link : Designator=R89 Old VaultGUID= New VaultGUID=B7D15EC3-160A-466F-A46C-7801FE6295A7 Old ItemGUID= New ItemGUID=5971D112-CF29-4407-AE74-4F9F82927004 Old RevisionGUID= New RevisionGUID=61ED79B3-870C-4C98-A87B-483672E2F2A6
Change Managed Component Library Link : Designator=R90 Old VaultGUID= New VaultGUID=B7D15EC3-160A-466F-A46C-7801FE6295A7 Old ItemGUID= New ItemGUID=57942E3E-D7E7-4793-980B-3FC5FBCD92FA Old RevisionGUID= New RevisionGUID=CCAEC3AE-80C3-485C-868E-C76657A7A659
Change Managed Component Library Link : Designator=R91 Old VaultGUID= New VaultGUID=B7D15EC3-160A-466F-A46C-7801FE6295A7 Old ItemGUID= New ItemGUID=5971D112-CF29-4407-AE74-4F9F82927004 Old RevisionGUID= New RevisionGUID=61ED79B3-870C-4C98-A87B-483672E2F2A6
Change Managed Component Library Link : Designator=R92 Old VaultGUID= New VaultGUID=B7D15EC3-160A-466F-A46C-7801FE6295A7 Old ItemGUID= New ItemGUID=4CCC1C2B-9841-4427-A481-5FE7DC32F2FC Old RevisionGUID= New RevisionGUID=7EF0F660-7AE6-440B-899A-4A60D968BDDC
Change Managed Component Library Link : Designator=R93 Old VaultGUID= New VaultGUID=B7D15EC3-160A-466F-A46C-7801FE6295A7 Old ItemGUID= New ItemGUID=4CCC1C2B-9841-4427-A481-5FE7DC32F2FC Old RevisionGUID= New RevisionGUID=7EF0F660-7AE6-440B-899A-4A60D968BDDC
Change Managed Component Library Link : Designator=R94 Old VaultGUID= New VaultGUID=B7D15EC3-160A-466F-A46C-7801FE6295A7 Old ItemGUID= New ItemGUID=4CCC1C2B-9841-4427-A481-5FE7DC32F2FC Old RevisionGUID= New RevisionGUID=7EF0F660-7AE6-440B-899A-4A60D968BDDC
Change Managed Component Library Link : Designator=R95 Old VaultGUID= New VaultGUID=B7D15EC3-160A-466F-A46C-7801FE6295A7 Old ItemGUID= New ItemGUID=4CCC1C2B-9841-4427-A481-5FE7DC32F2FC Old RevisionGUID= New RevisionGUID=7EF0F660-7AE6-440B-899A-4A60D968BDDC
Change Managed Component Library Link : Designator=R96 Old VaultGUID= New VaultGUID=B7D15EC3-160A-466F-A46C-7801FE6295A7 Old ItemGUID= New ItemGUID=4CCC1C2B-9841-4427-A481-5FE7DC32F2FC Old RevisionGUID= New RevisionGUID=7EF0F660-7AE6-440B-899A-4A60D968BDDC
Change Managed Component Library Link : Designator=R97 Old VaultGUID= New VaultGUID=B7D15EC3-160A-466F-A46C-7801FE6295A7 Old ItemGUID= New ItemGUID=4CCC1C2B-9841-4427-A481-5FE7DC32F2FC Old RevisionGUID= New RevisionGUID=7EF0F660-7AE6-440B-899A-4A60D968BDDC
Change Managed Component Library Link : Designator=R98 Old VaultGUID= New VaultGUID=B7D15EC3-160A-466F-A46C-7801FE6295A7 Old ItemGUID= New ItemGUID=4CCC1C2B-9841-4427-A481-5FE7DC32F2FC Old RevisionGUID= New RevisionGUID=7EF0F660-7AE6-440B-899A-4A60D968BDDC
Change Managed Component Library Link : Designator=R99 Old VaultGUID= New VaultGUID=B7D15EC3-160A-466F-A46C-7801FE6295A7 Old ItemGUID= New ItemGUID=4CCC1C2B-9841-4427-A481-5FE7DC32F2FC Old RevisionGUID= New RevisionGUID=7EF0F660-7AE6-440B-899A-4A60D968BDDC
Change Managed Component Library Link : Designator=R100 Old VaultGUID= New VaultGUID=B7D15EC3-160A-466F-A46C-7801FE6295A7 Old ItemGUID= New ItemGUID=4CCC1C2B-9841-4427-A481-5FE7DC32F2FC Old RevisionGUID= New RevisionGUID=7EF0F660-7AE6-440B-899A-4A60D968BDDC
Change Managed Component Library Link : Designator=R101 Old VaultGUID= New VaultGUID=B7D15EC3-160A-466F-A46C-7801FE6295A7 Old ItemGUID= New ItemGUID=4CCC1C2B-9841-4427-A481-5FE7DC32F2FC Old RevisionGUID= New RevisionGUID=7EF0F660-7AE6-440B-899A-4A60D968BDDC
Change Managed Component Library Link : Designator=R102 Old VaultGUID= New VaultGUID=B7D15EC3-160A-466F-A46C-7801FE6295A7 Old ItemGUID= New ItemGUID=4CCC1C2B-9841-4427-A481-5FE7DC32F2FC Old RevisionGUID= New RevisionGUID=7EF0F660-7AE6-440B-899A-4A60D968BDDC
Change Managed Component Library Link : Designator=R103 Old VaultGUID= New VaultGUID=B7D15EC3-160A-466F-A46C-7801FE6295A7 Old ItemGUID= New ItemGUID=4CCC1C2B-9841-4427-A481-5FE7DC32F2FC Old RevisionGUID= New RevisionGUID=7EF0F660-7AE6-440B-899A-4A60D968BDDC
Change Managed Component Library Link : Designator=R107 Old VaultGUID= New VaultGUID=B7D15EC3-160A-466F-A46C-7801FE6295A7 Old ItemGUID= New ItemGUID=4CCC1C2B-9841-4427-A481-5FE7DC32F2FC Old RevisionGUID= New RevisionGUID=7EF0F660-7AE6-440B-899A-4A60D968BDDC
Change Managed Component Library Link : Designator=R108 Old VaultGUID= New VaultGUID=B7D15EC3-160A-466F-A46C-7801FE6295A7 Old ItemGUID= New ItemGUID=AA38CEAC-0C7F-4AC2-9AC6-335B254E396B Old RevisionGUID= New RevisionGUID=527736FC-610B-4410-AEA9-60F806E49B37
Change Managed Component Library Link : Designator=R109 Old VaultGUID= New VaultGUID=B7D15EC3-160A-466F-A46C-7801FE6295A7 Old ItemGUID= New ItemGUID=5754EA97-FDC1-4188-933C-2628D587BC66 Old RevisionGUID= New RevisionGUID=668A14E9-C3C3-4873-885E-0E86BE7FD9A1
Change Managed Component Library Link : Designator=R110 Old VaultGUID= New VaultGUID=B7D15EC3-160A-466F-A46C-7801FE6295A7 Old ItemGUID= New ItemGUID=D61EED41-EBF9-4EC8-9724-473844E2AB4D Old RevisionGUID= New RevisionGUID=ACBC6BB7-0CBF-43D7-98C7-ECFFF8067187
Change Managed Component Library Link : Designator=R111 Old VaultGUID= New VaultGUID=B7D15EC3-160A-466F-A46C-7801FE6295A7 Old ItemGUID= New ItemGUID=BD68BB09-BC85-4FAD-9F7C-94CB3A863051 Old RevisionGUID= New RevisionGUID=E8308F00-EF03-4C7C-8B16-82109D4DCD5B
Change Managed Component Library Link : Designator=R112 Old VaultGUID= New VaultGUID=B7D15EC3-160A-466F-A46C-7801FE6295A7 Old ItemGUID= New ItemGUID=BD68BB09-BC85-4FAD-9F7C-94CB3A863051 Old RevisionGUID= New RevisionGUID=E8308F00-EF03-4C7C-8B16-82109D4DCD5B
Change Managed Component Library Link : Designator=R113 Old VaultGUID= New VaultGUID=B7D15EC3-160A-466F-A46C-7801FE6295A7 Old ItemGUID= New ItemGUID=BD68BB09-BC85-4FAD-9F7C-94CB3A863051 Old RevisionGUID= New RevisionGUID=E8308F00-EF03-4C7C-8B16-82109D4DCD5B
Change Managed Component Library Link : Designator=R114 Old VaultGUID= New VaultGUID=B7D15EC3-160A-466F-A46C-7801FE6295A7 Old ItemGUID= New ItemGUID=BD68BB09-BC85-4FAD-9F7C-94CB3A863051 Old RevisionGUID= New RevisionGUID=E8308F00-EF03-4C7C-8B16-82109D4DCD5B
Change Managed Component Library Link : Designator=R115 Old VaultGUID= New VaultGUID=B7D15EC3-160A-466F-A46C-7801FE6295A7 Old ItemGUID= New ItemGUID=BD68BB09-BC85-4FAD-9F7C-94CB3A863051 Old RevisionGUID= New RevisionGUID=E8308F00-EF03-4C7C-8B16-82109D4DCD5B
Change Managed Component Library Link : Designator=R116 Old VaultGUID= New VaultGUID=B7D15EC3-160A-466F-A46C-7801FE6295A7 Old ItemGUID= New ItemGUID=BD68BB09-BC85-4FAD-9F7C-94CB3A863051 Old RevisionGUID= New RevisionGUID=E8308F00-EF03-4C7C-8B16-82109D4DCD5B
Change Managed Component Library Link : Designator=R117 Old VaultGUID= New VaultGUID=B7D15EC3-160A-466F-A46C-7801FE6295A7 Old ItemGUID= New ItemGUID=BD68BB09-BC85-4FAD-9F7C-94CB3A863051 Old RevisionGUID= New RevisionGUID=E8308F00-EF03-4C7C-8B16-82109D4DCD5B
Change Managed Component Library Link : Designator=R118 Old VaultGUID= New VaultGUID=B7D15EC3-160A-466F-A46C-7801FE6295A7 Old ItemGUID= New ItemGUID=BD68BB09-BC85-4FAD-9F7C-94CB3A863051 Old RevisionGUID= New RevisionGUID=E8308F00-EF03-4C7C-8B16-82109D4DCD5B
Change Managed Component Library Link : Designator=R119 Old VaultGUID= New VaultGUID=B7D15EC3-160A-466F-A46C-7801FE6295A7 Old ItemGUID= New ItemGUID=BD68BB09-BC85-4FAD-9F7C-94CB3A863051 Old RevisionGUID= New RevisionGUID=E8308F00-EF03-4C7C-8B16-82109D4DCD5B
Change Managed Component Library Link : Designator=R120 Old VaultGUID= New VaultGUID=B7D15EC3-160A-466F-A46C-7801FE6295A7 Old ItemGUID= New ItemGUID=BD68BB09-BC85-4FAD-9F7C-94CB3A863051 Old RevisionGUID= New RevisionGUID=E8308F00-EF03-4C7C-8B16-82109D4DCD5B
Change Managed Component Library Link : Designator=R121 Old VaultGUID= New VaultGUID=B7D15EC3-160A-466F-A46C-7801FE6295A7 Old ItemGUID= New ItemGUID=BD68BB09-BC85-4FAD-9F7C-94CB3A863051 Old RevisionGUID= New RevisionGUID=E8308F00-EF03-4C7C-8B16-82109D4DCD5B
Change Managed Component Library Link : Designator=R122 Old VaultGUID= New VaultGUID=B7D15EC3-160A-466F-A46C-7801FE6295A7 Old ItemGUID= New ItemGUID=BD68BB09-BC85-4FAD-9F7C-94CB3A863051 Old RevisionGUID= New RevisionGUID=E8308F00-EF03-4C7C-8B16-82109D4DCD5B
Change Managed Component Library Link : Designator=R123 Old VaultGUID= New VaultGUID=B7D15EC3-160A-466F-A46C-7801FE6295A7 Old ItemGUID= New ItemGUID=BD68BB09-BC85-4FAD-9F7C-94CB3A863051 Old RevisionGUID= New RevisionGUID=E8308F00-EF03-4C7C-8B16-82109D4DCD5B
Change Managed Component Library Link : Designator=R124 Old VaultGUID= New VaultGUID=B7D15EC3-160A-466F-A46C-7801FE6295A7 Old ItemGUID= New ItemGUID=BD68BB09-BC85-4FAD-9F7C-94CB3A863051 Old RevisionGUID= New RevisionGUID=E8308F00-EF03-4C7C-8B16-82109D4DCD5B
Change Managed Component Library Link : Designator=R125 Old VaultGUID= New VaultGUID=B7D15EC3-160A-466F-A46C-7801FE6295A7 Old ItemGUID= New ItemGUID=BD68BB09-BC85-4FAD-9F7C-94CB3A863051 Old RevisionGUID= New RevisionGUID=E8308F00-EF03-4C7C-8B16-82109D4DCD5B
Change Managed Component Library Link : Designator=R126 Old VaultGUID= New VaultGUID=B7D15EC3-160A-466F-A46C-7801FE6295A7 Old ItemGUID= New ItemGUID=BD68BB09-BC85-4FAD-9F7C-94CB3A863051 Old RevisionGUID= New RevisionGUID=E8308F00-EF03-4C7C-8B16-82109D4DCD5B
Change Managed Component Library Link : Designator=R127 Old VaultGUID= New VaultGUID=B7D15EC3-160A-466F-A46C-7801FE6295A7 Old ItemGUID= New ItemGUID=BD68BB09-BC85-4FAD-9F7C-94CB3A863051 Old RevisionGUID= New RevisionGUID=E8308F00-EF03-4C7C-8B16-82109D4DCD5B
Change Managed Component Library Link : Designator=R128 Old VaultGUID= New VaultGUID=B7D15EC3-160A-466F-A46C-7801FE6295A7 Old ItemGUID= New ItemGUID=BD68BB09-BC85-4FAD-9F7C-94CB3A863051 Old RevisionGUID= New RevisionGUID=E8308F00-EF03-4C7C-8B16-82109D4DCD5B
Change Managed Component Library Link : Designator=R129 Old VaultGUID= New VaultGUID=B7D15EC3-160A-466F-A46C-7801FE6295A7 Old ItemGUID= New ItemGUID=5754EA97-FDC1-4188-933C-2628D587BC66 Old RevisionGUID= New RevisionGUID=668A14E9-C3C3-4873-885E-0E86BE7FD9A1
Change Managed Component Library Link : Designator=R130 Old VaultGUID= New VaultGUID=B7D15EC3-160A-466F-A46C-7801FE6295A7 Old ItemGUID= New ItemGUID=E88068F9-4AE1-42FA-93A1-9466810129CC Old RevisionGUID= New RevisionGUID=723EAAB1-94DA-4C7D-B842-00E458C0639B
Change Managed Component Library Link : Designator=R131 Old VaultGUID= New VaultGUID=B7D15EC3-160A-466F-A46C-7801FE6295A7 Old ItemGUID= New ItemGUID=B490798F-5323-478D-B2C9-93D4CEF29155 Old RevisionGUID= New RevisionGUID=B9CF315C-D7AA-4EB2-9FA5-FE255B7B174F
Change Managed Component Library Link : Designator=R132 Old VaultGUID= New VaultGUID=B7D15EC3-160A-466F-A46C-7801FE6295A7 Old ItemGUID= New ItemGUID=E88068F9-4AE1-42FA-93A1-9466810129CC Old RevisionGUID= New RevisionGUID=723EAAB1-94DA-4C7D-B842-00E458C0639B
Change Managed Component Library Link : Designator=R133 Old VaultGUID= New VaultGUID=B7D15EC3-160A-466F-A46C-7801FE6295A7 Old ItemGUID= New ItemGUID=5754EA97-FDC1-4188-933C-2628D587BC66 Old RevisionGUID= New RevisionGUID=668A14E9-C3C3-4873-885E-0E86BE7FD9A1
Change Managed Component Library Link : Designator=R134 Old VaultGUID= New VaultGUID=B7D15EC3-160A-466F-A46C-7801FE6295A7 Old ItemGUID= New ItemGUID=5754EA97-FDC1-4188-933C-2628D587BC66 Old RevisionGUID= New RevisionGUID=668A14E9-C3C3-4873-885E-0E86BE7FD9A1
Change Managed Component Library Link : Designator=R135 Old VaultGUID= New VaultGUID=B7D15EC3-160A-466F-A46C-7801FE6295A7 Old ItemGUID= New ItemGUID=5754EA97-FDC1-4188-933C-2628D587BC66 Old RevisionGUID= New RevisionGUID=668A14E9-C3C3-4873-885E-0E86BE7FD9A1
Change Managed Component Library Link : Designator=R136 Old VaultGUID= New VaultGUID=B7D15EC3-160A-466F-A46C-7801FE6295A7 Old ItemGUID= New ItemGUID=E88068F9-4AE1-42FA-93A1-9466810129CC Old RevisionGUID= New RevisionGUID=723EAAB1-94DA-4C7D-B842-00E458C0639B
Change Managed Component Library Link : Designator=SD1 Old VaultGUID= New VaultGUID=B7D15EC3-160A-466F-A46C-7801FE6295A7 Old ItemGUID= New ItemGUID=728B1A04-725B-4F86-8BBE-C3F0532B6AA7 Old RevisionGUID= New RevisionGUID=AAD52580-F324-4BEE-966F-2A13D911933A
Change Managed Component Library Link : Designator=SW1 Old VaultGUID= New VaultGUID=B7D15EC3-160A-466F-A46C-7801FE6295A7 Old ItemGUID= New ItemGUID=70B90249-0765-475F-8FA2-AF55E4B85F48 Old RevisionGUID= New RevisionGUID=2A00F9CE-C447-4A95-9C8E-8325310B3C97
Change Managed Component Library Link : Designator=SW2 Old VaultGUID= New VaultGUID=B7D15EC3-160A-466F-A46C-7801FE6295A7 Old ItemGUID= New ItemGUID=136FFCED-7507-45AB-BAE5-3D2AD9ACC812 Old RevisionGUID= New RevisionGUID=AF39C3E6-CE1A-4094-AB76-87921FB04CF2
Change Managed Component Library Link : Designator=SW3 Old VaultGUID= New VaultGUID=B7D15EC3-160A-466F-A46C-7801FE6295A7 Old ItemGUID= New ItemGUID=5F092086-B30D-495C-ACA6-C10C797467CC Old RevisionGUID= New RevisionGUID=93621F53-A51F-4E02-BFCD-329E8E8A8B45
Change Managed Component Library Link : Designator=SW4 Old VaultGUID= New VaultGUID=B7D15EC3-160A-466F-A46C-7801FE6295A7 Old ItemGUID= New ItemGUID=5F092086-B30D-495C-ACA6-C10C797467CC Old RevisionGUID= New RevisionGUID=93621F53-A51F-4E02-BFCD-329E8E8A8B45
Change Managed Component Library Link : Designator=U1 Old VaultGUID= New VaultGUID=B7D15EC3-160A-466F-A46C-7801FE6295A7 Old ItemGUID= New ItemGUID=B53D1A37-7AE9-4EA8-BADC-FF8428FFF33F Old RevisionGUID= New RevisionGUID=A459D6EB-D210-4C14-87C7-72EC4F31F052
Change Managed Component Library Link : Designator=U3 Old VaultGUID= New VaultGUID=B7D15EC3-160A-466F-A46C-7801FE6295A7 Old ItemGUID= New ItemGUID=BE695206-2ABC-4707-8148-9600A3ECA5ED Old RevisionGUID= New RevisionGUID=733BA7C9-6C72-4D64-87F1-EBEBC8D3048E
Change Managed Component Library Link : Designator=U4 Old VaultGUID= New VaultGUID=B7D15EC3-160A-466F-A46C-7801FE6295A7 Old ItemGUID= New ItemGUID=BE695206-2ABC-4707-8148-9600A3ECA5ED Old RevisionGUID= New RevisionGUID=733BA7C9-6C72-4D64-87F1-EBEBC8D3048E
Change Managed Component Library Link : Designator=U5 Old VaultGUID= New VaultGUID=B7D15EC3-160A-466F-A46C-7801FE6295A7 Old ItemGUID= New ItemGUID=BE695206-2ABC-4707-8148-9600A3ECA5ED Old RevisionGUID= New RevisionGUID=733BA7C9-6C72-4D64-87F1-EBEBC8D3048E
Change Managed Component Library Link : Designator=U6 Old VaultGUID= New VaultGUID=B7D15EC3-160A-466F-A46C-7801FE6295A7 Old ItemGUID= New ItemGUID=BE695206-2ABC-4707-8148-9600A3ECA5ED Old RevisionGUID= New RevisionGUID=733BA7C9-6C72-4D64-87F1-EBEBC8D3048E
Change Managed Component Library Link : Designator=U7 Old VaultGUID= New VaultGUID=B7D15EC3-160A-466F-A46C-7801FE6295A7 Old ItemGUID= New ItemGUID=1AD64A1E-6FD6-489B-9DA0-C37D94552764 Old RevisionGUID= New RevisionGUID=25D30291-4C86-4D77-A38F-5B594E8647F5
Change Managed Component Library Link : Designator=U9 Old VaultGUID= New VaultGUID=B7D15EC3-160A-466F-A46C-7801FE6295A7 Old ItemGUID= New ItemGUID=47E84AC2-40E7-4C87-80F8-5831A6FCB7A6 Old RevisionGUID= New RevisionGUID=A7574791-B15E-4FD6-B0A3-68995BCFC072
Change Managed Component Library Link : Designator=U10 Old VaultGUID= New VaultGUID=B7D15EC3-160A-466F-A46C-7801FE6295A7 Old ItemGUID= New ItemGUID=E631034D-7CC7-4C46-8AEB-E8BE2B92FE26 Old RevisionGUID= New RevisionGUID=3AD39AC4-76D9-47E4-A6CE-53C3AA8EE72B
Change Managed Component Library Link : Designator=U11 Old VaultGUID= New VaultGUID=B7D15EC3-160A-466F-A46C-7801FE6295A7 Old ItemGUID= New ItemGUID=E631034D-7CC7-4C46-8AEB-E8BE2B92FE26 Old RevisionGUID= New RevisionGUID=3AD39AC4-76D9-47E4-A6CE-53C3AA8EE72B
Change Managed Component Library Link : Designator=U12 Old VaultGUID= New VaultGUID=B7D15EC3-160A-466F-A46C-7801FE6295A7 Old ItemGUID= New ItemGUID=B51608F1-AB38-4C0A-9DB6-B13CE1A3A719 Old RevisionGUID= New RevisionGUID=8BDFB04B-00F5-493F-9ABB-16491C440EA1
Change Managed Component Library Link : Designator=U13 Old VaultGUID= New VaultGUID=B7D15EC3-160A-466F-A46C-7801FE6295A7 Old ItemGUID= New ItemGUID=244B7203-EAE1-4D98-8EDD-E9BFEA24EEA2 Old RevisionGUID= New RevisionGUID=02995B78-C6D2-42B2-8C7E-7AF0914E3FF8
Change Managed Component Library Link : Designator=U14 Old VaultGUID= New VaultGUID=B7D15EC3-160A-466F-A46C-7801FE6295A7 Old ItemGUID= New ItemGUID=1AD64A1E-6FD6-489B-9DA0-C37D94552764 Old RevisionGUID= New RevisionGUID=25D30291-4C86-4D77-A38F-5B594E8647F5
Change Managed Component Library Link : Designator=U16 Old VaultGUID= New VaultGUID=B7D15EC3-160A-466F-A46C-7801FE6295A7 Old ItemGUID= New ItemGUID=04C65D10-8846-4252-B66D-BD1165FE6264 Old RevisionGUID= New RevisionGUID=0965EE87-D472-4684-A0F1-E7DEA629C8D8
Change Managed Component Library Link : Designator=U17 Old VaultGUID= New VaultGUID=B7D15EC3-160A-466F-A46C-7801FE6295A7 Old ItemGUID= New ItemGUID=D06A5EA3-A2EC-4718-B687-821D730AA606 Old RevisionGUID= New RevisionGUID=34AA22D5-544C-4E6D-AFD0-C2BCFE2BB0C8
Change Managed Component Library Link : Designator=U18 Old VaultGUID= New VaultGUID=B7D15EC3-160A-466F-A46C-7801FE6295A7 Old ItemGUID= New ItemGUID=24279BAE-83D0-4E68-8314-1F915FAA3E8E Old RevisionGUID= New RevisionGUID=073B1F95-4A5D-462F-889A-05A850D4AE2A
Change Managed Component Library Link : Designator=U19 Old VaultGUID= New VaultGUID=B7D15EC3-160A-466F-A46C-7801FE6295A7 Old ItemGUID= New ItemGUID=24279BAE-83D0-4E68-8314-1F915FAA3E8E Old RevisionGUID= New RevisionGUID=073B1F95-4A5D-462F-889A-05A850D4AE2A
Change Managed Component Library Link : Designator=U20 Old VaultGUID= New VaultGUID=B7D15EC3-160A-466F-A46C-7801FE6295A7 Old ItemGUID= New ItemGUID=ED8CB0AB-E38B-49E6-B4EA-3AC7313D13C7 Old RevisionGUID= New RevisionGUID=9E573F1C-293E-4513-96C1-E2CF74FC1A82
Change Managed Component Library Link : Designator=U21 Old VaultGUID= New VaultGUID=B7D15EC3-160A-466F-A46C-7801FE6295A7 Old ItemGUID= New ItemGUID=29CA44F7-77E0-4771-A0A7-96F9C3613AF0 Old RevisionGUID= New RevisionGUID=45CC3AB1-765B-4F63-A936-C4A34CCA579F
Change Managed Component Library Link : Designator=U22 Old VaultGUID= New VaultGUID=B7D15EC3-160A-466F-A46C-7801FE6295A7 Old ItemGUID= New ItemGUID=A03D9C0D-DF40-4FA7-AB8B-2EC6D508CFA4 Old RevisionGUID= New RevisionGUID=28756BAE-2014-4212-8ACF-C0A8350F1156
Change Managed Component Library Link : Designator=U23 Old VaultGUID= New VaultGUID=B7D15EC3-160A-466F-A46C-7801FE6295A7 Old ItemGUID= New ItemGUID=922683A8-E5E4-4BA4-AC6D-A5DF8106D614 Old RevisionGUID= New RevisionGUID=F91BDBED-B069-4305-8978-7B6CB5326569
Change Managed Component Library Link : Designator=Y1 Old VaultGUID= New VaultGUID=B7D15EC3-160A-466F-A46C-7801FE6295A7 Old ItemGUID= New ItemGUID=1E498965-9837-452D-904A-7AE054C72B70 Old RevisionGUID= New RevisionGUID=CE9DA7AC-E10E-4430-BDD4-AD4E4DB9C9BA
Change component parameters: Designator = "L1" ("L1"); Footprint = "WE-SL5-HC"; UniqueID = "\HELJEUXE" ("\HELJEUXE")
Change component parameters (AddParameter): Name = "Availability"; Value = "Unavailable"; VariantName = "[No Variations]"
Change component parameters (AddParameter): Name = "MF"; Value = "Murata"; VariantName = "[No Variations]"
Change component parameters (AddParameter): Name = "MP"; Value = "DLW5BTM501SQ2L"; VariantName = "[No Variations]"
Change component parameters (AddParameter): Name = "Package"; Value = "Horizontal-6 Murata"; VariantName = "[No Variations]"
Change component parameters (AddParameter): Name = "Price"; Value = "None"; VariantName = "[No Variations]"
Change component parameters (AddParameter): Name = "SnapEDA_Link"; Value = "https://www.snapeda.com/parts/DLW5BTM501SQ2L/Murata/view-part/4300323/?ref=snap"; VariantName = "[No Variations]"
Change component parameters (AddParameter): Name = "Value"; Value = ""; VariantName = "[No Variations]"
Added Pin To Net: NetName=VCC_MAIN_CM Pin=L1-2
Added Pin To Net: NetName=GND Pin=L1-4
