module gitlab.com/gitlab-org/gitlab-pages

go 1.12

require (
	github.com/certifi/gocertifi v0.0.0-20190905060710-a5e0173ced67 // indirect
	github.com/fzipp/gocyclo v0.0.0-20150627053110-6acd4345c835
	github.com/gogo/protobuf v1.3.0 // indirect
	github.com/gorilla/context v1.1.1
	github.com/gorilla/securecookie v1.1.1
	github.com/gorilla/sessions v1.2.0
	github.com/grpc-ecosystem/go-grpc-middleware v1.0.0
	github.com/grpc-ecosystem/go-grpc-prometheus v1.2.0
	github.com/kardianos/osext v0.0.0-20190222173326-2bc1f35cddc0
	github.com/karrick/godirwalk v1.10.12
	github.com/namsral/flag v1.7.4-pre
	github.com/prometheus/client_golang v1.1.0
	github.com/rs/cors v1.7.0
	github.com/sirupsen/logrus v1.4.2
	github.com/stretchr/testify v1.4.0
	github.com/wadey/gocovmerge v0.0.0-20160331181800-b5bfa59ec0ad
	gitlab.com/gitlab-org/gitaly v1.63.0
	gitlab.com/gitlab-org/labkit v0.0.0-20190902063225-3253d7975ca7
	gitlab.com/lupine/go-mimedb v0.0.0-20180307000149-e8af1d659877
	golang.org/x/crypto v0.0.0-20190911031432-227b76d455e7
	golang.org/x/lint v0.0.0-20190909230951-414d861bb4ac
	golang.org/x/net v0.0.0-20190909003024-a7b16738d86b
	golang.org/x/sys v0.0.0-20190910064555-bbd175535a8b
	golang.org/x/tools v0.0.0-20190917032747-2dc213d980bc
	google.golang.org/grpc v1.19.1
)
