{
  "Enemies" : [
    {
      "Name" : "Monster 1",
      "Bonus" : 1,
      "Advantage" : false,
      "Quantity" : 1
    },
    {
      "Name" : "Monster 2",
      "Bonus" : -2,
      "Advantage" : true,
      "Quantity" : 3
    },
    {
      "Name" : "Monster 3",
      "Bonus" : -2,
      "Advantage" : true,
      "Quantity" : 2
    }
  ],
  "Players" : [
    {
      "PlayerName" : "Tony",
      "CharacterName" : "Bragnar"
    },
    {
      "PlayerName" : "Matt",
      "CharacterName" : "Sora"
    }
  ]
}
