{
    "dataset_id": {
        "identifier": "https://doi.org/10.5281/zenodo.10721203",
        "type": "doi"
    },
    "title": "OpenPDAC-10",
    "personal_data": "no",
    "sensitive_data": "no",
    "type": "Software",
    "description": "OpenPDAC is an offline Eulerian-Lagrangian model for the simulation of volcanic fluids.",
    "distribution": [
        {
            "title": "OpenPDAC10 packages and docs",
            "data_access": "open",
            "license": [
                {
                    "license_name": "GNU GENERAL PUBLIC LICENSE Version 3, 29 June 2007",
                    "license_ref": "https://www.gnu.org/licenses/gpl-3.0.html",
                    "start_date": "2007-06-29"
                }
            ],
            "host": {
                "title": "OpenPDAC-10 repository",
                "url": "https://github.com/demichie/OpenPDAC-10",
                "supports_versioning": "yes",
                "storage_type": "repository"
            }
        }
    ]
}