{
	"dataset_id": {
		"identifier": "https://doi.org/10.5281/zenodo.6343786",
		"type": "doi"
	},
	"title": "FALL3D",
	"personal_data": "no",
	"sensitive_data": "no",
	"type": "Software",
	"description": "FALL3D is a 3D model for atmospheric passive transport and deposition of particles, aerosols, and radionuclides.",
	"distribution": [
		{
			"title": "Packages and docs from FALL3D",
			"data_access": "open",
			"license": [
				{
					"license_name": "GNU GENERAL PUBLIC LICENSE Copyright (C) 2013, 2016, 2017, 2018, 2019, 2021  Arnau Folch, Leonardo Mingari, Antonio Costa and Giovanni Macedonio",
					"license_ref": "https://gitlab.com/fall3d-suite/fall3d/-/blob/master/LICENSE",
					"start_date": "2007-06-29"
				}
			],
			"host": {
				"title": "FALL3D repository",
				"url": "https://gitlab.com/fall3d-suite/fall3d",
				"supports_versioning": "yes",
				"storage_type": "repository"
			}
		}
	]	
}