Date du Vol;Pilote ou Elève ou Instructeur;ULM;Classe;Type de Vol;Heure Départ;Heure Arrivée;Durée du vol
14/01/2023 04:38;ZUBLENA Didier;Texan ZMP 69ADS;3 AXES;Propriétaire;520.72;522.07;1: 21
24/12/2022 03:40;ZUBLENA Didier;Texan ZMP 69ADS;3 AXES;Propriétaire;515.32;516.50;1: 11
17/12/2022 05:12;PARRENO Ivain;Texan ZMP 69ADS;3 AXES;Instruction;514.80;515.32;0: 31
16/12/2022 05:12;PARRENO Ivain;Texan ZMP 69ADS;3 AXES;Instruction;513.84;514.80;0: 58
10/12/2022 05:11;PARRENO Ivain;Texan ZMP 69ADS;3 AXES;Instruction;512.77;513.84;1: 4
05/12/2022 05:10;PARRENO Ivain;Texan ZMP 69ADS;3 AXES;Instruction;511.94;512.77;0: 50
03/12/2022 05:10;PARRENO Ivain;Texan ZMP 69ADS;3 AXES;Instruction;511.45;511.94;0: 29
29/11/2022 05:09;PARRENO Ivain;Texan ZMP 69ADS;3 AXES;Instruction;510.52;511.45;0: 56
28/11/2022 05:08;PARRENO Ivain;Texan ZMP 69ADS;3 AXES;Instruction;510.10;510.52;0: 25
27/11/2022 05:07;PARRENO Ivain;Texan ZMP 69ADS;3 AXES;Instruction;509.34;510.10;0: 46
26/11/2022 11:48;ZUBLENA Didier;Texan ZMP 69ADS;3 AXES;Propriétaire;509.01;509.34;0: 20
25/11/2022 11:56;PARRENO Ivain;Texan ZMP 69ADS;3 AXES;Instruction;508.22;509.01;0: 47
24/11/2022 11:56;PARRENO Ivain;Texan ZMP 69ADS;3 AXES;Instruction;507.48;508.22;0: 44
20/11/2022 03:57;ZUBLENA Didier;Texan ZMP 69ADS;3 AXES;Propriétaire;506.99;507.48;0: 29
12/11/2022 09:23;ZUBLENA Didier;Texan ZMP 69ADS;3 AXES;Propriétaire;506.44;506.99;0: 33
02/11/2022 09:22;ZUBLENA Didier;Texan ZMP 69ADS;3 AXES;Propriétaire;505.47;506.44;0: 58
29/10/2022 09:22;ZUBLENA Didier;Texan ZMP 69ADS;3 AXES;Propriétaire;504.76;505.47;0: 43
22/10/2022 09:20;ZUBLENA Didier;Texan ZMP 69ADS;3 AXES;Propriétaire;503.08;504.76;1: 41
09/10/2022 04:41;ZUBLENA Didier;Texan ZMP 69ADS;3 AXES;Propriétaire;502.44;503.08;0: 38
02/10/2022 05:35;ZUBLENA Didier;Texan ZMP 69ADS;3 AXES;Propriétaire;501.25;502.44;1: 11
24/09/2022 09:33;ZUBLENA Didier;Texan ZMP 69ADS;3 AXES;Propriétaire;501.01;501.25;0: 14
18/09/2022 06:18;ZUBLENA Didier;Texan ZMP 69ADS;3 AXES;Propriétaire;500.00;501.01;1: 1
11/09/2022 09:23;ZUBLENA Didier;Texan ZMP 69ADS;3 AXES;Propriétaire;498.17;500.00;1: 50
04/09/2022 09:25;ZUBLENA Didier;Texan ZMP 69ADS;3 AXES;Propriétaire;497.10;498.17;1: 4
28/08/2022 05:51;ZUBLENA Didier;Texan ZMP 69ADS;3 AXES;Propriétaire;496.33;497.10;0: 46
22/08/2022 09:39;ZUBLENA Didier;Texan ZMP 69ADS;3 AXES;Propriétaire;493.42;496.33;2: 55
13/08/2022 09:37;ZUBLENA Didier;Texan ZMP 69ADS;3 AXES;Propriétaire;492.00;493.42;1: 25
08/08/2022 07:06;ZUBLENA Didier;Texan ZMP 69ADS;3 AXES;Instruction;491.00;492.00;1: 0
06/08/2022 07:05;ZUBLENA Didier;Texan ZMP 69ADS;3 AXES;Propriétaire;490.19;491.00;0: 49
30/07/2022 06:37;ZUBLENA Didier;Texan ZMP 69ADS;3 AXES;Propriétaire;488.59;490.19;1: 36
16/07/2022 06:10;ZUBLENA Didier;Texan ZMP 69ADS;3 AXES;Propriétaire;487.72;488.59;0: 52
09/07/2022 05:04;ZUBLENA Didier;Texan ZMP 69ADS;3 AXES;Propriétaire;485.51;487.72;2: 13
25/06/2022 02:36;ZUBLENA Didier;Texan ZMP 69ADS;3 AXES;Propriétaire;485.07;485.51;0: 26
12/06/2022 06:18;ZUBLENA Didier;Texan ZMP 69ADS;3 AXES;Propriétaire;484.08;485.07;0: 59
06/06/2022 10:00;ZUBLENA Didier;Texan ZMP 69ADS;3 AXES;Propriétaire;482.17;484.08;1: 55
29/05/2022 09:57;MOULET Alain;Texan ZMP 69ADS;3 AXES;Propriétaire;481.03;482.17;1: 8
28/05/2022 06:32;ZUBLENA Didier;Texan ZMP 69ADS;3 AXES;Propriétaire;480.36;481.03;0: 40
27/05/2022 06:19;MOULET Alain;Texan ZMP 69ADS;3 AXES;Instruction;479.59;480.36;0: 46
25/05/2022 02:58;ZUBLENA Didier;Texan ZMP 69ADS;3 AXES;Propriétaire;477.58;479.59;2: 1
22/05/2022 02:47;MOULET Alain;Texan ZMP 69ADS;3 AXES;Instruction;476.77;477.58;0: 49
15/05/2022 04:43;ZUBLENA Didier;Texan ZMP 69ADS;3 AXES;Propriétaire;476.07;476.77;0: 42
07/05/2022 11:57;ZUBLENA Didier;Texan ZMP 69ADS;3 AXES;Propriétaire;474.73;476.07;1: 20
05/05/2022 03:30;ZUBLENA Didier;Texan ZMP 69ADS;3 AXES;Propriétaire;474.33;474.73;0: 24
30/04/2022 03:29;ZUBLENA Didier;Texan ZMP 69ADS;3 AXES;Propriétaire;472.68;474.33;1: 39
18/04/2022 03:29;ZUBLENA Didier;Texan ZMP 69ADS;3 AXES;Propriétaire;471.04;472.68;1: 38
17/04/2022 03:28;HEYRAUD Gilbert;Texan ZMP 69ADS;3 AXES;Propriétaire;468.94;471.04;2: 6
15/04/2022 03:26;HEYRAUD Gilbert;Texan ZMP 69ADS;3 AXES;Propriétaire;468.40;468.94;0: 32
15/04/2022 12:26;HEYRAUD Gilbert;Texan ZMP 69ADS;3 AXES;Propriétaire;466.27;468.40;2: 8
15/04/2022 11:00;HEYRAUD Gilbert;Texan ZMP 69ADS;3 AXES;Propriétaire;465.85;466.27;0: 25
27/03/2022 04:02;ZUBLENA Didier;Texan ZMP 69ADS;3 AXES;Propriétaire;721.95;723.33;1: 23
14/01/2023 04:38;ZUBLENA Didier;Texan ZMP 69ADS;3 AXES;Propriétaire;520.72;522.07;1: 21
24/12/2022 03:40;ZUBLENA Didier;Texan ZMP 69ADS;3 AXES;Propriétaire;515.32;516.50;1: 11
17/12/2022 05:12;PARRENO Ivain;Texan ZMP 69ADS;3 AXES;Instruction;514.80;515.32;0: 31
16/12/2022 05:12;PARRENO Ivain;Texan ZMP 69ADS;3 AXES;Instruction;513.84;514.80;0: 58
10/12/2022 05:11;PARRENO Ivain;Texan ZMP 69ADS;3 AXES;Instruction;512.77;513.84;1: 4
05/12/2022 05:10;PARRENO Ivain;Texan ZMP 69ADS;3 AXES;Instruction;511.94;512.77;0: 50
03/12/2022 05:10;PARRENO Ivain;Texan ZMP 69ADS;3 AXES;Instruction;511.45;511.94;0: 29
29/11/2022 05:09;PARRENO Ivain;Texan ZMP 69ADS;3 AXES;Instruction;510.52;511.45;0: 56
28/11/2022 05:08;PARRENO Ivain;Texan ZMP 69ADS;3 AXES;Instruction;510.10;510.52;0: 25
27/11/2022 05:07;PARRENO Ivain;Texan ZMP 69ADS;3 AXES;Instruction;509.34;510.10;0: 46
26/11/2022 11:48;ZUBLENA Didier;Texan ZMP 69ADS;3 AXES;Propriétaire;509.01;509.34;0: 20
25/11/2022 11:56;PARRENO Ivain;Texan ZMP 69ADS;3 AXES;Instruction;508.22;509.01;0: 47
24/11/2022 11:56;PARRENO Ivain;Texan ZMP 69ADS;3 AXES;Instruction;507.48;508.22;0: 44
20/11/2022 03:57;ZUBLENA Didier;Texan ZMP 69ADS;3 AXES;Propriétaire;506.99;507.48;0: 29
12/11/2022 09:23;ZUBLENA Didier;Texan ZMP 69ADS;3 AXES;Propriétaire;506.44;506.99;0: 33
02/11/2022 09:22;ZUBLENA Didier;Texan ZMP 69ADS;3 AXES;Propriétaire;505.47;506.44;0: 58
29/10/2022 09:22;ZUBLENA Didier;Texan ZMP 69ADS;3 AXES;Propriétaire;504.76;505.47;0: 43
22/10/2022 09:20;ZUBLENA Didier;Texan ZMP 69ADS;3 AXES;Propriétaire;503.08;504.76;1: 41
09/10/2022 04:41;ZUBLENA Didier;Texan ZMP 69ADS;3 AXES;Propriétaire;502.44;503.08;0: 38
02/10/2022 05:35;ZUBLENA Didier;Texan ZMP 69ADS;3 AXES;Propriétaire;501.25;502.44;1: 11
24/09/2022 09:33;ZUBLENA Didier;Texan ZMP 69ADS;3 AXES;Propriétaire;501.01;501.25;0: 14
18/09/2022 06:18;ZUBLENA Didier;Texan ZMP 69ADS;3 AXES;Propriétaire;500.00;501.01;1: 1
11/09/2022 09:23;ZUBLENA Didier;Texan ZMP 69ADS;3 AXES;Propriétaire;498.17;500.00;1: 50
04/09/2022 09:25;ZUBLENA Didier;Texan ZMP 69ADS;3 AXES;Propriétaire;497.10;498.17;1: 4
28/08/2022 05:51;ZUBLENA Didier;Texan ZMP 69ADS;3 AXES;Propriétaire;496.33;497.10;0: 46
22/08/2022 09:39;ZUBLENA Didier;Texan ZMP 69ADS;3 AXES;Propriétaire;493.42;496.33;2: 55
13/08/2022 09:37;ZUBLENA Didier;Texan ZMP 69ADS;3 AXES;Propriétaire;492.00;493.42;1: 25
08/08/2022 07:06;ZUBLENA Didier;Texan ZMP 69ADS;3 AXES;Instruction;491.00;492.00;1: 0
06/08/2022 07:05;ZUBLENA Didier;Texan ZMP 69ADS;3 AXES;Propriétaire;490.19;491.00;0: 49
30/07/2022 06:37;ZUBLENA Didier;Texan ZMP 69ADS;3 AXES;Propriétaire;488.59;490.19;1: 36
16/07/2022 06:10;ZUBLENA Didier;Texan ZMP 69ADS;3 AXES;Propriétaire;487.72;488.59;0: 52
09/07/2022 05:04;ZUBLENA Didier;Texan ZMP 69ADS;3 AXES;Propriétaire;485.51;487.72;2: 13
25/06/2022 02:36;ZUBLENA Didier;Texan ZMP 69ADS;3 AXES;Propriétaire;485.07;485.51;0: 26
12/06/2022 06:18;ZUBLENA Didier;Texan ZMP 69ADS;3 AXES;Propriétaire;484.08;485.07;0: 59
06/06/2022 10:00;ZUBLENA Didier;Texan ZMP 69ADS;3 AXES;Propriétaire;482.17;484.08;1: 55
29/05/2022 09:57;MOULET Alain;Texan ZMP 69ADS;3 AXES;Propriétaire;481.03;482.17;1: 8
28/05/2022 06:32;ZUBLENA Didier;Texan ZMP 69ADS;3 AXES;Propriétaire;480.36;481.03;0: 40
27/05/2022 06:19;MOULET Alain;Texan ZMP 69ADS;3 AXES;Instruction;479.59;480.36;0: 46
25/05/2022 02:58;ZUBLENA Didier;Texan ZMP 69ADS;3 AXES;Propriétaire;477.58;479.59;2: 1
22/05/2022 02:47;MOULET Alain;Texan ZMP 69ADS;3 AXES;Instruction;476.77;477.58;0: 49
15/05/2022 04:43;ZUBLENA Didier;Texan ZMP 69ADS;3 AXES;Propriétaire;476.07;476.77;0: 42
07/05/2022 11:57;ZUBLENA Didier;Texan ZMP 69ADS;3 AXES;Propriétaire;474.73;476.07;1: 20
05/05/2022 03:30;ZUBLENA Didier;Texan ZMP 69ADS;3 AXES;Propriétaire;474.33;474.73;0: 24
30/04/2022 03:29;ZUBLENA Didier;Texan ZMP 69ADS;3 AXES;Propriétaire;472.68;474.33;1: 39
18/04/2022 03:29;ZUBLENA Didier;Texan ZMP 69ADS;3 AXES;Propriétaire;471.04;472.68;1: 38
17/04/2022 03:28;HEYRAUD Gilbert;Texan ZMP 69ADS;3 AXES;Propriétaire;468.94;471.04;2: 6
15/04/2022 03:26;HEYRAUD Gilbert;Texan ZMP 69ADS;3 AXES;Propriétaire;468.40;468.94;0: 32
15/04/2022 12:26;HEYRAUD Gilbert;Texan ZMP 69ADS;3 AXES;Propriétaire;466.27;468.40;2: 8
15/04/2022 11:00;HEYRAUD Gilbert;Texan ZMP 69ADS;3 AXES;Propriétaire;465.85;466.27;0: 25
27/03/2022 04:02;ZUBLENA Didier;Texan ZMP 69ADS;3 AXES;Propriétaire;721.95;723.33;1: 23
14/01/2023 04:38;ZUBLENA Didier;Texan ZMP 69ADS;3 AXES;Propriétaire;520.72;522.07;1: 21
24/12/2022 03:40;ZUBLENA Didier;Texan ZMP 69ADS;3 AXES;Propriétaire;515.32;516.50;1: 11
17/12/2022 05:12;PARRENO Ivain;Texan ZMP 69ADS;3 AXES;Instruction;514.80;515.32;0: 31
16/12/2022 05:12;PARRENO Ivain;Texan ZMP 69ADS;3 AXES;Instruction;513.84;514.80;0: 58
10/12/2022 05:11;PARRENO Ivain;Texan ZMP 69ADS;3 AXES;Instruction;512.77;513.84;1: 4
05/12/2022 05:10;PARRENO Ivain;Texan ZMP 69ADS;3 AXES;Instruction;511.94;512.77;0: 50
03/12/2022 05:10;PARRENO Ivain;Texan ZMP 69ADS;3 AXES;Instruction;511.45;511.94;0: 29
29/11/2022 05:09;PARRENO Ivain;Texan ZMP 69ADS;3 AXES;Instruction;510.52;511.45;0: 56
28/11/2022 05:08;PARRENO Ivain;Texan ZMP 69ADS;3 AXES;Instruction;510.10;510.52;0: 25
27/11/2022 05:07;PARRENO Ivain;Texan ZMP 69ADS;3 AXES;Instruction;509.34;510.10;0: 46
26/11/2022 11:48;ZUBLENA Didier;Texan ZMP 69ADS;3 AXES;Propriétaire;509.01;509.34;0: 20
25/11/2022 11:56;PARRENO Ivain;Texan ZMP 69ADS;3 AXES;Instruction;508.22;509.01;0: 47
24/11/2022 11:56;PARRENO Ivain;Texan ZMP 69ADS;3 AXES;Instruction;507.48;508.22;0: 44
20/11/2022 03:57;ZUBLENA Didier;Texan ZMP 69ADS;3 AXES;Propriétaire;506.99;507.48;0: 29
12/11/2022 09:23;ZUBLENA Didier;Texan ZMP 69ADS;3 AXES;Propriétaire;506.44;506.99;0: 33
02/11/2022 09:22;ZUBLENA Didier;Texan ZMP 69ADS;3 AXES;Propriétaire;505.47;506.44;0: 58
29/10/2022 09:22;ZUBLENA Didier;Texan ZMP 69ADS;3 AXES;Propriétaire;504.76;505.47;0: 43
22/10/2022 09:20;ZUBLENA Didier;Texan ZMP 69ADS;3 AXES;Propriétaire;503.08;504.76;1: 41
09/10/2022 04:41;ZUBLENA Didier;Texan ZMP 69ADS;3 AXES;Propriétaire;502.44;503.08;0: 38
02/10/2022 05:35;ZUBLENA Didier;Texan ZMP 69ADS;3 AXES;Propriétaire;501.25;502.44;1: 11
24/09/2022 09:33;ZUBLENA Didier;Texan ZMP 69ADS;3 AXES;Propriétaire;501.01;501.25;0: 14
18/09/2022 06:18;ZUBLENA Didier;Texan ZMP 69ADS;3 AXES;Propriétaire;500.00;501.01;1: 1
11/09/2022 09:23;ZUBLENA Didier;Texan ZMP 69ADS;3 AXES;Propriétaire;498.17;500.00;1: 50
04/09/2022 09:25;ZUBLENA Didier;Texan ZMP 69ADS;3 AXES;Propriétaire;497.10;498.17;1: 4
28/08/2022 05:51;ZUBLENA Didier;Texan ZMP 69ADS;3 AXES;Propriétaire;496.33;497.10;0: 46
22/08/2022 09:39;ZUBLENA Didier;Texan ZMP 69ADS;3 AXES;Propriétaire;493.42;496.33;2: 55
13/08/2022 09:37;ZUBLENA Didier;Texan ZMP 69ADS;3 AXES;Propriétaire;492.00;493.42;1: 25
08/08/2022 07:06;ZUBLENA Didier;Texan ZMP 69ADS;3 AXES;Instruction;491.00;492.00;1: 0
06/08/2022 07:05;ZUBLENA Didier;Texan ZMP 69ADS;3 AXES;Propriétaire;490.19;491.00;0: 49
30/07/2022 06:37;ZUBLENA Didier;Texan ZMP 69ADS;3 AXES;Propriétaire;488.59;490.19;1: 36
16/07/2022 06:10;ZUBLENA Didier;Texan ZMP 69ADS;3 AXES;Propriétaire;487.72;488.59;0: 52
09/07/2022 05:04;ZUBLENA Didier;Texan ZMP 69ADS;3 AXES;Propriétaire;485.51;487.72;2: 13
25/06/2022 02:36;ZUBLENA Didier;Texan ZMP 69ADS;3 AXES;Propriétaire;485.07;485.51;0: 26
12/06/2022 06:18;ZUBLENA Didier;Texan ZMP 69ADS;3 AXES;Propriétaire;484.08;485.07;0: 59
06/06/2022 10:00;ZUBLENA Didier;Texan ZMP 69ADS;3 AXES;Propriétaire;482.17;484.08;1: 55
29/05/2022 09:57;MOULET Alain;Texan ZMP 69ADS;3 AXES;Propriétaire;481.03;482.17;1: 8
28/05/2022 06:32;ZUBLENA Didier;Texan ZMP 69ADS;3 AXES;Propriétaire;480.36;481.03;0: 40
27/05/2022 06:19;MOULET Alain;Texan ZMP 69ADS;3 AXES;Instruction;479.59;480.36;0: 46
25/05/2022 02:58;ZUBLENA Didier;Texan ZMP 69ADS;3 AXES;Propriétaire;477.58;479.59;2: 1
22/05/2022 02:47;MOULET Alain;Texan ZMP 69ADS;3 AXES;Instruction;476.77;477.58;0: 49
15/05/2022 04:43;ZUBLENA Didier;Texan ZMP 69ADS;3 AXES;Propriétaire;476.07;476.77;0: 42
07/05/2022 11:57;ZUBLENA Didier;Texan ZMP 69ADS;3 AXES;Propriétaire;474.73;476.07;1: 20
05/05/2022 03:30;ZUBLENA Didier;Texan ZMP 69ADS;3 AXES;Propriétaire;474.33;474.73;0: 24
30/04/2022 03:29;ZUBLENA Didier;Texan ZMP 69ADS;3 AXES;Propriétaire;472.68;474.33;1: 39
18/04/2022 03:29;ZUBLENA Didier;Texan ZMP 69ADS;3 AXES;Propriétaire;471.04;472.68;1: 38
17/04/2022 03:28;HEYRAUD Gilbert;Texan ZMP 69ADS;3 AXES;Propriétaire;468.94;471.04;2: 6
15/04/2022 03:26;HEYRAUD Gilbert;Texan ZMP 69ADS;3 AXES;Propriétaire;468.40;468.94;0: 32
15/04/2022 12:26;HEYRAUD Gilbert;Texan ZMP 69ADS;3 AXES;Propriétaire;466.27;468.40;2: 8
15/04/2022 11:00;HEYRAUD Gilbert;Texan ZMP 69ADS;3 AXES;Propriétaire;465.85;466.27;0: 25
27/03/2022 04:02;ZUBLENA Didier;Texan ZMP 69ADS;3 AXES;Propriétaire;721.95;723.33;1: 23
