{
  "actor": "Anggota Sekretariat Jenderal",
  "dataForm": "Dokumen tercetak",
  "activity": "Membuat proposal program kerja hasil kompilasi",
  "dataDictionaryCode": "DD-DDiak-003",
  "processCode": "BP-DDiak-01-01, BP-DDiak-02-01, BP-DDiak-03-01, BP-DDiak-04-01",
  "description": "Proposal ini merupakan perbaikan dari semua proposal program kerja yang diusulkan.",
  "attributes": [
    {
      "dataType": "String",
      "length": "255",
      "description": "Judul proposal yang dicetak",
      "alias": "judul",
      "attributeName": "judul proposal"
    },
    {
      "dataType": "String",
      "length": "~",
      "description": "Latar belakang proposal yang dicetak",
      "alias": "-",
      "attributeName": "latar belakang proposal"
    },
    {
      "dataType": "String",
      "length": "255",
      "description": "judul program kerja hasil kompilasi",
      "alias": "-",
      "attributeName": "judul program kerja"
    },
    {
      "dataType": "String",
      "length": "~",
      "description": "Tujuan masing-masing program kerja yang diusulkan",
      "alias": "tujuan",
      "attributeName": "tujuan program kerja"
    },
    {
      "dataType": "Date",
      "length": "10",
      "description": "Jadwal rencana pelakasaan program kerja",
      "alias": "-",
      "attributeName": "rencana pelaksanaan program kerja"
    },
    {
      "dataType": "Currency",
      "length": "14.4",
      "description": "Besar anggaran yang diprediksi digunakan pada program kerja",
      "alias": "anggaran",
      "attributeName": "anggaran biaya program kerja"
    },
    {
      "dataType": "String",
      "length": "100",
      "description": "Pihak yang menerima ",
      "alias": "-",
      "attributeName": "diterima oleh"
    },
    {
      "dataType": "String",
      "length": "100",
      "description": "Persetujuan atau diketahui oleh pembuat keputusan biasanya berupa tanda tangan dan nama.",
      "alias": "-",
      "attributeName": "disetujui oleh"
    }
  ],
  "documentName": "Proposal Program Kerja Hasil Kompilasi",
  "relation": "DD-DDiak-001"
}