{
  "actor": "Anggota Biro Latihan Kerja/Pelayanan Khusus",
  "dataForm": "Dokumen tercetak",
  "activity": "Melakukan rapat",
  "dataDictionaryCode": "DD-DDiak-022",
  "processCode": "BP-DDiak-02-08",
  "description": "Proposal ini berisi dalam keperluan mengadakan perayaan Natal dan Paskah oleh Biro Latihan Kerja/Pelayanan Khusus",
  "attributes": [
    {
      "dataType": "String",
      "length": "255",
      "description": "Judul laporan yang dicetak",
      "alias": "judul",
      "attributeName": "judul laporan"
    },
    {
      "dataType": "String",
      "length": "50",
      "description": "Lokasi/kota dilakukannya kegiatan",
      "alias": "tempat",
      "attributeName": "tempat kegiatan"
    },
    {
      "dataType": "Date",
      "length": "10",
      "description": "Jadwal dilaksanakan kegiatan",
      "alias": "tanggal",
      "attributeName": "tanggal kegiatan"
    },
    {
      "dataType": "String[]",
      "length": "100",
      "description": "Nama peserta yang ikut kegiatan",
      "alias": "nama",
      "attributeName": "peserta kegiatan"
    },
    {
      "dataType": "String[]",
      "length": "100",
      "description": "Daftar keperluan dan dana yang digunakan",
      "alias": "-",
      "attributeName": "daftar keperluan dana"
    },
    {
      "dataType": "String[]",
      "length": "100",
      "description": "Nama panitia yang terlibat dalam kegiatan",
      "alias": "nama",
      "attributeName": "kepanitiaan"
    },
    {
      "dataType": "String",
      "length": "100",
      "description": "Pihak yang menerima ",
      "alias": "-",
      "attributeName": "diterima oleh"
    },
    {
      "dataType": "String",
      "length": "100",
      "description": "Persetujuan atau diketahui oleh pembuat keputusan biasanya berupa tanda tangan dan nama.",
      "alias": "-",
      "attributeName": "disetujui oleh"
    }
  ],
  "documentName": "Proposal Perayaan Natal dan Paskah Anak Jalanan",
  "relation": "DD-DDiak-014"
}