{
  "actor": "Sekretaris Jenderal",
  "dataForm": "Dokumen tercetak",
  "activity": "Membuat memo pencairan dana",
  "dataDictionaryCode": "DD-DDiak-004",
  "processCode": "BP-DDiak-01-02, BP-DDiak-04-01",
  "description": "Proposal ini berisi tentang detail usulkan program kerja dari biro/departemen.",
  "attributes": [
    {
      "dataType": "String",
      "length": "100",
      "description": "Nama orang sebagai penerima memo",
      "alias": "nama",
      "attributeName": "nama penerima memo"
    },
    {
      "dataType": "String",
      "length": "~",
      "description": "Isi memo yang disampaikan",
      "alias": "isi",
      "attributeName": "isi memo"
    },
    {
      "dataType": "String",
      "length": "100",
      "description": "Persetujuan atau diketahui oleh pembuat keputusan biasanya berupa tanda tangan dan nama.",
      "alias": "-",
      "attributeName": "disetujui oleh"
    }
  ],
  "documentName": "Memo Pencairan Dana",
  "relation": "DD-DDiak-001"
}