\begin{tikzpicture}
	\begin{pgfonlayer}{nodelayer}
		\node [style=none] (0) at (0, 0) {};
		\node [style=none] (1) at (0, 0) {};
		\node [style=none] (2) at (0, 6) {};
		\node [style=none] (3) at (8, 0) {};
		\node [style=none] (4) at (-1.25, 6) {$P$};
		\node [style=none] (7) at (8.5, -0.75) {$V$};
		\node [style=none] (11) at (0, 4) {};
		\node [style=none] (12) at (1, 5) {};
		\node [style=none] (13) at (7, 1) {};
		\node [style=none] (14) at (0.75, 6) {2};
		\node [style=none] (15) at (7.5, 1) {1};
		\node [style=none] (16) at (2, 4) {$D$};
		\node [style=none] (17) at (2.75, 3) {$C$};
		\node [style=none] (18) at (4, 2.25) {$B$};
		\node [style=none] (19) at (5.25, 1.75) {$A$};
		\node [style=none] (20) at (6, 1.5) {};
		\node [style=none] (21) at (1.75, 3.25) {};
		\node [style=none] (22) at (7.25, 5.5) {transformation directe - compression};
		\node [style=none] (23) at (1.5, 0.5) {transformation inverse - détente};
	\end{pgfonlayer}
	\begin{pgfonlayer}{edgelayer}
		\draw [style=arrow] (1.center) to (3.center);
		\draw [style=arrow] (0.center) to (2.center);
		\draw [bend right] (12.center) to (13.center);
		\draw [style=arrow] (23.center) to (21.center);
		\draw [style=arrow] (22.center) to (20.center);
	\end{pgfonlayer}
\end{tikzpicture}
