\begin{tikzpicture}
	\begin{pgfonlayer}{nodelayer}
		\node [style=none] (0) at (0, 0) {};
		\node [style=none] (1) at (0, 6) {};
		\node [style=none] (2) at (6, 0) {};
		\node [style=none] (5) at (0, 1) {};
		\node [style=none] (11) at (-0.25, -0.25) {0};
		\node [style=none] (22) at (-0.75, 6) {$T$};
		\node [style=none] (23) at (6, -0.5) {$S$};
		\node [style=none] (24) at (3, 1) {};
		\node [style=none] (25) at (3, 5) {};
		\node [style=none] (26) at (3.5, 1) {1};
		\node [style=none] (27) at (3.5, 5) {2};
		\node [style=none] (28) at (3, 1) {};
		\node [style=none] (29) at (3, 0) {};
		\node [style=none] (30) at (5.25, 0) {};
		\node [style=none] (31) at (0, 2.75) {};
		\node [style=none] (32) at (5.25, 2.75) {};
		\node [style=none] (33) at (-0.75, 2.75) {$T_3$};
		\node [style=none] (34) at (-0.75, 1) {$T_2$};
		\node [style=none] (35) at (3, -0.5) {$S_1=S_2$};
		\node [style=none] (36) at (5, -0.5) {$S_3$};
		\node [style=none] (37) at (5.75, 2.75) {3};
	\end{pgfonlayer}
	\begin{pgfonlayer}{edgelayer}
		\draw [style=arrowZ] (0.center) to (1.center);
		\draw [style=arrowZ] (0.center) to (2.center);
		\draw [style=arrowZ] (24.center) to (25.center);
		\draw [style=dash-edgeZ] (5.center) to (28.center);
		\draw [style=dash-edgeZ] (25.center) to (32.center);
		\draw [style=dash-edgeZ] (32.center) to (30.center);
		\draw [style=dash-edgeZ] (31.center) to (32.center);
		\draw [style=dash-edgeZ] (29.center) to (28.center);
	\end{pgfonlayer}
\end{tikzpicture}
