\begin{tikzpicture}
	\begin{pgfonlayer}{nodelayer}
		\node [style=none] (0) at (0, 4.25) {};
		\node [style=none] (1) at (0, -4) {};
		\node [style=none] (2) at (6, 2) {};
		\node [style=none] (3) at (6, -2) {};
		\node [style=none] (4) at (9, -2) {};
		\node [style=none] (5) at (9, 2) {};
		\node [style=none] (7) at (8, 2) {};
		\node [style=none] (8) at (8, -2) {};
		\node [style=none] (9) at (1, 4) {};
		\node [style=none] (10) at (1, -3.75) {};
		\node [style=none] (11) at (-0.5, 4.25) {A};
		\node [style=none] (12) at (-0.5, -4) {B};
		\node [style=none] (13) at (1, 4.75) {A'};
		\node [style=none] (14) at (1, -4.5) {B'};
		\node [style=none] (15) at (6, 2.75) {C};
		\node [style=none] (16) at (6, -2.5) {D};
		\node [style=none] (17) at (8, 2.75) {C'};
		\node [style=none] (18) at (8, -2.5) {D'};
		\node [style=none] (19) at (5.75, 5) {$Q=0$};
	\end{pgfonlayer}
	\begin{pgfonlayer}{edgelayer}
		\draw [in=180, out=0] (0.center) to (2.center);
		\draw [in=-180, out=0] (1.center) to (3.center);
		\draw (2.center) to (5.center);
		\draw (3.center) to (4.center);
		\draw (1.center) to (0.center);
		\draw (3.center) to (2.center);
		\draw (9.center) to (10.center);
		\draw (7.center) to (8.center);
	\end{pgfonlayer}
\end{tikzpicture}
