\begin{tikzpicture}
	\begin{pgfonlayer}{nodelayer}
		\node [style=none] (0) at (-2, 2) {};
		\node [style=none] (1) at (-2, -3) {};
		\node [style=none] (2) at (2, -3) {};
		\node [style=none] (3) at (2, 2) {};
		\node [style=none] (4) at (-2, -2) {};
		\node [style=none] (5) at (2, -2) {};
		\node [style=none] (6) at (-2, 1) {};
		\node [style=none] (7) at (2, 1) {};
		\node [style=none] (8) at (0, -2.5) {$S$};
		\node [style=none] (9) at (-0.25, -1.5) {gaz};
		\node [style=none] (10) at (0, 2) {};
		\node [style=none] (11) at (0, 1) {};
		\node [style=none] (12) at (-0.25, 2.5) {$\vec{F_{ext}}$};
		\node [style=none] (13) at (3.75, 1) {parois isolés};
		\node [style=none] (14) at (3.75, -1.25) {$Q=0$};
		\node [style=none] (15) at (2, -0.75) {};
	\end{pgfonlayer}
	\begin{pgfonlayer}{edgelayer}
		\draw (0.center) to (1.center);
		\draw (1.center) to (2.center);
		\draw (2.center) to (3.center);
		\draw (6.center) to (7.center);
		\draw (5.center) to (4.center);
		\draw [style=arrow] (10.center) to (11.center);
		\draw [style=arrowZ] (14.center) to (15.center);
	\end{pgfonlayer}
\end{tikzpicture}
