<?xml version="1.0" encoding="UTF-8" standalone="no"?>
<svg
   xmlns:dc="http://purl.org/dc/elements/1.1/"
   xmlns:cc="http://creativecommons.org/ns#"
   xmlns:rdf="http://www.w3.org/1999/02/22-rdf-syntax-ns#"
   xmlns:svg="http://www.w3.org/2000/svg"
   xmlns="http://www.w3.org/2000/svg"
   xmlns:sodipodi="http://sodipodi.sourceforge.net/DTD/sodipodi-0.dtd"
   xmlns:inkscape="http://www.inkscape.org/namespaces/inkscape"
   width="240mm"
   height="120mm"
   viewBox="0 0 240 120"
   version="1.1"
   id="svg8"
   inkscape:version="1.0.1 (3bc2e813f5, 2020-09-07)"
   sodipodi:docname="gaz-dans-le-champ-pesanteur.svg">
  <defs
     id="defs2" />
  <sodipodi:namedview
     id="base"
     pagecolor="#ffffff"
     bordercolor="#666666"
     borderopacity="1.0"
     inkscape:pageopacity="0.0"
     inkscape:pageshadow="2"
     inkscape:zoom="1.9887478"
     inkscape:cx="376.29967"
     inkscape:cy="276.33423"
     inkscape:document-units="mm"
     inkscape:current-layer="layer1"
     showgrid="true"
     showborder="true"
     width="200mm"
     showguides="true"
     inkscape:guide-bbox="true"
     inkscape:window-width="1842"
     inkscape:window-height="1051"
     inkscape:window-x="0"
     inkscape:window-y="29"
     inkscape:window-maximized="0"
     inkscape:document-rotation="0">
    <inkscape:grid
       type="xygrid"
       id="grid815"
       units="mm"
       spacingx="10"
       spacingy="10"
       empspacing="4"
       dotted="false" />
  </sodipodi:namedview>
  <metadata
     id="metadata5">
    <rdf:RDF>
      <cc:Work
         rdf:about="">
        <dc:format>image/svg+xml</dc:format>
        <dc:type
           rdf:resource="http://purl.org/dc/dcmitype/StillImage" />
        <dc:title />
      </cc:Work>
    </rdf:RDF>
  </metadata>
  <g
     inkscape:label="Layer 1"
     inkscape:groupmode="layer"
     id="layer1"
     transform="translate(0,-177)">
    <path
       style="fill:#00ff3c;fill-opacity:1;fill-rule:evenodd;stroke-width:0.389846"
       id="path62"
       sodipodi:type="arc"
       sodipodi:cx="120"
       sodipodi:cy="257"
       sodipodi:rx="25.299862"
       sodipodi:ry="19.737219"
       sodipodi:start="3.148574"
       sodipodi:end="0"
       sodipodi:arc-type="slice"
       d="M 94.700755,256.86221 A 25.299862,19.737219 0 0 1 120.08831,237.2629 25.299862,19.737219 0 0 1 145.29986,257 H 120 Z" />
    <text
       xml:space="preserve"
       style="font-style:normal;font-weight:normal;font-size:4.23333px;line-height:1.25;font-family:sans-serif;fill:#000000;fill-opacity:1;stroke:none;stroke-width:0.264583"
       x="113.08414"
       y="262.54483"
       id="text889"><tspan
         sodipodi:role="line"
         id="tspan887"
         x="113.08414"
         y="262.54483"
         style="font-size:4.23333px;stroke-width:0.264583">Terre</tspan></text>
    <circle
       id="path893"
       style="fill:#00ff3c;stroke:#000000;stroke-width:0.264583"
       cx="110.15725"
       cy="229.55087"
       r="0.017582504" />
    <circle
       id="path895"
       style="fill:#00ff3c;stroke:#000000;stroke-width:0.264583"
       cx="89.802109"
       cy="237.66632"
       r="0.017582504" />
    <circle
       id="path897"
       style="fill:#00ff3c;stroke:#000000;stroke-width:0.264583"
       cx="113.6163"
       cy="222.3667"
       r="0.017582504" />
    <circle
       id="path899"
       style="fill:#00ff3c;stroke:#000000;stroke-width:0.264583"
       cx="128.5168"
       cy="239.39584"
       r="0.017582504" />
    <circle
       id="path901"
       style="fill:#00ff3c;stroke:#000000;stroke-width:0.264583"
       cx="99.381004"
       cy="240.85928"
       r="0.017582504" />
    <circle
       id="path903"
       style="fill:#00ff3c;stroke:#000000;stroke-width:0.264583"
       cx="99.780121"
       cy="230.34911"
       r="0.017582504" />
    <circle
       id="path917"
       style="fill:#00ff3c;stroke:#000000;stroke-width:0.264583"
       cx="138.22874"
       cy="244.05225"
       r="0.017582504" />
    <circle
       id="path919"
       style="fill:#00ff3c;stroke:#000000;stroke-width:0.264583"
       cx="119.73615"
       cy="242.98792"
       r="0.017582504" />
    <circle
       id="path921"
       style="fill:#00ff3c;stroke:#000000;stroke-width:0.264583"
       cx="119.73615"
       cy="237.40024"
       r="0.017582504" />
    <circle
       id="path923"
       style="fill:#00ff3c;stroke:#000000;stroke-width:0.264583"
       cx="106.96429"
       cy="248.97473"
       r="0.017582504" />
    <circle
       id="path925"
       style="fill:#00ff3c;stroke:#000000;stroke-width:0.264583"
       cx="106.43213"
       cy="242.72183"
       r="0.017582504" />
    <circle
       id="path927"
       style="fill:#00ff3c;stroke:#000000;stroke-width:0.264583"
       cx="113.35022"
       cy="237.53328"
       r="0.017582504" />
    <circle
       id="path929"
       style="fill:#00ff3c;stroke:#000000;stroke-width:0.264583"
       cx="108.29469"
       cy="235.27159"
       r="0.017582504" />
    <circle
       id="path931"
       style="fill:#00ff3c;stroke:#000000;stroke-width:0.264583"
       cx="94.724594"
       cy="243.65312"
       r="0.017582504" />
    <circle
       id="path933"
       style="fill:#00ff3c;stroke:#000000;stroke-width:0.264583"
       cx="108.42774"
       cy="233.94119"
       r="0.017582504" />
    <circle
       id="path935"
       style="fill:#00ff3c;stroke:#000000;stroke-width:0.264583"
       cx="130.11328"
       cy="232.34471"
       r="0.017582504" />
    <circle
       id="path937"
       style="fill:#00ff3c;stroke:#000000;stroke-width:0.264583"
       cx="125.98904"
       cy="251.10338"
       r="0.017582504" />
    <circle
       id="path939"
       style="fill:#00ff3c;stroke:#000000;stroke-width:0.264583"
       cx="137.69656"
       cy="246.31393"
       r="0.017582504" />
    <circle
       id="path941"
       style="fill:#00ff3c;stroke:#000000;stroke-width:0.264583"
       cx="141.68777"
       cy="236.73503"
       r="0.017582504" />
    <circle
       id="path943"
       style="fill:#00ff3c;stroke:#000000;stroke-width:0.264583"
       cx="108.56078"
       cy="240.72624"
       r="0.017582504" />
  </g>
</svg>
