Instrument,Timetamp,CollapseAxis, Angle, MedWidth, Centres
GNIRS-HR,20221111 022301.2,0,0.8,40,(35.0,74.5,114.5,154.5,194.5,234.0,273.5,313.5,353.5,393.0,433.5,473.0,512.5,552.5,592.5,632.0,672.0,712.0,751.5,791.0,831.0,870.5,910.5,950.5,990.0)
GNIRS-HR,20221111 022333.7,0,0.8,40,(35.0,74.5,114.5,154.5,194.5,234.0,273.5,313.5,353.5,393.0,433.5,473.0,512.5,552.5,592.5,632.0,672.0,712.0,751.5,791.0,831.0,870.5,910.5,950.5,990.0)
GNIRS-HR,20221111 022401.7,0,0.8,40,(35.0,74.5,114.5,154.5,194.5,234.0,273.5,313.5,353.5,393.0,433.5,473.0,512.5,552.5,592.5,632.0,672.0,712.0,751.5,791.0,831.0,870.5,910.5,950.5,990.0)
GNIRS-HR,20221212 000000,0,0.8,40,(18.5,109.5,150.0,189.5,229.5,269.0,309.5,348.5,388.5,428.5,468.5,508.5,548.0,587.5,628.0,667.5,707.5,747.0,787.0,826.5,867.0,906.0,946.5,986.0,1027.5)
GNIRS-HR,20221212 000000,0,0.8,40,(18.5,109.5,150.0,189.5,229.5,269.0,309.5,348.5,388.5,428.5,468.5,508.5,548.0,587.5,628.0,667.5,707.5,747.0,787.0,826.5,867.0,906.0,946.5,986.0,1027.5)
GNIRS-HR,20221212 000000,0,0.8,40,(18.5,109.5,150.0,189.5,229.5,269.0,309.5,348.5,388.5,428.5,468.5,508.5,548.0,587.5,628.0,667.5,707.5,747.0,787.0,826.5,867.0,906.0,946.5,986.0,1027.5)
GNIRS-HR,20221212 000000,0,0.8,40,(18.5,109.5,150.0,189.5,229.5,269.0,309.5,348.5,388.5,428.5,468.5,508.5,548.0,587.5,628.0,667.5,707.5,747.0,787.0,826.5,867.0,906.0,946.5,986.0,1027.5)
GNIRS-HR,20221212 000000,0,0.8,40,(16.5,69.5,109.5,149.5,189.5,229.5,269.0,309.0,348.5,389.0,428.5,468.5,508.0,548.0,588.0,628.0,667.0,707.5,747.0,787.0,827.0,867.0,906.0,946.5,986.0,1029.5)
GNIRS-HR,20221212 000000,0,0.8,40,(50.5,90.0,129.5,169.5,209.5,249.0,289.0,329.0,369.0,408.5,448.5,488.5,528.0,568.0,608.0,647.5,687.5,727.5,767.0,807.0,847.0,886.5,926.5,966.0,1005.5)
GNIRS-HR,20221212 000000,0,0.8,40,(50.5,90.0,130.0,170.0,210.0,249.5,289.0,329.0,369.0,408.5,448.5,488.5,528.0,568.0,608.0,647.5,687.5,727.5,767.0,807.0,847.0,886.5,926.5,966.0,1005.5)
GNIRS-HR,20221212 000000,0,0.8,40,(50.5,90.0,129.5,169.5,209.5,249.0,289.0,329.0,369.0,408.5,448.5,488.5,528.0,568.0,608.0,647.5,687.5,727.5,767.0,807.0,847.0,886.5,926.5,966.0,1005.5)
GNIRS-HR,20221212 000000,0,0.8,40,(50.5,90.0,129.5,169.5,209.5,249.0,289.0,329.0,369.0,408.5,448.5,488.5,528.0,568.0,608.0,647.5,687.5,727.5,767.0,807.0,847.0,886.5,926.5,966.0,1005.5)
GNIRS-HR,20221212 000000,0,0.8,40,(50.5,90.0,129.5,169.5,209.5,249.0,289.0,329.0,369.0,408.5,448.5,488.5,528.0,568.0,608.0,647.5,687.5,727.5,767.0,807.0,847.0,886.5,926.5,966.0,1005.5)
GNIRS-HR,20221212 000000,0,0.8,40,(50.5,90.0,129.5,169.5,209.5,249.0,289.0,329.0,369.0,408.5,448.5,488.5,528.0,568.0,608.0,647.5,687.5,727.5,767.0,807.0,847.0,886.5,926.5,966.0,1005.5)
GNIRS-HR,20221212 000000,0,0.8,40,(50.5,90.0,129.5,169.5,209.5,249.0,289.0,329.0,369.0,408.5,448.5,488.5,528.0,568.0,608.0,647.5,687.5,727.5,767.0,807.0,847.0,886.5,926.5,966.0,1005.5)
GNIRS-HR,20221212 000000,0,0.8,40,(50.5,90.0,129.5,169.5,209.5,249.0,289.0,329.0,369.0,408.5,448.5,488.5,528.0,568.0,608.0,647.5,687.5,727.5,767.0,807.0,847.0,886.5,926.5,966.0,1005.5)
GNIRS-HR,20221212 000000,0,0.8,40,(50.5,90.0,129.5,169.5,209.5,249.0,289.0,329.0,369.0,408.5,448.5,488.5,528.0,568.0,608.0,647.5,687.5,727.5,767.0,807.0,847.0,886.5,926.5,966.0,1005.5)
GNIRS-HR,20221212 000000,0,0.8,40,(50.5,90.0,129.5,169.5,209.5,249.0,289.0,329.0,369.0,408.5,448.5,488.5,528.0,568.0,608.0,647.5,687.5,727.5,767.0,807.0,847.0,886.5,926.5,966.0,1005.5)
GNIRS-HR,20230224 000000,0,0.8,40,(50.5,90.0,129.5,169.5,209.5,249.0,289.0,329.0,369.0,408.5,448.5,488.5,528.0,568.0,608.0,647.5,687.5,727.5,767.0,807.0,847.0,886.5,926.5,966.0,1005.5)
GNIRS-HR,20230224 000000,0,0.8,40,(50.5,90.0,129.5,169.5,209.5,249.0,289.0,329.0,369.0,408.5,448.5,488.5,528.0,568.0,608.0,647.5,687.5,727.5,767.0,807.0,847.0,886.5,926.5,966.0,1005.5)
GNIRS-HR,20230224 000000,0,0.8,40,(50.5,90.0,129.5,169.5,209.5,249.0,289.0,329.0,369.0,408.5,448.5,488.5,528.0,568.0,608.0,647.5,687.5,727.5,767.0,807.0,847.0,886.5,926.5,966.0,1005.5)
GNIRS-HR,20230224 000000,0,0.8,40,(50.5,90.0,129.5,169.5,209.5,249.0,289.0,329.0,369.0,408.5,448.5,488.5,528.0,568.0,608.0,647.5,687.5,727.5,767.0,807.0,847.0,886.5,926.5,966.0,1005.5)
GNIRS-HR,20230224 000000,0,0.8,40,(50.5,90.0,129.5,169.5,209.5,249.0,289.0,329.0,369.0,408.5,448.5,488.5,528.0,568.0,608.0,647.5,687.5,727.5,767.0,807.0,847.0,886.5,926.5,966.0,1005.5)
GNIRS-HR,20230224 000000,0,0.8,40,(50.5,90.0,129.5,169.5,209.5,249.0,289.0,329.0,369.0,408.5,448.5,488.5,528.0,568.0,608.0,647.5,687.5,727.5,767.0,807.0,847.0,886.5,926.5,966.0,1005.5)
GNIRS-HR,20230224 000000,0,0.8,40,(50.5,90.0,129.5,169.5,209.5,249.0,289.0,329.0,369.0,408.5,448.5,488.5,528.0,568.0,608.0,647.5,687.5,727.5,767.0,807.0,847.0,886.5,926.5,966.0,1005.5)
GNIRS-HR,20221212 000000,0,0.8,40,(50.5,90.0,129.5,169.5,209.5,249.0,289.0,329.0,369.0,408.5,448.5,488.5,528.0,568.0,608.0,647.5,687.5,727.5,767.0,807.0,847.0,886.5,926.5,966.0,1005.5)
GNIRS-HR,20221212 000000,0,0.8,40,(50.5,90.0,129.5,169.5,209.5,249.0,289.0,329.0,369.0,408.5,448.5,488.5,528.0,568.0,608.0,647.5,687.5,727.5,767.0,807.0,847.0,886.5,926.5,966.0,1005.5)
GNIRS-HR,20221212 000000,0,0.8,40,(50.5,90.0,129.5,169.5,209.5,249.0,289.0,329.0,369.0,408.5,448.5,488.5,528.0,568.0,608.0,647.5,687.5,727.5,767.0,807.0,847.0,886.5,926.5,966.0,1005.5)
GNIRS-HR,20221212 000000,0,0.8,40,(50.5,90.0,129.5,169.5,209.5,249.0,289.0,329.0,369.0,408.5,448.5,488.5,528.0,568.0,608.0,647.5,687.5,727.5,767.0,807.0,847.0,886.5,926.5,966.0,1005.5)
GNIRS-HR,20221212 000000,0,0.8,40,(50.5,90.0,129.5,169.5,209.5,249.0,289.0,329.0,369.0,408.5,448.5,488.5,528.0,568.0,608.0,647.5,687.5,727.5,767.0,807.0,847.0,886.5,926.5,966.0,1005.5)
GNIRS-HR,20221212 000000,0,0.8,40,(50.5,90.0,129.5,169.5,209.5,249.0,289.0,329.0,369.0,408.5,448.5,488.5,528.0,568.0,608.0,647.5,687.5,727.5,767.0,807.0,847.0,886.5,926.5,966.0,1005.5)
GNIRS-HR,20221212 000000,0,0.8,40,(50.5,90.0,129.5,169.5,209.5,249.0,289.0,329.0,369.0,408.5,448.5,488.5,528.0,568.0,608.0,647.5,687.5,727.5,767.0,807.0,847.0,886.5,926.5,966.0,1005.5)
