module gitlab.com/Blockdaemon/ubiquity/ubiquity-go-client

go 1.19

require (
	github.com/btcsuite/btcd v0.22.0-beta
	github.com/btcsuite/btcutil v1.0.3-0.20201208143702-a53e38424cce
	github.com/centrifuge/go-substrate-rpc-client/v4 v4.0.12
	github.com/ethereum/go-ethereum v1.10.17
	github.com/gagliardetto/solana-go v1.8.2
	github.com/gorilla/websocket v1.5.0
	github.com/stretchr/testify v1.7.0
	golang.org/x/oauth2 v0.0.0-20210323180902-22b0adad7558
)

require (
	contrib.go.opencensus.io/exporter/stackdriver v0.13.4 // indirect
	filippo.io/edwards25519 v1.0.0-rc.1 // indirect
	github.com/ChainSafe/go-schnorrkel v1.0.0 // indirect
	github.com/aybabtme/rgbterm v0.0.0-20170906152045-cc83f3b3ce59 // indirect
	github.com/blendle/zapdriver v1.3.1 // indirect
	github.com/btcsuite/btcd/btcec/v2 v2.1.2 // indirect
	github.com/btcsuite/btclog v0.0.0-20170628155309-84c8d2346e9f // indirect
	github.com/cosmos/go-bip39 v1.0.0 // indirect
	github.com/davecgh/go-spew v1.1.1 // indirect
	github.com/decred/base58 v1.0.3 // indirect
	github.com/decred/dcrd/crypto/blake256 v1.0.0 // indirect
	github.com/decred/dcrd/dcrec/secp256k1/v4 v4.0.1 // indirect
	github.com/dfuse-io/logging v0.0.0-20201110202154-26697de88c79 // indirect
	github.com/fatih/color v1.9.0 // indirect
	github.com/gagliardetto/binary v0.7.7 // indirect
	github.com/gagliardetto/treeout v0.1.4 // indirect
	github.com/go-stack/stack v1.8.1 // indirect
	github.com/golang/groupcache v0.0.0-20200121045136-8c9f03a8e57e // indirect
	github.com/golang/protobuf v1.4.3 // indirect
	github.com/gtank/merlin v0.1.1 // indirect
	github.com/gtank/ristretto255 v0.1.2 // indirect
	github.com/json-iterator/go v1.1.12 // indirect
	github.com/klauspost/compress v1.13.6 // indirect
	github.com/logrusorgru/aurora v2.0.3+incompatible // indirect
	github.com/mattn/go-colorable v0.1.8 // indirect
	github.com/mattn/go-isatty v0.0.12 // indirect
	github.com/mimoo/StrobeGo v0.0.0-20210601165009-122bf33a46e0 // indirect
	github.com/mitchellh/go-testing-interface v1.14.1 // indirect
	github.com/modern-go/concurrent v0.0.0-20180306012644-bacd9c7ef1dd // indirect
	github.com/modern-go/reflect2 v1.0.2 // indirect
	github.com/mostynb/zstdpool-freelist v0.0.0-20201229113212-927304c0c3b1 // indirect
	github.com/mr-tron/base58 v1.2.0 // indirect
	github.com/pierrec/xxHash v0.1.5 // indirect
	github.com/pmezard/go-difflib v1.0.0 // indirect
	github.com/streamingfast/logging v0.0.0-20220405224725-2755dab2ce75 // indirect
	github.com/stretchr/objx v0.1.1 // indirect
	github.com/teris-io/shortid v0.0.0-20201117134242-e59966efd125 // indirect
	github.com/tidwall/gjson v1.9.3 // indirect
	github.com/tidwall/match v1.1.1 // indirect
	github.com/tidwall/pretty v1.2.0 // indirect
	github.com/vedhavyas/go-subkey v1.0.3 // indirect
	go.mongodb.org/mongo-driver v1.11.0 // indirect
	go.opencensus.io v0.22.5 // indirect
	go.uber.org/atomic v1.7.0 // indirect
	go.uber.org/multierr v1.6.0 // indirect
	go.uber.org/zap v1.21.0 // indirect
	golang.org/x/crypto v0.0.0-20220622213112-05595931fe9d // indirect
	golang.org/x/net v0.0.0-20211112202133-69e39bad7dc2 // indirect
	golang.org/x/sys v0.0.0-20211124211545-fe61309f8881 // indirect
	golang.org/x/term v0.0.0-20201210144234-2321bbc49cbf // indirect
	google.golang.org/appengine v1.6.6 // indirect
	google.golang.org/protobuf v1.25.0 // indirect
	gopkg.in/yaml.v3 v3.0.1 // indirect
)
