2023-06-26 11:58:48 WARN Selenium [:logger_info] Details on how to use and modify Selenium logger:
  https://selenium.dev/documentation/webdriver/troubleshooting/logging#ruby
2023-06-26 11:58:48 WARN Selenium applicable driver not found; attempting to install with Selenium Manager
Capybara starting Puma...
* Version 6.3.0 , codename: Mugi No Toki Itaru
* Min threads: 0, max threads: 4
* Listening on unix:///tmp/20230626-324-1au18r
********************************************************************************************
********************************************************************************************
********************************************************************************************
*                                                                                          *
* We have detected a PG::QueryCanceled error in the specs, so we're failing early.         *
* Please retry this job.                                                                   *
*                                                                                          *
* See https://gitlab.com/gitlab-org/gitlab/-/issues/402915 for more info.                  *
*                                                                                          *
********************************************************************************************
********************************************************************************************
********************************************************************************************
Finished in 29.91 seconds (files took 1 minute 6.62 seconds to load)
1 example, 0 failures, 1 error occurred outside of examples
[TEST PROF INFO] Time spent in factories: 00:01.201 (2.04% of total time)
Stopped processing SimpleCov as a previous error not related to SimpleCov has been detected
Failed to write to log, write log/workhorse-test.log: file already closed
Running after_script
00:00
Running after script...
$ echo -e "\e[0Ksection_start:`date +%s`:report_results_section[collapsed=true]\r\e[0KReport results"
Report results
00:00
$ if [ "$CREATE_RAILS_TEST_FAILURE_ISSUES" == "true" ]; then # collapsed multi-line command
$ echo -e "\e[0Ksection_end:`date +%s`:report_results_section\r\e[0K"
Uploading artifacts for failed job
00:05
Uploading artifacts...
coverage/: found 4 matching artifact files and directories 
crystalball/: found 2 matching artifact files and directories 
WARNING: deprecations/: no matching files. Ensure that the artifact path is relative to the working directory (/builds/gitlab-org/gitlab) 
knapsack/: found 2 matching artifact files and directories 
WARNING: query_recorder/: no matching files. Ensure that the artifact path is relative to the working directory (/builds/gitlab-org/gitlab) 
rspec/: found 13 matching artifact files and directories 
WARNING: tmp/capybara/: no matching files. Ensure that the artifact path is relative to the working directory (/builds/gitlab-org/gitlab) 
log/*.log: found 14 matching artifact files and directories 
WARNING: Upload request redirected                  location=https://gitlab.com/api/v4/jobs/4540216616/artifacts?artifact_format=zip&artifact_type=archive&expire_in=31d new-url=https://gitlab.com
WARNING: Retrying...                                context=artifacts-uploader error=request redirected
Uploading artifacts as "archive" to coordinator... 201 Created  id=4540216616 responseStatus=201 Created token=64_ykLYF
Uploading artifacts...
rspec/rspec-*.xml: found 1 matching artifact files and directories 
WARNING: Upload request redirected                  location=https://gitlab.com/api/v4/jobs/4540216616/artifacts?artifact_format=gzip&artifact_type=junit&expire_in=31d new-url=https://gitlab.com
WARNING: Retrying...                                context=artifacts-uploader error=request redirected
Uploading artifacts as "junit" to coordinator... 201 Created  id=4540216616 responseStatus=201 Created token=64_ykLYF
Cleaning up project directory and file based variables
00:00
ERROR: Job failed: exit code 1
KERROR: Job failed: exit code 1
