# MyBestPro

Cette production a été réalisé pour la société **MyBestPro** par **Charles Van Hamme**.

La version de **Symfony 5** est utilisé avec **Docker** pour son serveur WEB et sa base de donnée MySQL.

Le téléchargement de Docker est un pré-requis pour le fonctionnement de l'application.

## Etapes à suivre

* Téléchargement de la production

```bash
$ git clone https://gitlab.com/charles.vanhamme/mybestpro-task.git
```

* Démarrer l'environnement

```bash
$ docker-compose up -d --build

bin                     composer.lock           db-data                 docker-compose.yml      public                  symfony.lock            tests                   var
composer.json           config                  docker                  phpunit.xml.dist        src                     templates               translations            vendor

```

* Installer les dépendances
```bash
$ composer install

bin                     composer.lock           db-data                 docker-compose.yml      public                  symfony.lock            tests                   var
composer.json           config                  docker                  phpunit.xml.dist        src                     templates               translations            vendor

```

* Création des tables en base de donnée
```bash
$ docker-compose exec serverweb php bin/console d:s:u --force
```

* Création d'un jeu de donnée
```bash
$ docker-compose exec serverweb php bin/console d:f:l
```

## Accéder à l'application
* Ouvrir un navigateur et contacter l'url suivante
```bash
http://127.0.0.1/
```