{
  "server": {
    "port": 4000
  },
  "db": {
    "client": "mysql",
    "connection": {
      "host": "mysql-ext.infoclimat.net",
      "port": 3306,
      "user": "esgi09",
      "password": "knPLWZobSkFQ2UW97Fja",
      "database": "hackaton_esgi_groupe09"
    }
  },
  "security": {
    "jwt": {
      "expiresIn": "30d",
      "secret": "changeMeInProduction"
    },
    "hash": {
      "rounds": 12
    }
  },
  "logger": {
    "level": "info",
    "env": "local"
  },
  "awsS3": {
    "config": {
      "accessKeyId": "AKIA4WWWSJZRBT5NO6AC",
      "secretAccessKey": "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",
      "region": "eu-west-3"
    },
    "bucket": {
      "name": "shooterz",
      "contendEncoding": "base64"
    }
  }
}
