Division,WeightClassKg,Place,Name,Team,BodyweightKg,Best3SquatKg,Best3BenchKg,Best3DeadliftKg,TotalKg,Equipment,Event,Sex,BirthDate
Boys,51.71,1,Christian Rodriguez #2,Gainesville,46.99,68.04,45.36,81.65,195.04,Single-ply,SBD,M,
Boys,55.79,1,Daniel Quevedo,Gainesville,55.52,158.76,86.18,145.15,390.09,Single-ply,SBD,M,
Boys,55.79,2,Andrew Angeles,Krum,54.98,111.13,79.38,149.69,340.19,Single-ply,SBD,M,
Boys,59.87,1,Brayden Bahr,Sherman,58.97,70.31,43.09,83.91,197.31,Single-ply,SBD,M,
Boys,67.13,1,Weston Hill,Sanger,62.14,210.92,210.92,215.46,637.3,Single-ply,SBD,M,
Boys,67.13,2,Ignacio Salas,Whitesboro,66.68,240.4,142.88,226.8,610.08,Single-ply,SBD,M,
Boys,67.13,3,Jacob Smith #14,Whitesboro,66.41,188.24,115.67,199.58,503.49,Single-ply,SBD,M,
Boys,67.13,4,Alex LeBrada,Whitesboro,63.5,165.56,106.59,170.1,442.25,Single-ply,SBD,M,
Boys,67.13,5,Asher Contreras,Whitesboro,64.05,183.7,97.52,161.03,442.25,Single-ply,SBD,M,
Boys,67.13,6,Justin Horst,Sanger,66.41,158.76,83.91,172.37,415.04,Single-ply,SBD,M,
Boys,67.13,7,Gage Majesko,Krum,65.68,140.61,106.59,147.42,394.63,Single-ply,SBD,M,
Boys,67.13,8,Jaze Drost,Sherman,64.23,111.13,70.31,136.08,317.51,Single-ply,SBD,M,
Boys,67.13,9,James Culp,Tioga,61.78,108.86,52.16,120.2,281.23,Single-ply,SBD,M,
Boys,67.13,DQ,William Hall #10,Whitesboro,63.68,154.22,,,,Single-ply,SBD,M,
Boys,74.84,1,Kobey Wall,Krum,74.03,188.24,104.33,147.42,439.98,Single-ply,SBD,M,
Boys,74.84,2,Luke Miller #3,Krum,69.31,158.76,108.86,167.83,435.45,Single-ply,SBD,M,
Boys,74.84,3,Brayden Crockett,Whitesboro,70.94,149.69,95.25,190.51,435.45,Single-ply,SBD,M,
Boys,74.84,4,Dakota Lashley,Sherman,74.8,151.95,97.52,170.1,419.57,Single-ply,SBD,M,
Boys,74.84,5,Tate Cole,Sherman,74.75,136.08,72.57,151.95,360.61,Single-ply,SBD,M,
Boys,74.84,6,Cadence Shew,Tioga,70.49,133.81,77.11,136.08,347,Single-ply,SBD,M,
Boys,74.84,DQ,Jordan McGriff,Sherman,72.48,122.47,,,,Single-ply,SBD,M,
Boys,82.1,1,Jose Juarez #6,Gainesville,81.83,188.24,108.86,195.04,492.15,Single-ply,SBD,M,
Boys,82.1,2,Braylon Purvey,Gainesville,81.83,199.58,102.06,185.97,487.61,Single-ply,SBD,M,
Boys,82.1,3,Rickyt Mejia,Sanger,78.47,170.1,92.99,176.9,439.98,Single-ply,SBD,M,
Boys,82.1,4,Vitto Minarelli,Sherman,80.56,151.95,92.99,188.24,433.18,Single-ply,SBD,M,
Boys,82.1,5,John Okeri,Sherman,79.74,195.04,117.93,106.59,419.57,Single-ply,SBD,M,
Boys,82.1,6,Aidan Beukema,Sanger,79.47,147.42,83.91,151.95,383.29,Single-ply,SBD,M,
Boys,82.1,7,Angel Solorzano,Sherman,76.75,136.08,79.38,158.76,374.21,Single-ply,SBD,M,
Boys,89.81,1,Cason Serna,Tioga,85,158.76,99.79,163.29,421.84,Single-ply,SBD,M,
Boys,89.81,2,Michael Holt,Krum,86.45,131.54,95.25,161.03,387.82,Single-ply,SBD,M,
Boys,99.79,1,Michael Driggers,Sanger,91.9,254.01,129.27,226.8,610.08,Single-ply,SBD,M,
Boys,99.79,2,Carlos Vega,Gainesville,98.34,215.46,124.74,197.31,537.51,Single-ply,SBD,M,
Boys,99.79,3,Marshall Knowlton,Whitesboro,97.16,185.97,111.13,213.19,510.29,Single-ply,SBD,M,
Boys,99.79,4,Noah Williams,Krum,91.44,188.24,129.27,151.95,469.47,Single-ply,SBD,M,
Boys,99.79,5,Kevin Tran,Gainesville,90.45,183.7,102.06,170.1,455.86,Single-ply,SBD,M,
Boys,109.77,1,Connor Markham,Whitesboro,107.05,201.85,108.86,197.31,508.02,Single-ply,SBD,M,
Boys,109.77,2,Diego Hernandez,Gainesville,104.78,183.7,113.4,161.03,458.13,Single-ply,SBD,M,
Boys,109.77,3,Kyler Henegar,Lindsay,104.42,165.56,104.33,170.1,439.98,Single-ply,SBD,M,
Boys,109.77,4,Jacob Shadburn,Tioga,100.52,147.42,88.45,136.08,371.95,Single-ply,SBD,M,
Boys,109.77,5,Josiah Okeri,Sherman,106.32,122.47,81.65,138.35,342.46,Single-ply,SBD,M,
Boys,124.74,1,Kyle Carter,Krum,111.13,222.26,106.59,188.24,517.1,Single-ply,SBD,M,
Boys,124.74,2,Layton Morrow,Lindsay,110.77,195.04,104.33,183.7,483.08,Single-ply,SBD,M,
Boys,124.74,3,Jason Reyes,Gainesville,123.1,183.7,111.13,176.9,471.74,Single-ply,SBD,M,
Boys,124.74,4,Nate Kumler,Sherman,119.11,161.03,106.59,181.44,449.06,Single-ply,SBD,M,
Boys,124.74,5,Grayson Baker,Krum,112.94,138.35,83.91,136.08,358.34,Single-ply,SBD,M,
Boys,139.71,1,Gabe Rodgers,Sherman,137.62,127.01,81.65,145.15,353.8,Single-ply,SBD,M,
Boys,139.71+,DQ,Canyon Thomison,Sanger,145.6,,88.45,192.78,,Single-ply,SBD,M,
