[
{
  "model": "data_gathering.project",
  "pk": 1,
  "fields": {
    "name": "HTTPCLIENT",
    "title": "Apache HTTP Components Client",
    "description": "The Apache HttpComponents\u2122 project is responsible for creating and maintaining a toolset of low level Java components focused on HTTP and associated protocols.\r\nThis project functions under the Apache Software Foundation (http://www.apache.org), and is part of a larger community of developers and users.",
    "homepage": "https://hc.apache.org/index.html",
    "vcs_type": "GIT",
    "vcs_url": "git://git.apache.org/httpcomponents-client.git",
    "bugtracker_type": "JIRA",
    "bugtracker_url": "https://issues.apache.org/jira/browse/HTTPCLIENT/",
    "bugtracker_api_root": "https://issues.apache.org/jira/rest/api"
  }
},
{
  "model": "data_gathering.project",
  "pk": 2,
  "fields": {
    "name": "SPR",
    "title": "Spring Core",
    "description": "Spring web framework",
    "homepage": "http://projects.spring.io/spring-framework/",
    "vcs_type": "GIT",
    "vcs_url": "https://github.com/spring-projects/spring-framework.git",
    "bugtracker_type": "JIRA",
    "bugtracker_url": "https://jira.spring.io/browse/SPR/?selectedTab=com.atlassian.jira.jira-projects-plugin:summary-panel",
    "bugtracker_api_root": "https://jira.spring.io/rest/api"
  }
},
{
  "model": "data_gathering.project",
  "pk": 3,
  "fields": {
    "name": "language_tool",
    "title": "Language Tool",
    "description": "LanguageTool is an Open Source proofreading software for English, French, German, Polish, Russian, and more than 20 other languages. It finds many errors that a simple spell checker cannot detect.",
    "homepage": "https://github.com/languagetool-org/languagetool",
    "vcs_type": "GIT",
    "vcs_url": "https://github.com/languagetool-org/languagetool.git",
    "bugtracker_type": "GHUB",
    "bugtracker_url": "https://github.com/languagetool-org/languagetool/issues",
    "bugtracker_api_root": "https://github.com/languagetool-org/languagetool/issues"
  }
},
{
  "model": "data_gathering.project",
  "pk": 4,
  "fields": {
    "name": "LOG4J2",
    "title": "log4j",
    "description": "Logging for Java",
    "homepage": "https://logging.apache.org/log4j/2.x/index.html",
    "vcs_type": "GIT",
    "vcs_url": "https://git-wip-us.apache.org/repos/asf/logging-log4j2.git",
    "bugtracker_type": "JIRA",
    "bugtracker_url": "https://issues.apache.org/jira/browse/LOG4J2/?selectedTab=com.atlassian.jira.jira-projects-plugin:summary-panel",
    "bugtracker_api_root": "https://issues.apache.org/jira/rest/api"
  }
},
{
  "model": "data_gathering.project",
  "pk": 5,
  "fields": {
    "name": "OOZIE",
    "title": "Apache Oozie",
    "description": "Oozie is a workflow scheduler system to manage Apache Hadoop jobs.",
    "homepage": "http://oozie.apache.org/",
    "vcs_type": "GIT",
    "vcs_url": "git://git.apache.org/oozie.git",
    "bugtracker_type": "JIRA",
    "bugtracker_url": "https://issues.apache.org/jira/browse/OOZIE",
    "bugtracker_api_root": "https://issues.apache.org/jira/rest/api"
  }
},
{
  "model": "data_gathering.project",
  "pk": 6,
  "fields": {
    "name": "WINK",
    "title": "Apache Wink",
    "description": "Apache Wink is a simple yet solid framework for building RESTful Web services. It is comprised of a Server module and a Client module for developing and consuming RESTful Web services.",
    "homepage": "https://wink.apache.org/",
    "vcs_type": "GIT",
    "vcs_url": "git://git.apache.org/wink.git",
    "bugtracker_type": "JIRA",
    "bugtracker_url": "https://issues.apache.org/jira/browse/WINK/",
    "bugtracker_api_root": "https://issues.apache.org/jira/rest/api"
  }
},
{
  "model": "data_gathering.project",
  "pk": 7,
  "fields": {
    "name": "ALLURE",
    "title": "Apache Allure",
    "description": "Apache Allura is an open source implementation of a software forge, a web site that manages source code repositories, bug reports, discussions, wiki pages, blogs, and more for any number of individual projects. Read about all of Allura's features or compare features to other OSS forge software.",
    "homepage": "https://allura.apache.org/",
    "vcs_type": "GIT",
    "vcs_url": "git://git.apache.org/allura.git",
    "bugtracker_type": "JIRA",
    "bugtracker_url": "https://issues.apache.org/jira/browse/ALLURE/",
    "bugtracker_api_root": "https://issues.apache.org/jira/rest/api"
  }
},
{
  "model": "data_gathering.project",
  "pk": 8,
  "fields": {
    "name": "BOOKKEPPER",
    "title": "Apache Bookkeeper",
    "description": "BookKeeper is a replicated log service which can be used to build replicated state machines. A log contains a sequence of events which can be applied to a state machine. BookKeeper guarantees that each replica state machine will see all the same entries, in the same order.",
    "homepage": "http://bookkeeper.apache.org/",
    "vcs_type": "GIT",
    "vcs_url": "git://git.apache.org/bookkeeper.git",
    "bugtracker_type": "JIRA",
    "bugtracker_url": "https://issues.apache.org/jira/browse/BOOKKEEPER/",
    "bugtracker_api_root": "https://issues.apache.org/jira/rest/api"
  }
},
{
  "model": "data_gathering.projectversion",
  "pk": 1,
  "fields": {
    "project": 1,
    "self_url": "https://issues.apache.org/jira/rest/api/2/version/12311072",
    "self_id": "12311072",
    "description": "",
    "name": "1.0 Alpha",
    "git_tag": null,
    "git_sha": null
  }
},
{
  "model": "data_gathering.projectversion",
  "pk": 2,
  "fields": {
    "project": 1,
    "self_url": "https://issues.apache.org/jira/rest/api/2/version/12311073",
    "self_id": "12311073",
    "description": "",
    "name": "1.0 Beta 1",
    "git_tag": null,
    "git_sha": null
  }
},
{
  "model": "data_gathering.projectversion",
  "pk": 3,
  "fields": {
    "project": 1,
    "self_url": "https://issues.apache.org/jira/rest/api/2/version/12311074",
    "self_id": "12311074",
    "description": "",
    "name": "1.0 Beta 2",
    "git_tag": null,
    "git_sha": null
  }
},
{
  "model": "data_gathering.projectversion",
  "pk": 4,
  "fields": {
    "project": 1,
    "self_url": "https://issues.apache.org/jira/rest/api/2/version/12311075",
    "self_id": "12311075",
    "description": "",
    "name": "1.0 Final",
    "git_tag": null,
    "git_sha": null
  }
},
{
  "model": "data_gathering.projectversion",
  "pk": 5,
  "fields": {
    "project": 1,
    "self_url": "https://issues.apache.org/jira/rest/api/2/version/12311076",
    "self_id": "12311076",
    "description": "",
    "name": "1.2 Final",
    "git_tag": null,
    "git_sha": null
  }
},
{
  "model": "data_gathering.projectversion",
  "pk": 6,
  "fields": {
    "project": 1,
    "self_url": "https://issues.apache.org/jira/rest/api/2/version/12311077",
    "self_id": "12311077",
    "description": "",
    "name": "2.0 Milestone 1",
    "git_tag": null,
    "git_sha": null
  }
},
{
  "model": "data_gathering.projectversion",
  "pk": 7,
  "fields": {
    "project": 1,
    "self_url": "https://issues.apache.org/jira/rest/api/2/version/12311078",
    "self_id": "12311078",
    "description": "",
    "name": "2.0 Milestone 2",
    "git_tag": null,
    "git_sha": null
  }
},
{
  "model": "data_gathering.projectversion",
  "pk": 8,
  "fields": {
    "project": 1,
    "self_url": "https://issues.apache.org/jira/rest/api/2/version/12311079",
    "self_id": "12311079",
    "description": "",
    "name": "2.0 Alpha 1",
    "git_tag": null,
    "git_sha": null
  }
},
{
  "model": "data_gathering.projectversion",
  "pk": 9,
  "fields": {
    "project": 1,
    "self_url": "https://issues.apache.org/jira/rest/api/2/version/12311080",
    "self_id": "12311080",
    "description": "",
    "name": "2.0 Alpha 2",
    "git_tag": null,
    "git_sha": null
  }
},
{
  "model": "data_gathering.projectversion",
  "pk": 10,
  "fields": {
    "project": 1,
    "self_url": "https://issues.apache.org/jira/rest/api/2/version/12311081",
    "self_id": "12311081",
    "description": "",
    "name": "2.0 Alpha 3",
    "git_tag": null,
    "git_sha": null
  }
},
{
  "model": "data_gathering.projectversion",
  "pk": 11,
  "fields": {
    "project": 1,
    "self_url": "https://issues.apache.org/jira/rest/api/2/version/12311082",
    "self_id": "12311082",
    "description": "",
    "name": "2.0 Beta 1",
    "git_tag": null,
    "git_sha": null
  }
},
{
  "model": "data_gathering.projectversion",
  "pk": 12,
  "fields": {
    "project": 1,
    "self_url": "https://issues.apache.org/jira/rest/api/2/version/12311083",
    "self_id": "12311083",
    "description": "",
    "name": "2.0 Beta 2",
    "git_tag": null,
    "git_sha": null
  }
},
{
  "model": "data_gathering.projectversion",
  "pk": 13,
  "fields": {
    "project": 1,
    "self_url": "https://issues.apache.org/jira/rest/api/2/version/12311084",
    "self_id": "12311084",
    "description": "",
    "name": "2.0 Final",
    "git_tag": null,
    "git_sha": null
  }
},
{
  "model": "data_gathering.projectversion",
  "pk": 14,
  "fields": {
    "project": 1,
    "self_url": "https://issues.apache.org/jira/rest/api/2/version/12311085",
    "self_id": "12311085",
    "description": "",
    "name": "2.0.1",
    "git_tag": null,
    "git_sha": null
  }
},
{
  "model": "data_gathering.projectversion",
  "pk": 15,
  "fields": {
    "project": 1,
    "self_url": "https://issues.apache.org/jira/rest/api/2/version/12311086",
    "self_id": "12311086",
    "description": "",
    "name": "2.0.2",
    "git_tag": null,
    "git_sha": null
  }
},
{
  "model": "data_gathering.projectversion",
  "pk": 16,
  "fields": {
    "project": 1,
    "self_url": "https://issues.apache.org/jira/rest/api/2/version/12311087",
    "self_id": "12311087",
    "description": "",
    "name": "2.0.3",
    "git_tag": null,
    "git_sha": null
  }
},
{
  "model": "data_gathering.projectversion",
  "pk": 17,
  "fields": {
    "project": 1,
    "self_url": "https://issues.apache.org/jira/rest/api/2/version/12311089",
    "self_id": "12311089",
    "description": "",
    "name": "3.0 Alpha 1",
    "git_tag": null,
    "git_sha": null
  }
},
{
  "model": "data_gathering.projectversion",
  "pk": 18,
  "fields": {
    "project": 1,
    "self_url": "https://issues.apache.org/jira/rest/api/2/version/12311090",
    "self_id": "12311090",
    "description": "",
    "name": "3.0 Alpha 2",
    "git_tag": null,
    "git_sha": null
  }
},
{
  "model": "data_gathering.projectversion",
  "pk": 19,
  "fields": {
    "project": 1,
    "self_url": "https://issues.apache.org/jira/rest/api/2/version/12311091",
    "self_id": "12311091",
    "description": "",
    "name": "3.0 Beta 1",
    "git_tag": null,
    "git_sha": null
  }
},
{
  "model": "data_gathering.projectversion",
  "pk": 20,
  "fields": {
    "project": 1,
    "self_url": "https://issues.apache.org/jira/rest/api/2/version/12311095",
    "self_id": "12311095",
    "description": "",
    "name": "3.0 RC1",
    "git_tag": null,
    "git_sha": null
  }
},
{
  "model": "data_gathering.projectversion",
  "pk": 21,
  "fields": {
    "project": 1,
    "self_url": "https://issues.apache.org/jira/rest/api/2/version/12311096",
    "self_id": "12311096",
    "description": "",
    "name": "3.0 RC2",
    "git_tag": null,
    "git_sha": null
  }
},
{
  "model": "data_gathering.projectversion",
  "pk": 22,
  "fields": {
    "project": 1,
    "self_url": "https://issues.apache.org/jira/rest/api/2/version/12311097",
    "self_id": "12311097",
    "description": "",
    "name": "3.0 RC3",
    "git_tag": null,
    "git_sha": null
  }
},
{
  "model": "data_gathering.projectversion",
  "pk": 23,
  "fields": {
    "project": 1,
    "self_url": "https://issues.apache.org/jira/rest/api/2/version/12311098",
    "self_id": "12311098",
    "description": "",
    "name": "3.0 RC4",
    "git_tag": null,
    "git_sha": null
  }
},
{
  "model": "data_gathering.projectversion",
  "pk": 24,
  "fields": {
    "project": 1,
    "self_url": "https://issues.apache.org/jira/rest/api/2/version/12311093",
    "self_id": "12311093",
    "description": "",
    "name": "3.0 Final",
    "git_tag": null,
    "git_sha": null
  }
},
{
  "model": "data_gathering.projectversion",
  "pk": 25,
  "fields": {
    "project": 1,
    "self_url": "https://issues.apache.org/jira/rest/api/2/version/12311099",
    "self_id": "12311099",
    "description": "",
    "name": "3.0.1",
    "git_tag": null,
    "git_sha": null
  }
},
{
  "model": "data_gathering.projectversion",
  "pk": 26,
  "fields": {
    "project": 1,
    "self_url": "https://issues.apache.org/jira/rest/api/2/version/12311100",
    "self_id": "12311100",
    "description": "",
    "name": "3.1 Alpha 1",
    "git_tag": null,
    "git_sha": null
  }
},
{
  "model": "data_gathering.projectversion",
  "pk": 27,
  "fields": {
    "project": 1,
    "self_url": "https://issues.apache.org/jira/rest/api/2/version/12311101",
    "self_id": "12311101",
    "description": "",
    "name": "3.1 Beta 1",
    "git_tag": null,
    "git_sha": null
  }
},
{
  "model": "data_gathering.projectversion",
  "pk": 28,
  "fields": {
    "project": 1,
    "self_url": "https://issues.apache.org/jira/rest/api/2/version/12311104",
    "self_id": "12311104",
    "description": "",
    "name": "3.1 RC1",
    "git_tag": null,
    "git_sha": null
  }
},
{
  "model": "data_gathering.projectversion",
  "pk": 29,
  "fields": {
    "project": 1,
    "self_url": "https://issues.apache.org/jira/rest/api/2/version/12311646",
    "self_id": "12311646",
    "description": "",
    "name": "4.0 Alpha 1",
    "git_tag": null,
    "git_sha": null
  }
},
{
  "model": "data_gathering.projectversion",
  "pk": 30,
  "fields": {
    "project": 1,
    "self_url": "https://issues.apache.org/jira/rest/api/2/version/12312326",
    "self_id": "12312326",
    "description": "",
    "name": "3.1 (end of life)",
    "git_tag": null,
    "git_sha": null
  }
},
{
  "model": "data_gathering.projectversion",
  "pk": 31,
  "fields": {
    "project": 1,
    "self_url": "https://issues.apache.org/jira/rest/api/2/version/12312475",
    "self_id": "12312475",
    "description": "",
    "name": "4.0 Alpha 2",
    "git_tag": null,
    "git_sha": null
  }
},
{
  "model": "data_gathering.projectversion",
  "pk": 32,
  "fields": {
    "project": 1,
    "self_url": "https://issues.apache.org/jira/rest/api/2/version/12312697",
    "self_id": "12312697",
    "description": "",
    "name": "4.0 Alpha 3",
    "git_tag": null,
    "git_sha": null
  }
},
{
  "model": "data_gathering.projectversion",
  "pk": 33,
  "fields": {
    "project": 1,
    "self_url": "https://issues.apache.org/jira/rest/api/2/version/12312951",
    "self_id": "12312951",
    "description": "",
    "name": "4.0 Alpha 4",
    "git_tag": null,
    "git_sha": null
  }
},
{
  "model": "data_gathering.projectversion",
  "pk": 34,
  "fields": {
    "project": 1,
    "self_url": "https://issues.apache.org/jira/rest/api/2/version/12312890",
    "self_id": "12312890",
    "description": "",
    "name": "3.1.1",
    "git_tag": null,
    "git_sha": null
  }
},
{
  "model": "data_gathering.projectversion",
  "pk": 35,
  "fields": {
    "project": 1,
    "self_url": "https://issues.apache.org/jira/rest/api/2/version/12312451",
    "self_id": "12312451",
    "description": "",
    "name": "4.0 Beta 1",
    "git_tag": null,
    "git_sha": null
  }
},
{
  "model": "data_gathering.projectversion",
  "pk": 36,
  "fields": {
    "project": 1,
    "self_url": "https://issues.apache.org/jira/rest/api/2/version/12313164",
    "self_id": "12313164",
    "description": "",
    "name": "4.0 Beta 2",
    "git_tag": null,
    "git_sha": null
  }
},
{
  "model": "data_gathering.projectversion",
  "pk": 37,
  "fields": {
    "project": 1,
    "self_url": "https://issues.apache.org/jira/rest/api/2/version/12311094",
    "self_id": "12311094",
    "description": "",
    "name": "4.0 Final",
    "git_tag": null,
    "git_sha": null
  }
},
{
  "model": "data_gathering.projectversion",
  "pk": 38,
  "fields": {
    "project": 1,
    "self_url": "https://issues.apache.org/jira/rest/api/2/version/12313464",
    "self_id": "12313464",
    "description": "",
    "name": "4.0.1",
    "git_tag": null,
    "git_sha": null
  }
},
{
  "model": "data_gathering.projectversion",
  "pk": 39,
  "fields": {
    "project": 1,
    "self_url": "https://issues.apache.org/jira/rest/api/2/version/12315132",
    "self_id": "12315132",
    "description": "",
    "name": "4.0.2",
    "git_tag": null,
    "git_sha": null
  }
},
{
  "model": "data_gathering.projectversion",
  "pk": 40,
  "fields": {
    "project": 1,
    "self_url": "https://issues.apache.org/jira/rest/api/2/version/12315341",
    "self_id": "12315341",
    "description": "",
    "name": "4.0.3",
    "git_tag": null,
    "git_sha": null
  }
},
{
  "model": "data_gathering.projectversion",
  "pk": 41,
  "fields": {
    "project": 1,
    "self_url": "https://issues.apache.org/jira/rest/api/2/version/12314319",
    "self_id": "12314319",
    "description": "",
    "name": "4.1 Alpha1",
    "git_tag": null,
    "git_sha": null
  }
},
{
  "model": "data_gathering.projectversion",
  "pk": 42,
  "fields": {
    "project": 1,
    "self_url": "https://issues.apache.org/jira/rest/api/2/version/12314454",
    "self_id": "12314454",
    "description": "",
    "name": "4.1 Alpha2",
    "git_tag": null,
    "git_sha": null
  }
},
{
  "model": "data_gathering.projectversion",
  "pk": 43,
  "fields": {
    "project": 1,
    "self_url": "https://issues.apache.org/jira/rest/api/2/version/12315559",
    "self_id": "12315559",
    "description": "",
    "name": "4.1 Beta1",
    "git_tag": null,
    "git_sha": null
  }
},
{
  "model": "data_gathering.projectversion",
  "pk": 44,
  "fields": {
    "project": 1,
    "self_url": "https://issues.apache.org/jira/rest/api/2/version/12313467",
    "self_id": "12313467",
    "description": "",
    "name": "4.1 Final",
    "git_tag": null,
    "git_sha": null
  }
},
{
  "model": "data_gathering.projectversion",
  "pk": 45,
  "fields": {
    "project": 1,
    "self_url": "https://issues.apache.org/jira/rest/api/2/version/12316282",
    "self_id": "12316282",
    "description": "",
    "name": "4.1.1",
    "git_tag": null,
    "git_sha": null
  }
},
{
  "model": "data_gathering.projectversion",
  "pk": 46,
  "fields": {
    "project": 1,
    "self_url": "https://issues.apache.org/jira/rest/api/2/version/12316314",
    "self_id": "12316314",
    "description": "",
    "name": "4.1.2",
    "git_tag": null,
    "git_sha": null
  }
},
{
  "model": "data_gathering.projectversion",
  "pk": 47,
  "fields": {
    "project": 1,
    "self_url": "https://issues.apache.org/jira/rest/api/2/version/12317840",
    "self_id": "12317840",
    "description": "",
    "name": "4.1.3",
    "git_tag": null,
    "git_sha": null
  }
},
{
  "model": "data_gathering.projectversion",
  "pk": 48,
  "fields": {
    "project": 1,
    "self_url": "https://issues.apache.org/jira/rest/api/2/version/12316315",
    "self_id": "12316315",
    "description": "",
    "name": "4.2 Alpha1",
    "git_tag": null,
    "git_sha": null
  }
},
{
  "model": "data_gathering.projectversion",
  "pk": 49,
  "fields": {
    "project": 1,
    "self_url": "https://issues.apache.org/jira/rest/api/2/version/12318879",
    "self_id": "12318879",
    "description": "",
    "name": "4.2 Beta1",
    "git_tag": null,
    "git_sha": null
  }
},
{
  "model": "data_gathering.projectversion",
  "pk": 50,
  "fields": {
    "project": 1,
    "self_url": "https://issues.apache.org/jira/rest/api/2/version/12316086",
    "self_id": "12316086",
    "description": "",
    "name": "4.2 Final",
    "git_tag": null,
    "git_sha": null
  }
},
{
  "model": "data_gathering.projectversion",
  "pk": 51,
  "fields": {
    "project": 1,
    "self_url": "https://issues.apache.org/jira/rest/api/2/version/12321641",
    "self_id": "12321641",
    "description": "",
    "name": "4.2.1",
    "git_tag": null,
    "git_sha": null
  }
},
{
  "model": "data_gathering.projectversion",
  "pk": 52,
  "fields": {
    "project": 1,
    "self_url": "https://issues.apache.org/jira/rest/api/2/version/12322040",
    "self_id": "12322040",
    "description": "",
    "name": "4.2.2",
    "git_tag": null,
    "git_sha": null
  }
},
{
  "model": "data_gathering.projectversion",
  "pk": 53,
  "fields": {
    "project": 1,
    "self_url": "https://issues.apache.org/jira/rest/api/2/version/12323445",
    "self_id": "12323445",
    "description": "",
    "name": "4.2.3",
    "git_tag": null,
    "git_sha": null
  }
},
{
  "model": "data_gathering.projectversion",
  "pk": 54,
  "fields": {
    "project": 1,
    "self_url": "https://issues.apache.org/jira/rest/api/2/version/12323961",
    "self_id": "12323961",
    "description": "",
    "name": "4.2.4",
    "git_tag": null,
    "git_sha": null
  }
},
{
  "model": "data_gathering.projectversion",
  "pk": 55,
  "fields": {
    "project": 1,
    "self_url": "https://issues.apache.org/jira/rest/api/2/version/12324314",
    "self_id": "12324314",
    "description": "",
    "name": "4.2.5",
    "git_tag": null,
    "git_sha": null
  }
},
{
  "model": "data_gathering.projectversion",
  "pk": 56,
  "fields": {
    "project": 1,
    "self_url": "https://issues.apache.org/jira/rest/api/2/version/12324353",
    "self_id": "12324353",
    "description": "",
    "name": "4.2.6",
    "git_tag": null,
    "git_sha": null
  }
},
{
  "model": "data_gathering.projectversion",
  "pk": 57,
  "fields": {
    "project": 1,
    "self_url": "https://issues.apache.org/jira/rest/api/2/version/12322477",
    "self_id": "12322477",
    "description": "",
    "name": "4.3 Alpha1",
    "git_tag": null,
    "git_sha": null
  }
},
{
  "model": "data_gathering.projectversion",
  "pk": 58,
  "fields": {
    "project": 1,
    "self_url": "https://issues.apache.org/jira/rest/api/2/version/12323951",
    "self_id": "12323951",
    "description": "",
    "name": "4.3 Beta1",
    "git_tag": null,
    "git_sha": null
  }
},
{
  "model": "data_gathering.projectversion",
  "pk": 59,
  "fields": {
    "project": 1,
    "self_url": "https://issues.apache.org/jira/rest/api/2/version/12324304",
    "self_id": "12324304",
    "description": "",
    "name": "4.3 Beta2",
    "git_tag": null,
    "git_sha": null
  }
},
{
  "model": "data_gathering.projectversion",
  "pk": 60,
  "fields": {
    "project": 1,
    "self_url": "https://issues.apache.org/jira/rest/api/2/version/12321280",
    "self_id": "12321280",
    "description": "",
    "name": "4.3 Final",
    "git_tag": null,
    "git_sha": null
  }
},
{
  "model": "data_gathering.projectversion",
  "pk": 61,
  "fields": {
    "project": 1,
    "self_url": "https://issues.apache.org/jira/rest/api/2/version/12324957",
    "self_id": "12324957",
    "description": "",
    "name": "4.3.1",
    "git_tag": null,
    "git_sha": null
  }
},
{
  "model": "data_gathering.projectversion",
  "pk": 62,
  "fields": {
    "project": 1,
    "self_url": "https://issues.apache.org/jira/rest/api/2/version/12325245",
    "self_id": "12325245",
    "description": "",
    "name": "4.3.2",
    "git_tag": null,
    "git_sha": null
  }
},
{
  "model": "data_gathering.projectversion",
  "pk": 63,
  "fields": {
    "project": 1,
    "self_url": "https://issues.apache.org/jira/rest/api/2/version/12325945",
    "self_id": "12325945",
    "description": "",
    "name": "4.3.3",
    "git_tag": null,
    "git_sha": null
  }
},
{
  "model": "data_gathering.projectversion",
  "pk": 64,
  "fields": {
    "project": 1,
    "self_url": "https://issues.apache.org/jira/rest/api/2/version/12326286",
    "self_id": "12326286",
    "description": "",
    "name": "4.3.4",
    "git_tag": null,
    "git_sha": null
  }
},
{
  "model": "data_gathering.projectversion",
  "pk": 65,
  "fields": {
    "project": 1,
    "self_url": "https://issues.apache.org/jira/rest/api/2/version/12327068",
    "self_id": "12327068",
    "description": "",
    "name": "4.3.5",
    "git_tag": null,
    "git_sha": null
  }
},
{
  "model": "data_gathering.projectversion",
  "pk": 66,
  "fields": {
    "project": 1,
    "self_url": "https://issues.apache.org/jira/rest/api/2/version/12328675",
    "self_id": "12328675",
    "description": "",
    "name": "4.3.5.1-android",
    "git_tag": null,
    "git_sha": null
  }
},
{
  "model": "data_gathering.projectversion",
  "pk": 67,
  "fields": {
    "project": 1,
    "self_url": "https://issues.apache.org/jira/rest/api/2/version/12327489",
    "self_id": "12327489",
    "description": "",
    "name": "4.3.6",
    "git_tag": null,
    "git_sha": null
  }
},
{
  "model": "data_gathering.projectversion",
  "pk": 68,
  "fields": {
    "project": 1,
    "self_url": "https://issues.apache.org/jira/rest/api/2/version/12325946",
    "self_id": "12325946",
    "description": "",
    "name": "4.4 Alpha1",
    "git_tag": null,
    "git_sha": null
  }
},
{
  "model": "data_gathering.projectversion",
  "pk": 69,
  "fields": {
    "project": 1,
    "self_url": "https://issues.apache.org/jira/rest/api/2/version/12327185",
    "self_id": "12327185",
    "description": "",
    "name": "4.4 Beta1",
    "git_tag": null,
    "git_sha": null
  }
},
{
  "model": "data_gathering.projectversion",
  "pk": 70,
  "fields": {
    "project": 1,
    "self_url": "https://issues.apache.org/jira/rest/api/2/version/12324872",
    "self_id": "12324872",
    "description": "",
    "name": "4.4 Final",
    "git_tag": null,
    "git_sha": null
  }
},
{
  "model": "data_gathering.projectversion",
  "pk": 71,
  "fields": {
    "project": 1,
    "self_url": "https://issues.apache.org/jira/rest/api/2/version/12329394",
    "self_id": "12329394",
    "description": "",
    "name": "4.4.1",
    "git_tag": null,
    "git_sha": null
  }
},
{
  "model": "data_gathering.projectversion",
  "pk": 72,
  "fields": {
    "project": 1,
    "self_url": "https://issues.apache.org/jira/rest/api/2/version/12329460",
    "self_id": "12329460",
    "description": "",
    "name": "4.5",
    "git_tag": null,
    "git_sha": null
  }
},
{
  "model": "data_gathering.projectversion",
  "pk": 73,
  "fields": {
    "project": 1,
    "self_url": "https://issues.apache.org/jira/rest/api/2/version/12332644",
    "self_id": "12332644",
    "description": "",
    "name": "4.5.1",
    "git_tag": null,
    "git_sha": null
  }
},
{
  "model": "data_gathering.projectversion",
  "pk": 74,
  "fields": {
    "project": 1,
    "self_url": "https://issues.apache.org/jira/rest/api/2/version/12333642",
    "self_id": "12333642",
    "description": "",
    "name": "4.5.2",
    "git_tag": null,
    "git_sha": null
  }
},
{
  "model": "data_gathering.projectversion",
  "pk": 75,
  "fields": {
    "project": 1,
    "self_url": "https://issues.apache.org/jira/rest/api/2/version/12334963",
    "self_id": "12334963",
    "description": "",
    "name": "4.5.3",
    "git_tag": null,
    "git_sha": null
  }
},
{
  "model": "data_gathering.projectversion",
  "pk": 76,
  "fields": {
    "project": 1,
    "self_url": "https://issues.apache.org/jira/rest/api/2/version/12339242",
    "self_id": "12339242",
    "description": "",
    "name": "4.5.4",
    "git_tag": null,
    "git_sha": null
  }
},
{
  "model": "data_gathering.projectversion",
  "pk": 77,
  "fields": {
    "project": 1,
    "self_url": "https://issues.apache.org/jira/rest/api/2/version/12340235",
    "self_id": "12340235",
    "description": "",
    "name": "4.6 Alpha1",
    "git_tag": null,
    "git_sha": null
  }
},
{
  "model": "data_gathering.projectversion",
  "pk": 78,
  "fields": {
    "project": 1,
    "self_url": "https://issues.apache.org/jira/rest/api/2/version/12334684",
    "self_id": "12334684",
    "description": "",
    "name": "5.0 Alpha1",
    "git_tag": null,
    "git_sha": null
  }
},
{
  "model": "data_gathering.projectversion",
  "pk": 79,
  "fields": {
    "project": 1,
    "self_url": "https://issues.apache.org/jira/rest/api/2/version/12334685",
    "self_id": "12334685",
    "description": "",
    "name": "5.0 Alpha2",
    "git_tag": null,
    "git_sha": null
  }
},
{
  "model": "data_gathering.projectversion",
  "pk": 80,
  "fields": {
    "project": 1,
    "self_url": "https://issues.apache.org/jira/rest/api/2/version/12339243",
    "self_id": "12339243",
    "description": "",
    "name": "5.0 Alpha3",
    "git_tag": null,
    "git_sha": null
  }
},
{
  "model": "data_gathering.projectversion",
  "pk": 81,
  "fields": {
    "project": 1,
    "self_url": "https://issues.apache.org/jira/rest/api/2/version/12327109",
    "self_id": "12327109",
    "description": "",
    "name": "5.0",
    "git_tag": null,
    "git_sha": null
  }
},
{
  "model": "data_gathering.projectversion",
  "pk": 82,
  "fields": {
    "project": 1,
    "self_url": "https://issues.apache.org/jira/rest/api/2/version/12312298",
    "self_id": "12312298",
    "description": "",
    "name": "Future",
    "git_tag": null,
    "git_sha": null
  }
},
{
  "model": "data_gathering.projectversion",
  "pk": 83,
  "fields": {
    "project": 1,
    "self_url": "https://issues.apache.org/jira/rest/api/2/version/12311071",
    "self_id": "12311071",
    "description": "",
    "name": "Snapshot",
    "git_tag": null,
    "git_sha": null
  }
},
{
  "model": "data_gathering.projectversion",
  "pk": 84,
  "fields": {
    "project": 1,
    "self_url": "https://issues.apache.org/jira/rest/api/2/version/12340486",
    "self_id": "12340486",
    "description": "",
    "name": "Stuck",
    "git_tag": null,
    "git_sha": null
  }
},
{
  "model": "data_gathering.projectversion",
  "pk": 85,
  "fields": {
    "project": 1,
    "self_url": "https://issues.apache.org/jira/rest/api/2/version/12311072",
    "self_id": "12311072",
    "description": "",
    "name": "1.0 Alpha",
    "git_tag": null,
    "git_sha": null
  }
},
{
  "model": "data_gathering.projectversion",
  "pk": 86,
  "fields": {
    "project": 1,
    "self_url": "https://issues.apache.org/jira/rest/api/2/version/12311073",
    "self_id": "12311073",
    "description": "",
    "name": "1.0 Beta 1",
    "git_tag": null,
    "git_sha": null
  }
},
{
  "model": "data_gathering.projectversion",
  "pk": 87,
  "fields": {
    "project": 1,
    "self_url": "https://issues.apache.org/jira/rest/api/2/version/12311074",
    "self_id": "12311074",
    "description": "",
    "name": "1.0 Beta 2",
    "git_tag": null,
    "git_sha": null
  }
},
{
  "model": "data_gathering.projectversion",
  "pk": 88,
  "fields": {
    "project": 1,
    "self_url": "https://issues.apache.org/jira/rest/api/2/version/12311075",
    "self_id": "12311075",
    "description": "",
    "name": "1.0 Final",
    "git_tag": null,
    "git_sha": null
  }
},
{
  "model": "data_gathering.projectversion",
  "pk": 89,
  "fields": {
    "project": 1,
    "self_url": "https://issues.apache.org/jira/rest/api/2/version/12311076",
    "self_id": "12311076",
    "description": "",
    "name": "1.2 Final",
    "git_tag": null,
    "git_sha": null
  }
},
{
  "model": "data_gathering.projectversion",
  "pk": 90,
  "fields": {
    "project": 1,
    "self_url": "https://issues.apache.org/jira/rest/api/2/version/12311077",
    "self_id": "12311077",
    "description": "",
    "name": "2.0 Milestone 1",
    "git_tag": null,
    "git_sha": null
  }
},
{
  "model": "data_gathering.projectversion",
  "pk": 91,
  "fields": {
    "project": 1,
    "self_url": "https://issues.apache.org/jira/rest/api/2/version/12311078",
    "self_id": "12311078",
    "description": "",
    "name": "2.0 Milestone 2",
    "git_tag": null,
    "git_sha": null
  }
},
{
  "model": "data_gathering.projectversion",
  "pk": 92,
  "fields": {
    "project": 1,
    "self_url": "https://issues.apache.org/jira/rest/api/2/version/12311079",
    "self_id": "12311079",
    "description": "",
    "name": "2.0 Alpha 1",
    "git_tag": null,
    "git_sha": null
  }
},
{
  "model": "data_gathering.projectversion",
  "pk": 93,
  "fields": {
    "project": 1,
    "self_url": "https://issues.apache.org/jira/rest/api/2/version/12311080",
    "self_id": "12311080",
    "description": "",
    "name": "2.0 Alpha 2",
    "git_tag": null,
    "git_sha": null
  }
},
{
  "model": "data_gathering.projectversion",
  "pk": 94,
  "fields": {
    "project": 1,
    "self_url": "https://issues.apache.org/jira/rest/api/2/version/12311081",
    "self_id": "12311081",
    "description": "",
    "name": "2.0 Alpha 3",
    "git_tag": null,
    "git_sha": null
  }
},
{
  "model": "data_gathering.projectversion",
  "pk": 95,
  "fields": {
    "project": 1,
    "self_url": "https://issues.apache.org/jira/rest/api/2/version/12311082",
    "self_id": "12311082",
    "description": "",
    "name": "2.0 Beta 1",
    "git_tag": null,
    "git_sha": null
  }
},
{
  "model": "data_gathering.projectversion",
  "pk": 96,
  "fields": {
    "project": 1,
    "self_url": "https://issues.apache.org/jira/rest/api/2/version/12311083",
    "self_id": "12311083",
    "description": "",
    "name": "2.0 Beta 2",
    "git_tag": null,
    "git_sha": null
  }
},
{
  "model": "data_gathering.projectversion",
  "pk": 97,
  "fields": {
    "project": 1,
    "self_url": "https://issues.apache.org/jira/rest/api/2/version/12311084",
    "self_id": "12311084",
    "description": "",
    "name": "2.0 Final",
    "git_tag": null,
    "git_sha": null
  }
},
{
  "model": "data_gathering.projectversion",
  "pk": 98,
  "fields": {
    "project": 1,
    "self_url": "https://issues.apache.org/jira/rest/api/2/version/12311085",
    "self_id": "12311085",
    "description": "",
    "name": "2.0.1",
    "git_tag": null,
    "git_sha": null
  }
},
{
  "model": "data_gathering.projectversion",
  "pk": 99,
  "fields": {
    "project": 1,
    "self_url": "https://issues.apache.org/jira/rest/api/2/version/12311086",
    "self_id": "12311086",
    "description": "",
    "name": "2.0.2",
    "git_tag": null,
    "git_sha": null
  }
},
{
  "model": "data_gathering.projectversion",
  "pk": 100,
  "fields": {
    "project": 1,
    "self_url": "https://issues.apache.org/jira/rest/api/2/version/12311087",
    "self_id": "12311087",
    "description": "",
    "name": "2.0.3",
    "git_tag": null,
    "git_sha": null
  }
},
{
  "model": "data_gathering.projectversion",
  "pk": 101,
  "fields": {
    "project": 1,
    "self_url": "https://issues.apache.org/jira/rest/api/2/version/12311089",
    "self_id": "12311089",
    "description": "",
    "name": "3.0 Alpha 1",
    "git_tag": null,
    "git_sha": null
  }
},
{
  "model": "data_gathering.projectversion",
  "pk": 102,
  "fields": {
    "project": 1,
    "self_url": "https://issues.apache.org/jira/rest/api/2/version/12311090",
    "self_id": "12311090",
    "description": "",
    "name": "3.0 Alpha 2",
    "git_tag": null,
    "git_sha": null
  }
},
{
  "model": "data_gathering.projectversion",
  "pk": 103,
  "fields": {
    "project": 1,
    "self_url": "https://issues.apache.org/jira/rest/api/2/version/12311091",
    "self_id": "12311091",
    "description": "",
    "name": "3.0 Beta 1",
    "git_tag": null,
    "git_sha": null
  }
},
{
  "model": "data_gathering.projectversion",
  "pk": 104,
  "fields": {
    "project": 1,
    "self_url": "https://issues.apache.org/jira/rest/api/2/version/12311095",
    "self_id": "12311095",
    "description": "",
    "name": "3.0 RC1",
    "git_tag": null,
    "git_sha": null
  }
},
{
  "model": "data_gathering.projectversion",
  "pk": 105,
  "fields": {
    "project": 1,
    "self_url": "https://issues.apache.org/jira/rest/api/2/version/12311096",
    "self_id": "12311096",
    "description": "",
    "name": "3.0 RC2",
    "git_tag": null,
    "git_sha": null
  }
},
{
  "model": "data_gathering.projectversion",
  "pk": 106,
  "fields": {
    "project": 1,
    "self_url": "https://issues.apache.org/jira/rest/api/2/version/12311097",
    "self_id": "12311097",
    "description": "",
    "name": "3.0 RC3",
    "git_tag": null,
    "git_sha": null
  }
},
{
  "model": "data_gathering.projectversion",
  "pk": 107,
  "fields": {
    "project": 1,
    "self_url": "https://issues.apache.org/jira/rest/api/2/version/12311098",
    "self_id": "12311098",
    "description": "",
    "name": "3.0 RC4",
    "git_tag": null,
    "git_sha": null
  }
},
{
  "model": "data_gathering.projectversion",
  "pk": 108,
  "fields": {
    "project": 1,
    "self_url": "https://issues.apache.org/jira/rest/api/2/version/12311093",
    "self_id": "12311093",
    "description": "",
    "name": "3.0 Final",
    "git_tag": null,
    "git_sha": null
  }
},
{
  "model": "data_gathering.projectversion",
  "pk": 109,
  "fields": {
    "project": 1,
    "self_url": "https://issues.apache.org/jira/rest/api/2/version/12311099",
    "self_id": "12311099",
    "description": "",
    "name": "3.0.1",
    "git_tag": null,
    "git_sha": null
  }
},
{
  "model": "data_gathering.projectversion",
  "pk": 110,
  "fields": {
    "project": 1,
    "self_url": "https://issues.apache.org/jira/rest/api/2/version/12311100",
    "self_id": "12311100",
    "description": "",
    "name": "3.1 Alpha 1",
    "git_tag": null,
    "git_sha": null
  }
},
{
  "model": "data_gathering.projectversion",
  "pk": 111,
  "fields": {
    "project": 1,
    "self_url": "https://issues.apache.org/jira/rest/api/2/version/12311101",
    "self_id": "12311101",
    "description": "",
    "name": "3.1 Beta 1",
    "git_tag": null,
    "git_sha": null
  }
},
{
  "model": "data_gathering.projectversion",
  "pk": 112,
  "fields": {
    "project": 1,
    "self_url": "https://issues.apache.org/jira/rest/api/2/version/12311104",
    "self_id": "12311104",
    "description": "",
    "name": "3.1 RC1",
    "git_tag": null,
    "git_sha": null
  }
},
{
  "model": "data_gathering.projectversion",
  "pk": 113,
  "fields": {
    "project": 1,
    "self_url": "https://issues.apache.org/jira/rest/api/2/version/12311646",
    "self_id": "12311646",
    "description": "",
    "name": "4.0 Alpha 1",
    "git_tag": null,
    "git_sha": null
  }
},
{
  "model": "data_gathering.projectversion",
  "pk": 114,
  "fields": {
    "project": 1,
    "self_url": "https://issues.apache.org/jira/rest/api/2/version/12312326",
    "self_id": "12312326",
    "description": "",
    "name": "3.1 (end of life)",
    "git_tag": null,
    "git_sha": null
  }
},
{
  "model": "data_gathering.projectversion",
  "pk": 115,
  "fields": {
    "project": 1,
    "self_url": "https://issues.apache.org/jira/rest/api/2/version/12312475",
    "self_id": "12312475",
    "description": "",
    "name": "4.0 Alpha 2",
    "git_tag": null,
    "git_sha": null
  }
},
{
  "model": "data_gathering.projectversion",
  "pk": 116,
  "fields": {
    "project": 1,
    "self_url": "https://issues.apache.org/jira/rest/api/2/version/12312697",
    "self_id": "12312697",
    "description": "",
    "name": "4.0 Alpha 3",
    "git_tag": null,
    "git_sha": null
  }
},
{
  "model": "data_gathering.projectversion",
  "pk": 117,
  "fields": {
    "project": 1,
    "self_url": "https://issues.apache.org/jira/rest/api/2/version/12312951",
    "self_id": "12312951",
    "description": "",
    "name": "4.0 Alpha 4",
    "git_tag": null,
    "git_sha": null
  }
},
{
  "model": "data_gathering.projectversion",
  "pk": 118,
  "fields": {
    "project": 1,
    "self_url": "https://issues.apache.org/jira/rest/api/2/version/12312890",
    "self_id": "12312890",
    "description": "",
    "name": "3.1.1",
    "git_tag": null,
    "git_sha": null
  }
},
{
  "model": "data_gathering.projectversion",
  "pk": 119,
  "fields": {
    "project": 1,
    "self_url": "https://issues.apache.org/jira/rest/api/2/version/12312451",
    "self_id": "12312451",
    "description": "",
    "name": "4.0 Beta 1",
    "git_tag": null,
    "git_sha": null
  }
},
{
  "model": "data_gathering.projectversion",
  "pk": 120,
  "fields": {
    "project": 1,
    "self_url": "https://issues.apache.org/jira/rest/api/2/version/12313164",
    "self_id": "12313164",
    "description": "",
    "name": "4.0 Beta 2",
    "git_tag": null,
    "git_sha": null
  }
},
{
  "model": "data_gathering.projectversion",
  "pk": 121,
  "fields": {
    "project": 1,
    "self_url": "https://issues.apache.org/jira/rest/api/2/version/12311094",
    "self_id": "12311094",
    "description": "",
    "name": "4.0 Final",
    "git_tag": null,
    "git_sha": null
  }
},
{
  "model": "data_gathering.projectversion",
  "pk": 122,
  "fields": {
    "project": 1,
    "self_url": "https://issues.apache.org/jira/rest/api/2/version/12313464",
    "self_id": "12313464",
    "description": "",
    "name": "4.0.1",
    "git_tag": null,
    "git_sha": null
  }
},
{
  "model": "data_gathering.projectversion",
  "pk": 123,
  "fields": {
    "project": 1,
    "self_url": "https://issues.apache.org/jira/rest/api/2/version/12315132",
    "self_id": "12315132",
    "description": "",
    "name": "4.0.2",
    "git_tag": null,
    "git_sha": null
  }
},
{
  "model": "data_gathering.projectversion",
  "pk": 124,
  "fields": {
    "project": 1,
    "self_url": "https://issues.apache.org/jira/rest/api/2/version/12315341",
    "self_id": "12315341",
    "description": "",
    "name": "4.0.3",
    "git_tag": null,
    "git_sha": null
  }
},
{
  "model": "data_gathering.projectversion",
  "pk": 125,
  "fields": {
    "project": 1,
    "self_url": "https://issues.apache.org/jira/rest/api/2/version/12314319",
    "self_id": "12314319",
    "description": "",
    "name": "4.1 Alpha1",
    "git_tag": null,
    "git_sha": null
  }
},
{
  "model": "data_gathering.projectversion",
  "pk": 126,
  "fields": {
    "project": 1,
    "self_url": "https://issues.apache.org/jira/rest/api/2/version/12314454",
    "self_id": "12314454",
    "description": "",
    "name": "4.1 Alpha2",
    "git_tag": null,
    "git_sha": null
  }
},
{
  "model": "data_gathering.projectversion",
  "pk": 127,
  "fields": {
    "project": 1,
    "self_url": "https://issues.apache.org/jira/rest/api/2/version/12315559",
    "self_id": "12315559",
    "description": "",
    "name": "4.1 Beta1",
    "git_tag": null,
    "git_sha": null
  }
},
{
  "model": "data_gathering.projectversion",
  "pk": 128,
  "fields": {
    "project": 1,
    "self_url": "https://issues.apache.org/jira/rest/api/2/version/12313467",
    "self_id": "12313467",
    "description": "",
    "name": "4.1 Final",
    "git_tag": null,
    "git_sha": null
  }
},
{
  "model": "data_gathering.projectversion",
  "pk": 129,
  "fields": {
    "project": 1,
    "self_url": "https://issues.apache.org/jira/rest/api/2/version/12316282",
    "self_id": "12316282",
    "description": "",
    "name": "4.1.1",
    "git_tag": null,
    "git_sha": null
  }
},
{
  "model": "data_gathering.projectversion",
  "pk": 130,
  "fields": {
    "project": 1,
    "self_url": "https://issues.apache.org/jira/rest/api/2/version/12316314",
    "self_id": "12316314",
    "description": "",
    "name": "4.1.2",
    "git_tag": null,
    "git_sha": null
  }
},
{
  "model": "data_gathering.projectversion",
  "pk": 131,
  "fields": {
    "project": 1,
    "self_url": "https://issues.apache.org/jira/rest/api/2/version/12317840",
    "self_id": "12317840",
    "description": "",
    "name": "4.1.3",
    "git_tag": null,
    "git_sha": null
  }
},
{
  "model": "data_gathering.projectversion",
  "pk": 132,
  "fields": {
    "project": 1,
    "self_url": "https://issues.apache.org/jira/rest/api/2/version/12316315",
    "self_id": "12316315",
    "description": "",
    "name": "4.2 Alpha1",
    "git_tag": null,
    "git_sha": null
  }
},
{
  "model": "data_gathering.projectversion",
  "pk": 133,
  "fields": {
    "project": 1,
    "self_url": "https://issues.apache.org/jira/rest/api/2/version/12318879",
    "self_id": "12318879",
    "description": "",
    "name": "4.2 Beta1",
    "git_tag": null,
    "git_sha": null
  }
},
{
  "model": "data_gathering.projectversion",
  "pk": 134,
  "fields": {
    "project": 1,
    "self_url": "https://issues.apache.org/jira/rest/api/2/version/12316086",
    "self_id": "12316086",
    "description": "",
    "name": "4.2 Final",
    "git_tag": null,
    "git_sha": null
  }
},
{
  "model": "data_gathering.projectversion",
  "pk": 135,
  "fields": {
    "project": 1,
    "self_url": "https://issues.apache.org/jira/rest/api/2/version/12321641",
    "self_id": "12321641",
    "description": "",
    "name": "4.2.1",
    "git_tag": null,
    "git_sha": null
  }
},
{
  "model": "data_gathering.projectversion",
  "pk": 136,
  "fields": {
    "project": 1,
    "self_url": "https://issues.apache.org/jira/rest/api/2/version/12322040",
    "self_id": "12322040",
    "description": "",
    "name": "4.2.2",
    "git_tag": null,
    "git_sha": null
  }
},
{
  "model": "data_gathering.projectversion",
  "pk": 137,
  "fields": {
    "project": 1,
    "self_url": "https://issues.apache.org/jira/rest/api/2/version/12323445",
    "self_id": "12323445",
    "description": "",
    "name": "4.2.3",
    "git_tag": null,
    "git_sha": null
  }
},
{
  "model": "data_gathering.projectversion",
  "pk": 138,
  "fields": {
    "project": 1,
    "self_url": "https://issues.apache.org/jira/rest/api/2/version/12323961",
    "self_id": "12323961",
    "description": "",
    "name": "4.2.4",
    "git_tag": null,
    "git_sha": null
  }
},
{
  "model": "data_gathering.projectversion",
  "pk": 139,
  "fields": {
    "project": 1,
    "self_url": "https://issues.apache.org/jira/rest/api/2/version/12324314",
    "self_id": "12324314",
    "description": "",
    "name": "4.2.5",
    "git_tag": null,
    "git_sha": null
  }
},
{
  "model": "data_gathering.projectversion",
  "pk": 140,
  "fields": {
    "project": 1,
    "self_url": "https://issues.apache.org/jira/rest/api/2/version/12324353",
    "self_id": "12324353",
    "description": "",
    "name": "4.2.6",
    "git_tag": null,
    "git_sha": null
  }
},
{
  "model": "data_gathering.projectversion",
  "pk": 141,
  "fields": {
    "project": 1,
    "self_url": "https://issues.apache.org/jira/rest/api/2/version/12322477",
    "self_id": "12322477",
    "description": "",
    "name": "4.3 Alpha1",
    "git_tag": null,
    "git_sha": null
  }
},
{
  "model": "data_gathering.projectversion",
  "pk": 142,
  "fields": {
    "project": 1,
    "self_url": "https://issues.apache.org/jira/rest/api/2/version/12323951",
    "self_id": "12323951",
    "description": "",
    "name": "4.3 Beta1",
    "git_tag": null,
    "git_sha": null
  }
},
{
  "model": "data_gathering.projectversion",
  "pk": 143,
  "fields": {
    "project": 1,
    "self_url": "https://issues.apache.org/jira/rest/api/2/version/12324304",
    "self_id": "12324304",
    "description": "",
    "name": "4.3 Beta2",
    "git_tag": null,
    "git_sha": null
  }
},
{
  "model": "data_gathering.projectversion",
  "pk": 144,
  "fields": {
    "project": 1,
    "self_url": "https://issues.apache.org/jira/rest/api/2/version/12321280",
    "self_id": "12321280",
    "description": "",
    "name": "4.3 Final",
    "git_tag": null,
    "git_sha": null
  }
},
{
  "model": "data_gathering.projectversion",
  "pk": 145,
  "fields": {
    "project": 1,
    "self_url": "https://issues.apache.org/jira/rest/api/2/version/12324957",
    "self_id": "12324957",
    "description": "",
    "name": "4.3.1",
    "git_tag": null,
    "git_sha": null
  }
},
{
  "model": "data_gathering.projectversion",
  "pk": 146,
  "fields": {
    "project": 1,
    "self_url": "https://issues.apache.org/jira/rest/api/2/version/12325245",
    "self_id": "12325245",
    "description": "",
    "name": "4.3.2",
    "git_tag": null,
    "git_sha": null
  }
},
{
  "model": "data_gathering.projectversion",
  "pk": 147,
  "fields": {
    "project": 1,
    "self_url": "https://issues.apache.org/jira/rest/api/2/version/12325945",
    "self_id": "12325945",
    "description": "",
    "name": "4.3.3",
    "git_tag": null,
    "git_sha": null
  }
},
{
  "model": "data_gathering.projectversion",
  "pk": 148,
  "fields": {
    "project": 1,
    "self_url": "https://issues.apache.org/jira/rest/api/2/version/12326286",
    "self_id": "12326286",
    "description": "",
    "name": "4.3.4",
    "git_tag": null,
    "git_sha": null
  }
},
{
  "model": "data_gathering.projectversion",
  "pk": 149,
  "fields": {
    "project": 1,
    "self_url": "https://issues.apache.org/jira/rest/api/2/version/12327068",
    "self_id": "12327068",
    "description": "",
    "name": "4.3.5",
    "git_tag": null,
    "git_sha": null
  }
},
{
  "model": "data_gathering.projectversion",
  "pk": 150,
  "fields": {
    "project": 1,
    "self_url": "https://issues.apache.org/jira/rest/api/2/version/12328675",
    "self_id": "12328675",
    "description": "",
    "name": "4.3.5.1-android",
    "git_tag": null,
    "git_sha": null
  }
},
{
  "model": "data_gathering.projectversion",
  "pk": 151,
  "fields": {
    "project": 1,
    "self_url": "https://issues.apache.org/jira/rest/api/2/version/12327489",
    "self_id": "12327489",
    "description": "",
    "name": "4.3.6",
    "git_tag": null,
    "git_sha": null
  }
},
{
  "model": "data_gathering.projectversion",
  "pk": 152,
  "fields": {
    "project": 1,
    "self_url": "https://issues.apache.org/jira/rest/api/2/version/12325946",
    "self_id": "12325946",
    "description": "",
    "name": "4.4 Alpha1",
    "git_tag": null,
    "git_sha": null
  }
},
{
  "model": "data_gathering.projectversion",
  "pk": 153,
  "fields": {
    "project": 1,
    "self_url": "https://issues.apache.org/jira/rest/api/2/version/12327185",
    "self_id": "12327185",
    "description": "",
    "name": "4.4 Beta1",
    "git_tag": null,
    "git_sha": null
  }
},
{
  "model": "data_gathering.projectversion",
  "pk": 154,
  "fields": {
    "project": 1,
    "self_url": "https://issues.apache.org/jira/rest/api/2/version/12324872",
    "self_id": "12324872",
    "description": "",
    "name": "4.4 Final",
    "git_tag": null,
    "git_sha": null
  }
},
{
  "model": "data_gathering.projectversion",
  "pk": 155,
  "fields": {
    "project": 1,
    "self_url": "https://issues.apache.org/jira/rest/api/2/version/12329394",
    "self_id": "12329394",
    "description": "",
    "name": "4.4.1",
    "git_tag": null,
    "git_sha": null
  }
},
{
  "model": "data_gathering.projectversion",
  "pk": 156,
  "fields": {
    "project": 1,
    "self_url": "https://issues.apache.org/jira/rest/api/2/version/12329460",
    "self_id": "12329460",
    "description": "",
    "name": "4.5",
    "git_tag": null,
    "git_sha": null
  }
},
{
  "model": "data_gathering.projectversion",
  "pk": 157,
  "fields": {
    "project": 1,
    "self_url": "https://issues.apache.org/jira/rest/api/2/version/12332644",
    "self_id": "12332644",
    "description": "",
    "name": "4.5.1",
    "git_tag": null,
    "git_sha": null
  }
},
{
  "model": "data_gathering.projectversion",
  "pk": 158,
  "fields": {
    "project": 1,
    "self_url": "https://issues.apache.org/jira/rest/api/2/version/12333642",
    "self_id": "12333642",
    "description": "",
    "name": "4.5.2",
    "git_tag": null,
    "git_sha": null
  }
},
{
  "model": "data_gathering.projectversion",
  "pk": 159,
  "fields": {
    "project": 1,
    "self_url": "https://issues.apache.org/jira/rest/api/2/version/12334963",
    "self_id": "12334963",
    "description": "",
    "name": "4.5.3",
    "git_tag": null,
    "git_sha": null
  }
},
{
  "model": "data_gathering.projectversion",
  "pk": 160,
  "fields": {
    "project": 1,
    "self_url": "https://issues.apache.org/jira/rest/api/2/version/12339242",
    "self_id": "12339242",
    "description": "",
    "name": "4.5.4",
    "git_tag": null,
    "git_sha": null
  }
},
{
  "model": "data_gathering.projectversion",
  "pk": 161,
  "fields": {
    "project": 1,
    "self_url": "https://issues.apache.org/jira/rest/api/2/version/12340235",
    "self_id": "12340235",
    "description": "",
    "name": "4.6 Alpha1",
    "git_tag": null,
    "git_sha": null
  }
},
{
  "model": "data_gathering.projectversion",
  "pk": 162,
  "fields": {
    "project": 1,
    "self_url": "https://issues.apache.org/jira/rest/api/2/version/12334684",
    "self_id": "12334684",
    "description": "",
    "name": "5.0 Alpha1",
    "git_tag": null,
    "git_sha": null
  }
},
{
  "model": "data_gathering.projectversion",
  "pk": 163,
  "fields": {
    "project": 1,
    "self_url": "https://issues.apache.org/jira/rest/api/2/version/12334685",
    "self_id": "12334685",
    "description": "",
    "name": "5.0 Alpha2",
    "git_tag": null,
    "git_sha": null
  }
},
{
  "model": "data_gathering.projectversion",
  "pk": 164,
  "fields": {
    "project": 1,
    "self_url": "https://issues.apache.org/jira/rest/api/2/version/12339243",
    "self_id": "12339243",
    "description": "",
    "name": "5.0 Alpha3",
    "git_tag": null,
    "git_sha": null
  }
},
{
  "model": "data_gathering.projectversion",
  "pk": 165,
  "fields": {
    "project": 1,
    "self_url": "https://issues.apache.org/jira/rest/api/2/version/12327109",
    "self_id": "12327109",
    "description": "",
    "name": "5.0",
    "git_tag": null,
    "git_sha": null
  }
},
{
  "model": "data_gathering.projectversion",
  "pk": 166,
  "fields": {
    "project": 1,
    "self_url": "https://issues.apache.org/jira/rest/api/2/version/12312298",
    "self_id": "12312298",
    "description": "",
    "name": "Future",
    "git_tag": null,
    "git_sha": null
  }
},
{
  "model": "data_gathering.projectversion",
  "pk": 167,
  "fields": {
    "project": 1,
    "self_url": "https://issues.apache.org/jira/rest/api/2/version/12311071",
    "self_id": "12311071",
    "description": "",
    "name": "Snapshot",
    "git_tag": null,
    "git_sha": null
  }
},
{
  "model": "data_gathering.projectversion",
  "pk": 168,
  "fields": {
    "project": 1,
    "self_url": "https://issues.apache.org/jira/rest/api/2/version/12340486",
    "self_id": "12340486",
    "description": "",
    "name": "Stuck",
    "git_tag": null,
    "git_sha": null
  }
}
]
