{
    "51": {
        "NO-1": 10.0,
        "NO-6": 11.0,
        "NO-8": 49.0,
        "NO-9": 9.0,
        "NO-10": 97.0,
        "NO-11": 2.0,
        "NO-13": 10.0,
        "NO-14": 10.0,
        "NO-15": 33.0,
        "NO-16": 7.0,
        "NO-17": 1.0,
        "NO-18": 110.0,
        "NO-19": 177.0,
        "NO-20": 25.0,
        "SO-1": 18.0,
        "SO-3": 3.0,
        "SO-4": 2.0,
        "SO-5": 3.0,
        "SO-6": 30.0,
        "SO-7": 9.0,
        "SO-8": 5.0,
        "SO-9": 39.0,
        "SO-11": 7.0,
        "SO-12": 20.0,
        "SO-14": 5.0,
        "SO-15": 24.0,
        "SO-16": 34.0,
        "SO-17": 42.0,
        "SO-18": 3.0,
        "SO-19": 24.0,
        "SO-20": 5.0,
        "NE-1": 42.0,
        "NE-2": 8.0,
        "NE-3": 19.0,
        "NE-4": 6.0,
        "NE-6": 10.0,
        "NE-10": 3.0,
        "NE-11": 27.0,
        "NE-13": 7.0,
        "NE-14": 21.0,
        "NE-15": 21.0,
        "NE-17": 42.0,
        "NE-18": 4.0,
        "CE-1": 80.0,
        "CE-3": 14.0,
        "CE-6": 16.0,
        "CE-7": 38.0,
        "CE-10": 47.0,
        "CE-12": 11.0,
        "CE-16": 1.0,
        "CE-17": 103.0,
        "SE-1": 5.0,
        "SE-2": 8.0,
        "SE-6": 10.0,
        "SE-7": 51.0,
        "SE-8": 3.0,
        "SE-9": 14.0,
        "SE-10": 25.0,
        "SE-11": 26.0,
        "SE-12": 24.0,
        "SE-14": 5.0,
        "SE-17": 24.0,
        "SE-18": 29.0,
        "SE-19": 8.0,
        "SE-20": 13.0
    },
    "52": {
        "CE-5": 23.0,
        "CE-10": 30.0,
        "CE-17": 3.0,
        "CE-1": 18.0,
        "CE-15": 8.0,
        "CE-16": 33.0,
        "CE-14": 2.0,
        "CE-3": 11.0,
        "CE-13": 5.0,
        "CE-4": 45.0,
        "NE-5": 51.0,
        "NE-9": 64.0,
        "NE-1": 4.0,
        "NE-19": 95.0,
        "NE-3": 29.0,
        "NE-15": 0.0,
        "NE-17": 170.0,
        "NE-10": 17.0,
        "NE-4": 14.0,
        "NE-6": 5.0,
        "NE-11": 12.0,
        "NE-7": 0.0,
        "NE-12": 1.0,
        "NE-18": 7.0,
        "NE-13": 59.0,
        "NO-13": 18.0,
        "NO-4": 36.0,
        "NO-16": 16.0,
        "NO-6": 13.0,
        "NO-17": 33.0,
        "NO-10": 34.0,
        "NO-14": 3.0,
        "NO-2": 12.0,
        "NO-8": 109.0,
        "NO-18": 67.0,
        "NO-20": 10.0,
        "NO-11": 31.0,
        "SE-2": 44.0,
        "SE-12": 29.0,
        "SE-1": 4.0,
        "SE-6": 3.0,
        "SE-20": 13.0,
        "SE-15": 12.0,
        "SE-17": 25.0,
        "SE-13": 2.0,
        "SE-18": 30.0,
        "SE-11": 4.0,
        "SE-19": 35.0,
        "SE-7": 5.0,
        "SE-5": 52.0,
        "SE-4": 12.0,
        "SE-10": 5.0,
        "SE-8": 3.0,
        "SE-3": 4.0,
        "SO-9": 18.0,
        "SO-10": 1.0,
        "SO-16": 32.0,
        "SO-7": 0.0,
        "SO-1": 16.0,
        "SO-6": 8.0,
        "SO-11": 25.0,
        "SO-5": 48.0,
        "SO-14": 1.0,
        "SO-2": 7.0,
        "SO-17": 7.0,
        "SO-4": 4.0,
        "SO-8": 40.0,
        "SO-15": 7.0,
        "SO-3": 47.0,
        "SO-20": 7.0,
        "SO-18": 0.0,
        "CE-9": 0.0
    },
    "1": {
        "CE-1": 129.0,
        "CE-3": 3.0,
        "CE-5": 75.0,
        "CE-6": 11.0,
        "CE-7": 41.0,
        "CE-10": 63.0,
        "CE-11": 15.0,
        "CE-13": 4.0,
        "CE-15": 66.0,
        "CE-16": 56.0,
        "CE-19": 38.0,
        "NE-1": 8.0,
        "NE-2": 13.0,
        "NE-3": 54.0,
        "NE-4": 12.0,
        "NE-5": 29.0,
        "NE-6": 20.0,
        "NE-7": 3.0,
        "NE-8": 10.0,
        "NE-9": 30.0,
        "NE-13": 16.0,
        "NE-15": 10.0,
        "NE-16": 3.0,
        "NE-17": 209.0,
        "NE-18": 84.0,
        "NE-19": 1.0,
        "NO-2": 12.0,
        "NO-3": 0.0,
        "NO-4": 104.0,
        "NO-5": 15.0,
        "NO-6": 21.0,
        "NO-7": 65.0,
        "NO-8": 7.0,
        "NO-10": 230.0,
        "NO-11": 6.0,
        "NO-12": 10.0,
        "NO-13": 37.0,
        "NO-14": 0.0,
        "NO-15": 5.0,
        "NO-16": 69.0,
        "NO-17": 2.0,
        "NO-18": 28.0,
        "NO-19": 4.0,
        "NO-20": 302.0,
        "SE-1": 24.0,
        "SE-2": 37.0,
        "SE-3": 4.0,
        "SE-4": 71.0,
        "SE-5": 13.0,
        "SE-7": 60.0,
        "SE-8": 59.0,
        "SE-9": 8.0,
        "SE-10": 73.0,
        "SE-11": 68.0,
        "SE-12": 3.0,
        "SE-13": 3.0,
        "SE-14": 21.0,
        "SE-17": 12.0,
        "SE-18": 305.0,
        "SE-19": 81.0,
        "SE-20": 22.0,
        "SO-1": 305.0,
        "SO-2": 11.0,
        "SO-3": 108.0,
        "SO-4": 0.0,
        "SO-5": 107.0,
        "SO-6": 0.0,
        "SO-7": 4.0,
        "SO-9": 68.0,
        "SO-12": 54.0,
        "SO-13": 8.0,
        "SO-14": 1.0,
        "SO-15": 3.0,
        "SO-16": 56.0,
        "SO-17": 56.0,
        "SO-18": 3.0,
        "SO-19": 49.0,
        "SO-20": 1.0
    },
    "2": {
        "CE-1": 34.0,
        "CE-2": 0.0,
        "CE-3": 3.0,
        "CE-6": 14.0,
        "CE-7": 6.0,
        "CE-11": 2.0,
        "CE-15": 151.0,
        "CE-16": 2.0,
        "CE-17": 21.0,
        "NE-1": 16.0,
        "NE-2": 21.0,
        "NE-3": 1.0,
        "NE-4": 5.0,
        "NE-5": 5.0,
        "NE-6": 13.0,
        "NE-7": 7.0,
        "NE-8": 1.0,
        "NE-9": 11.0,
        "NE-10": 21.0,
        "NE-11": 2.0,
        "NE-12": 4.0,
        "NE-13": 5.0,
        "NE-15": 20.0,
        "NE-16": 1.0,
        "NE-17": 73.0,
        "NE-18": 4.0,
        "NE-19": 16.0,
        "NO-1": 2.0,
        "NO-2": 3.0,
        "NO-3": 0.0,
        "NO-4": 19.0,
        "NO-6": 2.0,
        "NO-7": 3.0,
        "NO-8": 15.0,
        "NO-10": 12.0,
        "NO-11": 38.0,
        "NO-12": 1.0,
        "NO-13": 2.0,
        "NO-14": 3.0,
        "NO-17": 1.0,
        "SE-1": 0.0,
        "SE-2": 11.0,
        "SE-3": 2.0,
        "SE-4": 2.0,
        "SE-5": 6.0,
        "SE-6": 3.0,
        "SE-7": 0.0,
        "SE-10": 4.0,
        "SE-11": 42.0,
        "SE-13": 5.0,
        "SE-14": 3.0,
        "SE-15": 4.0,
        "SE-16": 17.0,
        "SE-17": 7.0,
        "SE-18": 11.0,
        "SE-19": 28.0,
        "SE-20": 43.0,
        "SO-2": 8.0,
        "SO-3": 1.0,
        "SO-4": 0.0,
        "SO-5": 31.0,
        "SO-6": 4.0,
        "SO-7": 11.0,
        "SO-8": 8.0,
        "SO-9": 1.0,
        "SO-10": 0.0,
        "SO-11": 2.0,
        "SO-12": 21.0,
        "SO-13": 0.0,
        "SO-14": 2.0,
        "SO-15": 9.0,
        "SO-16": 7.0,
        "SO-17": 1.0,
        "SO-19": 65.0,
        "SO-20": 15.0
    },
    "3": {
        "CE-1": 12.0,
        "CE-2": 7.0,
        "CE-3": 0.0,
        "CE-4": 9.0,
        "CE-5": 9.0,
        "CE-6": 1.0,
        "CE-7": 25.0,
        "CE-8": 10.0,
        "CE-9": 4.0,
        "CE-10": 11.0,
        "CE-11": 7.0,
        "CE-12": 4.0,
        "CE-13": 38.0,
        "CE-14": 14.0,
        "CE-15": 2.0,
        "CE-16": 6.0,
        "CE-17": 14.0,
        "CE-18": 9.0,
        "CE-19": 2.0,
        "CE-20": 19.0,
        "NE-1": 10.0,
        "NE-2": 34.0,
        "NE-3": 16.0,
        "NE-4": 7.0,
        "NE-5": 15.0,
        "NE-6": 10.0,
        "NE-7": 6.0,
        "NE-8": 4.0,
        "NE-9": 27.0,
        "NE-10": 16.0,
        "NE-12": 1.0,
        "NE-13": 3.0,
        "NE-14": 20.0,
        "NE-15": 4.0,
        "NE-17": 26.0,
        "NE-18": 33.0,
        "NE-19": 25.0,
        "NO-1": 3.0,
        "NO-4": 50.0,
        "NO-6": 4.0,
        "NO-7": 1.0,
        "NO-8": 25.0,
        "NO-10": 2.0,
        "NO-11": 38.0,
        "NO-12": 33.0,
        "NO-13": 20.0,
        "NO-14": 44.0,
        "NO-16": 37.0,
        "NO-17": 4.0,
        "NO-18": 26.0,
        "NO-20": 12.0,
        "SE-2": 1.0,
        "SE-3": 0.0,
        "SE-4": 13.0,
        "SE-5": 0.0,
        "SE-6": 21.0,
        "SE-7": 22.0,
        "SE-8": 45.0,
        "SE-9": 10.0,
        "SE-10": 25.0,
        "SE-11": 12.0,
        "SE-12": 38.0,
        "SE-13": 2.0,
        "SE-15": 13.0,
        "SE-16": 3.0,
        "SE-17": 13.0,
        "SE-18": 12.0,
        "SE-19": 13.0,
        "SO-2": 3.0,
        "SO-4": 9.0,
        "SO-5": 1.0,
        "SO-6": 4.0,
        "SO-7": 19.0,
        "SO-8": 5.0,
        "SO-9": 13.0,
        "SO-11": 14.0,
        "SO-12": 1.0,
        "SO-14": 9.0,
        "SO-15": 16.0,
        "SO-17": 2.0,
        "SO-18": 6.0,
        "SO-20": 24.0
    },
    "4": {
        "CE-1": 15.0,
        "CE-2": 2.0,
        "CE-4": 3.0,
        "CE-5": 7.0,
        "CE-7": 12.0,
        "CE-8": 11.0,
        "CE-9": 20.0,
        "CE-10": 46.0,
        "CE-12": 20.0,
        "CE-13": 11.0,
        "CE-14": 29.0,
        "CE-16": 89.0,
        "CE-18": 10.0,
        "CE-19": 44.0,
        "CE-20": 1.0,
        "NE-1": 9.0,
        "NE-2": 38.0,
        "NE-3": 3.0,
        "NE-4": 9.0,
        "NE-5": 5.0,
        "NE-6": 18.0,
        "NE-7": 9.0,
        "NE-8": 7.0,
        "NE-9": 45.0,
        "NE-10": 2.0,
        "NE-12": 7.0,
        "NE-14": 2.0,
        "NE-16": 27.0,
        "NE-17": 3.0,
        "NE-18": 51.0,
        "NE-19": 7.0,
        "NO-1": 13.0,
        "NO-2": 15.0,
        "NO-3": 1.0,
        "NO-4": 42.0,
        "NO-6": 26.0,
        "NO-8": 5.0,
        "NO-9": 29.0,
        "NO-10": 3.0,
        "NO-11": 176.0,
        "NO-12": 25.0,
        "NO-13": 1.0,
        "NO-14": 70.0,
        "NO-15": 5.0,
        "NO-16": 4.0,
        "NO-17": 1.0,
        "SE-2": 41.0,
        "SE-3": 1.0,
        "SE-4": 9.0,
        "SE-5": 4.0,
        "SE-6": 51.0,
        "SE-7": 6.0,
        "SE-8": 38.0,
        "SE-9": 18.0,
        "SE-10": 4.0,
        "SE-11": 26.0,
        "SE-12": 20.0,
        "SE-13": 14.0,
        "SE-14": 2.0,
        "SE-15": 32.0,
        "SE-16": 3.0,
        "SE-17": 63.0,
        "SE-18": 42.0,
        "SE-20": 0.0,
        "SO-1": 30.0,
        "SO-2": 3.0,
        "SO-3": 3.0,
        "SO-4": 2.0,
        "SO-5": 20.0,
        "SO-6": 37.0,
        "SO-7": 8.0,
        "SO-8": 24.0,
        "SO-9": 4.0,
        "SO-11": 7.0,
        "SO-12": 39.0,
        "SO-14": 83.0,
        "SO-15": 87.0,
        "SO-16": 8.0,
        "SO-17": 4.0,
        "SO-18": 1.0,
        "SO-19": 48.0,
        "SO-20": 16.0
    },
    "5": {
        "CE-2": 6.0,
        "CE-3": 66.0,
        "CE-4": 69.0,
        "CE-5": 76.0,
        "CE-6": null,
        "CE-10": 31.0,
        "CE-11": 7.0,
        "CE-12": 6.0,
        "CE-13": 29.0,
        "CE-16": 30.0,
        "CE-17": 2.0,
        "CE-20": 0.0,
        "NE-1": 22.0,
        "NE-2": 155.0,
        "NE-3": 87.0,
        "NE-4": 38.0,
        "NE-5": 61.0,
        "NE-6": 51.0,
        "NE-7": 35.0,
        "NE-8": 176.0,
        "NE-9": 123.0,
        "NE-10": 17.0,
        "NE-11": 20.0,
        "NE-12": 13.0,
        "NE-13": 2.0,
        "NE-14": 298.0,
        "NE-15": 1.0,
        "NE-17": 11.0,
        "NE-18": 95.0,
        "NE-19": 53.0,
        "NO-2": 123.0,
        "NO-4": 57.0,
        "NO-5": 5.0,
        "NO-6": 1.0,
        "NO-7": 11.0,
        "NO-9": 24.0,
        "NO-10": 49.0,
        "NO-13": 23.0,
        "NO-14": 123.0,
        "NO-15": 2.0,
        "NO-17": 28.0,
        "NO-18": 38.0,
        "NO-19": 11.0,
        "NO-20": 30.0,
        "SE-1": 26.0,
        "SE-2": 25.0,
        "SE-3": 36.0,
        "SE-4": 37.0,
        "SE-6": 6.0,
        "SE-7": 30.0,
        "SE-8": 98.0,
        "SE-9": 96.0,
        "SE-11": 3.0,
        "SE-12": 20.0,
        "SE-13": 11.0,
        "SE-14": 42.0,
        "SE-15": 57.0,
        "SE-17": 19.0,
        "SE-18": 24.0,
        "SE-19": 11.0,
        "SO-2": 25.0,
        "SO-3": 12.0,
        "SO-4": 58.0,
        "SO-5": 190.0,
        "SO-6": 132.0,
        "SO-7": 41.0,
        "SO-8": 63.0,
        "SO-9": 32.0,
        "SO-11": 2.0,
        "SO-12": 64.0,
        "SO-13": 5.0,
        "SO-15": 20.0,
        "SO-16": 75.0,
        "SO-17": 22.0,
        "SO-18": 66.0,
        "SO-19": 34.0,
        "SO-20": 97.0
    },
    "6": {
        "CE-1": 106.0,
        "CE-2": 1.0,
        "CE-3": 11.0,
        "CE-4": 10.0,
        "CE-5": 17.0,
        "CE-7": 49.0,
        "CE-8": 14.0,
        "CE-9": 5.0,
        "CE-10": 52.0,
        "CE-11": 14.0,
        "CE-12": 46.0,
        "CE-13": 3.0,
        "CE-14": 14.0,
        "CE-15": 143.0,
        "CE-16": 34.0,
        "CE-17": 1.0,
        "CE-18": 18.0,
        "CE-19": 130.0,
        "CE-20": 14.0,
        "NE-1": 18.0,
        "NE-2": 23.0,
        "NE-3": 20.0,
        "NE-4": 19.0,
        "NE-5": 12.0,
        "NE-6": 8.0,
        "NE-7": 16.0,
        "NE-8": 15.0,
        "NE-9": 8.0,
        "NE-10": 37.0,
        "NE-11": 17.0,
        "NE-12": 2.0,
        "NE-13": 48.0,
        "NE-14": 18.0,
        "NE-15": 25.0,
        "NE-16": 7.0,
        "NE-17": 52.0,
        "NE-18": 65.0,
        "NE-19": 13.0,
        "NO-1": 22.0,
        "NO-2": 109.0,
        "NO-3": 8.0,
        "NO-4": 16.0,
        "NO-5": 102.0,
        "NO-6": 123.0,
        "NO-7": 7.0,
        "NO-9": 7.0,
        "NO-11": 35.0,
        "NO-12": 153.0,
        "NO-13": 101.0,
        "NO-14": 200.0,
        "NO-15": 0.0,
        "NO-16": 66.0,
        "NO-17": 19.0,
        "NO-18": 132.0,
        "NO-19": 0.0,
        "NO-20": 82.0,
        "SE-1": 8.0,
        "SE-2": 9.0,
        "SE-3": 7.0,
        "SE-4": 51.0,
        "SE-5": 9.0,
        "SE-7": 4.0,
        "SE-8": 21.0,
        "SE-9": 8.0,
        "SE-10": 20.0,
        "SE-11": 27.0,
        "SE-12": 34.0,
        "SE-13": 22.0,
        "SE-14": 31.0,
        "SE-15": 26.0,
        "SE-16": 282.0,
        "SE-18": 102.0,
        "SE-19": 29.0,
        "SO-1": 100.0,
        "SO-2": 15.0,
        "SO-3": 110.0,
        "SO-4": 71.0,
        "SO-5": 73.0,
        "SO-6": 3.0,
        "SO-7": 8.0,
        "SO-8": 6.0,
        "SO-09": 34.0,
        "SO-10": 7.0,
        "SO-11": 8.0,
        "SO-13": 3.0,
        "SO-14": 135.0,
        "SO-15": 64.0,
        "SO-16": 18.0,
        "SO-17": 66.0,
        "SO-18": 133.0,
        "SO-19": 133.0,
        "SO-20": 52.0
    },
    "7": {
        "CE-1": 6.0,
        "CE-2": null,
        "CE-3": 89.0,
        "CE-4": 4.0,
        "CE-5": 1.0,
        "CE-6": 6.0,
        "CE-7": 6.0,
        "CE-10": 19.0,
        "CE-11": 74.0,
        "CE-12": 45.0,
        "CE-13": 8.0,
        "CE-14": 6.0,
        "CE-17": 1.0,
        "CE-18": 5.0,
        "CE-19": 1.0,
        "NE-2": 23.0,
        "NE-3": 4.0,
        "NE-4": 4.0,
        "NE-5": 43.0,
        "NE-6": 4.0,
        "NE-7": 17.0,
        "NE-8": 3.0,
        "NE-9": 20.0,
        "NE-10": 7.0,
        "NE-11": 2.0,
        "NE-12": 5.0,
        "NE-13": 8.0,
        "NE-14": 4.0,
        "NE-15": 10.0,
        "NE-16": 5.0,
        "NE-17": 42.0,
        "NE-18": 15.0,
        "NE-19": 22.0,
        "NO-1": 70.0,
        "NO-2": 5.0,
        "NO-3": 18.0,
        "NO-4": 11.0,
        "NO-5": 4.0,
        "NO-6": 11.0,
        "NO-7": 3.0,
        "NO-10": 92.0,
        "NO-11": 31.0,
        "NO-12": 14.0,
        "NO-13": 56.0,
        "NO-14": 4.0,
        "NO-15": 2.0,
        "NO-16": 2.0,
        "NO-17": 6.0,
        "NO-18": 2.0,
        "NO-19": 13.0,
        "NO-20": 48.0,
        "SE-1": 3.0,
        "SE-2": 15.0,
        "SE-3": 4.0,
        "SE-5": 1.0,
        "SE-6": 12.0,
        "SE-9": 5.0,
        "SE-11": 1.0,
        "SE-12": 5.0,
        "SE-13": 1.0,
        "SE-14": 1.0,
        "SE-15": 0.0,
        "SE-16": 0.0,
        "SE-17": 10.0,
        "SE-18": 2.0,
        "SE-19": 0.0,
        "SE-20": 4.0,
        "SO-1": 28.0,
        "SO-2": 3.0,
        "SO-3": 6.0,
        "SO-4": 8.0,
        "SO-6": 57.0,
        "SO-8": 17.0,
        "SO-9": 25.0,
        "SO-10": 3.0,
        "SO-11": 17.0,
        "SO-13": 15.0,
        "SO-14": 103.0,
        "SO-15": 52.0,
        "SO-16": 1.0,
        "SO-17": 52.0,
        "SO-18": 2.0,
        "SO-19": 23.0,
        "SO-20": 34.0
    },
    "8": {
        "CE-1": 103.0,
        "CE-2": 6.0,
        "CE-3": 5.0,
        "CE-4": 47.0,
        "CE-5": 20.0,
        "CE-6": 67.0,
        "CE-8": 16.0,
        "CE-9": 1.0,
        "CE-10": 162.0,
        "CE-11": 26.0,
        "CE-12": 73.0,
        "CE-13": 7.0,
        "CE-14": 126.0,
        "CE-16": 5.0,
        "CE-17": 33.0,
        "CE-20": 1.0,
        "NE-2": 135.0,
        "NE-3": 19.0,
        "NE-4": 27.0,
        "NE-5": 33.0,
        "NE-6": 7.0,
        "NE-7": 21.0,
        "NE-8": 43.0,
        "NE-9": 48.0,
        "NE-10": 110.0,
        "NE-11": 243.0,
        "NE-12": 1.0,
        "NE-13": 26.0,
        "NE-14": 77.0,
        "NE-16": 92.0,
        "NE-18": 79.0,
        "NE-19": 71.0,
        "NO-2": 15.0,
        "NO-3": 28.0,
        "NO-4": 13.0,
        "NO-5": 5.0,
        "NO-6": 180.0,
        "NO-7": 5.0,
        "NO-8": 59.0,
        "NO-9": 17.0,
        "NO-10": 41.0,
        "NO-11": 15.0,
        "NO-12": 14.0,
        "NO-13": 45.0,
        "NO-14": 9.0,
        "NO-15": 9.0,
        "NO-17": 7.0,
        "NO-18": 24.0,
        "NO-19": 4.0,
        "NO-20": 16.0,
        "SE-1": 3.0,
        "SE-2": 220.0,
        "SE-3": 13.0,
        "SE-4": 19.0,
        "SE-5": 8.0,
        "SE-6": 17.0,
        "SE-7": 1.0,
        "SE-8": 95.0,
        "SE-9": 51.0,
        "SE-10": 110.0,
        "SE-11": 20.0,
        "SE-12": 89.0,
        "SE-13": 23.0,
        "SE-14": 212.0,
        "SE-15": 30.0,
        "SE-17": 93.0,
        "SE-18": 49.0,
        "SE-19": 3.0,
        "SE-20": 13.0,
        "SO-1": 6.0,
        "SO-2": 8.0,
        "SO-3": 15.0,
        "SO-4": 8.0,
        "SO-5": 9.0,
        "SO-6": 31.0,
        "SO-7": 5.0,
        "SO-8": 20.0,
        "SO-9": 17.0,
        "SO-10": 8.0,
        "SO-11": 4.0,
        "SO-12": 13.0,
        "SO-13": 4.0,
        "SO-14": 113.0,
        "SO-15": 69.0,
        "SO-16": 7.0,
        "SO-17": null,
        "SO-18": 92.0,
        "SO-19": 7.0,
        "SO-20": 35.0
    }
}