{
    "ffmpeg": {
        "path": "/bin/ffmpeg",
        "waitPct": 1.5
    },
    "ffprobe": {
        "path": "/bin/ffprobe"
    },
    "OpenSubtitles": {
        "useragent": "HypertubeAPI",
        "username": "hypertubepimerle",
        "password": "hypertubepimerle"
    },
    "vExt": [".mp4", ".avi", ".mkv", ".webm"],
    "sExt": [".srt"],
    "downloadPath": "video/"
}