<svg width="112" height="100" xmlns="http://www.w3.org/2000/svg">
 <!-- Created with Method Draw - http://github.com/duopixel/Method-Draw/ -->
 <g>
  <title>background</title>
  <rect fill="none" id="canvas_background" height="102" width="114" y="-1" x="-1"/>
  <g display="none" overflow="visible" y="0" x="0" height="100%" width="100%" id="canvasGrid">
   <rect fill="url(#gridpattern)" stroke-width="0" y="0" x="0" height="100%" width="100%"/>
  </g>
 </g>
 <g>
  <title>Layer 1</title>
  <path transform="rotate(180 55.75001907348633,49.749996185302734) " id="svg_1" d="m2.750015,49.637192l53.000003,-46.887199l53.000003,46.887199l-26.500003,0l0,47.112812l-52.999999,0l0,-47.112812l-26.500003,0z" stroke-width="5.5" stroke="#000" fill="none"/>
 </g>
</svg>