%!PS-Adobe-3.0 EPSF-3.0 
%%BoundingBox: 0 0 595 369
%%Pages: 0
%%Creator: LibreOffice 5.1
%%Title: none
%%CreationDate: none
%%LanguageLevel: 2
%%EndComments
%%BeginProlog
%%BeginResource: procset SDRes-Prolog 1.0 0
/b4_inc_state save def
/dict_count countdictstack def
/op_count count 1 sub def
userdict begin
0 setgray 0 setlinecap 1 setlinewidth 0 setlinejoin 10 setmiterlimit[] 0 setdash newpath
/languagelevel where {pop languagelevel 1 ne {false setstrokeadjust false setoverprint} if} if
/bdef {bind def} bind def
/c {setgray} bdef
/l {neg lineto} bdef
/rl {neg rlineto} bdef
/lc {setlinecap} bdef
/lj {setlinejoin} bdef
/lw {setlinewidth} bdef
/ml {setmiterlimit} bdef
/ld {setdash} bdef
/m {neg moveto} bdef
/ct {6 2 roll neg 6 2 roll neg 6 2 roll neg curveto} bdef
/r {rotate} bdef
/t {neg translate} bdef
/s {scale} bdef
/sw {show} bdef
/gs {gsave} bdef
/gr {grestore} bdef
/f {findfont dup length dict begin
{1 index /FID ne {def} {pop pop} ifelse} forall /Encoding ISOLatin1Encoding def
currentdict end /NFont exch definefont pop /NFont findfont} bdef
/p {closepath} bdef
/sf {scalefont setfont} bdef
/ef {eofill}bdef
/pc {closepath stroke}bdef
/ps {stroke}bdef
/pum {matrix currentmatrix}bdef
/pom {setmatrix}bdef
/bs {/aString exch def /nXOfs exch def /nWidth exch def currentpoint nXOfs 0 rmoveto pum nWidth aString stringwidth pop div 1 scale aString show pom moveto} bdef
%%EndResource
%%EndProlog
%%BeginSetup
%%EndSetup
%%Page: 1 1
%%BeginPageSetup
%%EndPageSetup
pum
0.02833 0.02838 s 
0 -13000 t
/tm matrix currentmatrix def
gs
tm setmatrix
-1105 -1182 t 
1 1 s 
1105 1182 m 22104 1182 l 22104 14181 l 1105 14181 l 1105 1182 l eoclip newpath
gs
1105 1182 m 22104 1182 l 22104 14181 l 1105 14181 l 1105 1182 l eoclip newpath
0.996 c 16137 4373 m  18644 4373 20558 6496 20558 9277 ct 20558 12058 18644 14182 16137 14182 ct 
13630 14182 11716 12058 11716 9277 ct 11716 6496 13630 4373 16137 4373 ct p
11716 4373 m  11716 4373 l  p
20559 14183 m  20559 14183 l  p ef
0 lw 1 lj 0.363 c 16136 4372 m  18643 4372 20557 6496 20557 9277 ct 20557 12058 18643 14181 16136 14181 ct 
13630 14181 11715 12058 11715 9277 ct 11715 6496 13630 4372 16136 4372 ct pc
11715 4372 m  11715 4372 l  pc
20559 14183 m  20559 14183 l  pc
0.996 c 6318 5791 m  7894 5791 9099 7052 9099 8702 ct 9099 10352 7894 11613 6318 11613 ct 
4742 11613 3537 10352 3537 8702 ct 3537 7052 4742 5791 6318 5791 ct p
3537 5791 m  3537 5791 l  p
9100 11614 m  9100 11614 l  p ef
0.363 c 6317 5790 m  7893 5790 9098 7051 9098 8701 ct 9098 10351 7893 11612 6317 11612 ct 
4741 11612 3536 10351 3536 8701 ct 3536 7051 4741 5790 6317 5790 ct pc
3536 5790 m  3536 5790 l  pc
9099 11613 m  9099 11613 l  pc
0.996 c 16119 6351 m  17695 6351 18900 7612 18900 9262 ct 18900 10912 17695 12173 16119 12173 ct 
14543 12173 13338 10912 13338 9262 ct 13338 7612 14543 6351 16119 6351 ct p
13338 6351 m  13338 6351 l  p
18901 12174 m  18901 12174 l  p ef
0.363 c 16119 6351 m  17695 6351 18900 7612 18900 9261 ct 18900 10911 17695 12172 16119 12172 ct 
14543 12172 13338 10911 13338 9261 ct 13338 7612 14543 6351 16119 6351 ct pc
13338 6351 m  13338 6351 l  pc
18901 12173 m  18901 12173 l  pc
0.996 c 6410 10990 m  2984 10990 l  2984 6500 l  9836 6500 l  9836 10990 l 
6410 10990 l  pc
pum
4736 8586 t
0.000 c 547 -261 m  547 -220 542 -184 530 -151 ct 519 -118 502 -90 480 -66 ct 
458 -43 431 -25 399 -12 ct 367 1 331 7 291 7 ct 249 7 211 0 179 -13 ct 147 -26 121 -45 100 -69 ct 
78 -92 62 -121 52 -153 ct 41 -186 36 -222 36 -261 ct 36 -301 41 -337 52 -370 ct 
64 -402 80 -430 102 -453 ct 124 -476 150 -493 182 -506 ct 214 -518 251 -524 292 -524 ct 
333 -524 369 -518 401 -506 ct 433 -493 460 -475 481 -452 ct 503 -429 519 -402 531 -369 ct 
542 -337 547 -301 547 -261 ct p
476 -261 m  476 -292 472 -320 464 -345 ct 456 -371 445 -393 429 -411 ct 414 -429 394 -443 371 -452 ct 
348 -462 322 -467 292 -467 ct 261 -467 234 -462 211 -452 ct 188 -443 168 -429 153 -411 ct 
137 -393 126 -371 118 -345 ct 110 -320 107 -292 107 -261 ct 107 -230 111 -201 118 -176 ct 
126 -150 138 -128 154 -109 ct 169 -90 188 -76 211 -65 ct 235 -55 261 -50 291 -50 ct 
323 -50 351 -55 374 -66 ct 398 -76 417 -91 432 -109 ct 447 -128 458 -150 465 -176 ct 
472 -202 476 -230 476 -261 ct p ef
977 0 m  900 0 l  837 -256 l  835 -262 833 -271 831 -280 ct 829 -290 827 -300 825 -309 ct 
823 -320 820 -331 818 -342 ct 816 -331 813 -320 811 -310 ct 809 -300 807 -291 805 -281 ct 
802 -271 800 -262 798 -254 ct 733 0 l  657 0 l  546 -397 l  611 -397 l  678 -127 l 
680 -122 682 -115 683 -106 ct 685 -98 687 -90 688 -82 ct 690 -73 692 -64 694 -55 ct 
696 -64 698 -73 700 -82 ct 702 -89 704 -97 706 -105 ct 708 -113 710 -119 711 -124 ct 
783 -397 l  854 -397 l  923 -124 l  924 -118 926 -111 928 -103 ct 930 -95 932 -87 934 -80 ct 
936 -72 938 -63 940 -55 ct 942 -64 943 -73 945 -82 ct 947 -89 949 -97 951 -105 ct 
953 -114 954 -121 956 -127 ct 1026 -397 l  1090 -397 l  977 0 l  p ef
1355 0 m  1355 -252 l  1355 -271 1354 -287 1351 -300 ct 1348 -313 1344 -323 1337 -331 ct 
1331 -339 1322 -345 1312 -348 ct 1302 -351 1289 -353 1273 -353 ct 1258 -353 1244 -350 1231 -345 ct 
1219 -339 1208 -331 1199 -321 ct 1190 -311 1183 -298 1178 -282 ct 1173 -267 1171 -250 1171 -230 ct 
1171 0 l  1105 0 l  1105 -313 l  1105 -321 1105 -330 1105 -339 ct 1105 -348 1105 -357 1104 -365 ct 
1104 -373 1104 -380 1104 -386 ct 1103 -392 1103 -395 1103 -395 ct 1165 -395 l 
1165 -394 1166 -391 1166 -386 ct 1166 -380 1166 -374 1167 -367 ct 1167 -361 1167 -354 1168 -347 ct 
1168 -340 1168 -334 1168 -329 ct 1169 -329 l  1175 -340 1182 -351 1190 -360 ct 
1198 -369 1206 -377 1216 -384 ct 1226 -390 1238 -395 1251 -399 ct 1264 -402 1279 -404 1296 -404 ct 
1318 -404 1337 -401 1353 -396 ct 1368 -391 1381 -382 1392 -371 ct 1402 -360 1410 -345 1414 -328 ct 
1419 -310 1421 -289 1421 -264 ct 1421 0 l  1355 0 l  p ef
1542 -185 m  1542 -164 1544 -145 1548 -128 ct 1553 -110 1559 -95 1568 -82 ct 
1577 -70 1589 -60 1603 -53 ct 1616 -46 1633 -42 1653 -42 ct 1681 -42 1704 -48 1721 -60 ct 
1739 -71 1750 -86 1756 -103 ct 1814 -87 l  1810 -76 1804 -65 1797 -54 ct 1789 -43 1779 -33 1767 -24 ct 
1754 -15 1739 -7 1720 -2 ct 1702 4 1679 7 1653 7 ct 1594 7 1549 -10 1519 -45 ct 
1488 -80 1473 -132 1473 -201 ct 1473 -238 1478 -270 1487 -295 ct 1496 -321 1509 -342 1525 -358 ct 
1541 -374 1560 -386 1581 -393 ct 1603 -400 1626 -404 1650 -404 ct 1683 -404 1711 -399 1733 -388 ct 
1756 -377 1774 -362 1787 -343 ct 1801 -325 1810 -302 1816 -277 ct 1822 -251 1825 -224 1825 -194 ct 
1825 -185 l  1542 -185 l  p
1757 -236 m  1753 -277 1742 -308 1725 -327 ct 1707 -346 1682 -355 1649 -355 ct 
1638 -355 1626 -353 1614 -350 ct 1602 -346 1591 -340 1581 -331 ct 1571 -322 1562 -310 1555 -295 ct 
1548 -279 1544 -259 1543 -236 ct 1757 -236 l  p ef
2130 -64 m  2117 -39 2101 -20 2081 -9 ct 2061 1 2036 7 2006 7 ct 1956 7 1919 -10 1896 -44 ct 
1872 -77 1861 -128 1861 -197 ct 1861 -335 1909 -404 2006 -404 ct 2036 -404 2061 -399 2081 -388 ct 
2101 -377 2117 -359 2130 -335 ct 2130 -335 l  2130 -338 2130 -341 2130 -347 ct 
2130 -352 2130 -357 2130 -363 ct 2130 -369 2130 -374 2130 -379 ct 2130 -385 2130 -388 2130 -390 ct 
2130 -544 l  2196 -544 l  2196 -80 l  2196 -71 2196 -62 2196 -53 ct 2196 -44 2196 -36 2196 -29 ct 
2197 -21 2197 -15 2197 -10 ct 2197 -4 2198 -2 2198 -2 ct 2135 -2 l  2134 -4 2134 -8 2134 -12 ct 
2133 -16 2133 -21 2132 -27 ct 2132 -33 2132 -39 2131 -45 ct 2131 -52 2131 -58 2131 -64 ct 
2130 -64 l  p
1930 -199 m  1930 -172 1931 -148 1935 -129 ct 1938 -109 1944 -93 1951 -80 ct 
1959 -68 1969 -59 1980 -53 ct 1992 -47 2006 -44 2023 -44 ct 2040 -44 2056 -47 2069 -52 ct 
2082 -58 2093 -67 2102 -80 ct 2111 -92 2118 -109 2123 -129 ct 2127 -149 2130 -174 2130 -203 ct 
2130 -231 2127 -255 2123 -274 ct 2118 -294 2111 -310 2102 -322 ct 2093 -334 2082 -342 2069 -347 ct 
2056 -353 2041 -355 2024 -355 ct 2008 -355 1994 -352 1982 -347 ct 1970 -341 1961 -332 1953 -320 ct 
1945 -307 1939 -291 1935 -271 ct 1932 -251 1930 -227 1930 -199 ct p ef
2800 -200 m  2800 -61 2751 8 2654 8 ct 2624 8 2599 2 2579 -9 ct 2559 -19 2543 -37 2530 -61 ct 
2530 -61 l  2530 -55 2530 -48 2529 -41 ct 2529 -34 2528 -28 2528 -22 ct 2528 -16 2527 -11 2527 -7 ct 
2527 -2 2526 0 2526 0 ct 2462 0 l  2463 -3 2463 -6 2463 -11 ct 2463 -17 2464 -23 2464 -30 ct 
2464 -38 2464 -46 2464 -55 ct 2464 -63 2465 -72 2465 -82 ct 2465 -544 l  2530 -544 l 
2530 -389 l  2530 -382 2530 -375 2530 -368 ct 2530 -361 2530 -355 2530 -350 ct 
2529 -344 2529 -338 2529 -333 ct 2530 -333 l  2543 -358 2559 -376 2579 -387 ct 
2599 -398 2624 -404 2654 -404 ct 2704 -404 2741 -387 2764 -353 ct 2788 -320 2800 -268 2800 -200 ct 
p
2730 -198 m  2730 -225 2729 -249 2725 -268 ct 2722 -288 2716 -304 2709 -316 ct 
2701 -329 2692 -338 2680 -344 ct 2668 -350 2654 -353 2637 -353 ct 2620 -353 2604 -350 2591 -345 ct 
2578 -339 2567 -330 2558 -317 ct 2549 -305 2542 -289 2537 -268 ct 2533 -248 2530 -223 2530 -194 ct 
2530 -165 2533 -141 2537 -122 ct 2542 -103 2549 -87 2558 -75 ct 2567 -63 2578 -54 2591 -49 ct 
2604 -44 2619 -41 2636 -41 ct 2652 -41 2666 -44 2678 -49 ct 2690 -55 2700 -64 2707 -77 ct 
2715 -89 2721 -105 2725 -125 ct 2729 -145 2730 -169 2730 -198 ct p ef
3024 -1 m  3015 23 3005 45 2996 64 ct 2986 83 2975 99 2963 113 ct 2951 127 2938 137 2923 144 ct 
2909 151 2892 155 2873 155 ct 2865 155 2857 155 2850 155 ct 2843 155 2835 154 2828 152 ct 
2828 102 l  2832 103 2837 104 2843 104 ct 2849 104 2854 104 2858 104 ct 2878 104 2896 97 2912 82 ct 
2929 68 2943 45 2956 14 ct 2962 -2 l  2805 -397 l  2875 -397 l  2959 -178 l 
2961 -171 2964 -162 2968 -151 ct 2972 -140 2976 -129 2979 -118 ct 2983 -107 2986 -97 2989 -89 ct 
2992 -80 2994 -74 2995 -72 ct 2995 -75 2997 -80 3000 -88 ct 3003 -96 3006 -105 3009 -115 ct 
3013 -124 3017 -134 3020 -144 ct 3024 -154 3027 -163 3029 -170 ct 3107 -397 l 
3177 -397 l  3024 -1 l  p ef
pom
pum
4950 9426 t
132 -349 m  132 -1 l  66 -1 l  66 -349 l  11 -349 l  11 -397 l  66 -397 l 
66 -442 l  66 -456 68 -470 70 -482 ct 73 -494 78 -505 85 -514 ct 92 -524 102 -531 115 -536 ct 
127 -541 143 -544 163 -544 ct 171 -544 179 -544 187 -543 ct 196 -542 203 -541 209 -540 ct 
209 -489 l  205 -490 201 -491 195 -491 ct 190 -492 185 -492 180 -492 ct 170 -492 162 -491 156 -488 ct 
150 -486 145 -482 142 -477 ct 138 -472 136 -465 134 -458 ct 133 -451 132 -442 132 -433 ct 
132 -397 l  209 -397 l  209 -349 l  132 -349 l  p ef
583 -199 m  583 -130 567 -78 537 -44 ct 506 -10 462 7 404 7 ct 376 7 352 3 330 -5 ct 
308 -14 290 -26 275 -44 ct 260 -61 248 -82 240 -108 ct 232 -134 229 -164 229 -199 ct 
229 -336 288 -404 406 -404 ct 437 -404 463 -400 486 -391 ct 508 -383 526 -370 541 -353 ct 
555 -336 566 -314 572 -289 ct 579 -263 583 -233 583 -199 ct p
513 -199 m  513 -230 511 -255 506 -275 ct 502 -295 495 -311 485 -323 ct 476 -335 465 -343 452 -348 ct 
439 -353 424 -355 407 -355 ct 390 -355 375 -353 362 -348 ct 348 -343 337 -334 327 -322 ct 
317 -310 310 -294 305 -274 ct 300 -254 298 -229 298 -199 ct 298 -168 300 -143 306 -123 ct 
311 -102 319 -86 328 -74 ct 337 -62 348 -54 361 -49 ct 374 -44 388 -42 403 -42 ct 
420 -42 435 -44 449 -49 ct 463 -54 474 -62 484 -74 ct 493 -86 501 -102 506 -122 ct 
511 -143 513 -168 513 -199 ct p ef
700 -397 m  700 -146 l  700 -126 701 -110 704 -97 ct 707 -84 712 -74 718 -66 ct 
724 -58 733 -52 743 -49 ct 753 -46 766 -44 782 -44 ct 797 -44 811 -47 824 -52 ct 
837 -58 847 -66 856 -76 ct 865 -86 872 -99 877 -115 ct 882 -130 884 -147 884 -167 ct 
884 -397 l  950 -397 l  950 -84 l  950 -76 950 -67 950 -58 ct 950 -48 951 -40 951 -31 ct 
951 -23 951 -16 952 -10 ct 952 -4 952 -1 952 -1 ct 890 -1 l  890 -3 890 -6 889 -11 ct 
889 -16 889 -23 888 -29 ct 888 -36 888 -43 887 -50 ct 887 -57 887 -63 887 -68 ct 
886 -68 l  880 -57 873 -46 865 -37 ct 858 -28 849 -20 839 -13 ct 829 -7 817 -2 804 2 ct 
791 5 776 7 759 7 ct 737 7 718 4 703 -1 ct 687 -6 674 -15 663 -26 ct 653 -37 646 -52 641 -69 ct 
636 -87 634 -108 634 -133 ct 634 -397 l  700 -397 l  p ef
1276 0 m  1276 -252 l  1276 -271 1275 -287 1272 -300 ct 1269 -313 1265 -323 1258 -331 ct 
1252 -339 1243 -345 1233 -348 ct 1223 -351 1210 -353 1194 -353 ct 1179 -353 1165 -350 1152 -345 ct 
1140 -339 1129 -331 1120 -321 ct 1111 -311 1104 -298 1099 -282 ct 1094 -267 1092 -250 1092 -230 ct 
1092 0 l  1026 0 l  1026 -313 l  1026 -321 1026 -330 1026 -339 ct 1026 -348 1026 -357 1025 -365 ct 
1025 -373 1025 -380 1025 -386 ct 1024 -392 1024 -395 1024 -395 ct 1086 -395 l 
1086 -394 1087 -391 1087 -386 ct 1087 -380 1087 -374 1088 -367 ct 1088 -361 1088 -354 1089 -347 ct 
1089 -340 1089 -334 1089 -329 ct 1090 -329 l  1096 -340 1103 -351 1111 -360 ct 
1119 -369 1127 -377 1137 -384 ct 1147 -390 1159 -395 1172 -399 ct 1185 -402 1200 -404 1217 -404 ct 
1239 -404 1258 -401 1274 -396 ct 1289 -391 1302 -382 1313 -371 ct 1323 -360 1331 -345 1335 -328 ct 
1340 -310 1342 -289 1342 -264 ct 1342 0 l  1276 0 l  p ef
1663 -64 m  1650 -39 1634 -20 1614 -9 ct 1594 1 1569 7 1539 7 ct 1489 7 1452 -10 1429 -44 ct 
1405 -77 1394 -128 1394 -197 ct 1394 -335 1442 -404 1539 -404 ct 1569 -404 1594 -399 1614 -388 ct 
1634 -377 1650 -359 1663 -335 ct 1663 -335 l  1663 -338 1663 -341 1663 -347 ct 
1663 -352 1663 -357 1663 -363 ct 1663 -369 1663 -374 1663 -379 ct 1663 -385 1663 -388 1663 -390 ct 
1663 -544 l  1729 -544 l  1729 -80 l  1729 -71 1729 -62 1729 -53 ct 1729 -44 1729 -36 1729 -29 ct 
1730 -21 1730 -15 1730 -10 ct 1730 -4 1731 -2 1731 -2 ct 1668 -2 l  1667 -4 1667 -8 1667 -12 ct 
1666 -16 1666 -21 1665 -27 ct 1665 -33 1665 -39 1664 -45 ct 1664 -52 1664 -58 1664 -64 ct 
1663 -64 l  p
1463 -199 m  1463 -172 1464 -148 1468 -129 ct 1471 -109 1477 -93 1484 -80 ct 
1492 -68 1502 -59 1513 -53 ct 1525 -47 1539 -44 1556 -44 ct 1573 -44 1589 -47 1602 -52 ct 
1615 -58 1626 -67 1635 -80 ct 1644 -92 1651 -109 1656 -129 ct 1660 -149 1663 -174 1663 -203 ct 
1663 -231 1660 -255 1656 -274 ct 1651 -294 1644 -310 1635 -322 ct 1626 -334 1615 -342 1602 -347 ct 
1589 -353 1574 -355 1557 -355 ct 1541 -355 1527 -352 1515 -347 ct 1503 -341 1494 -332 1486 -320 ct 
1478 -307 1472 -291 1468 -271 ct 1465 -251 1463 -227 1463 -199 ct p ef
1851 -185 m  1851 -164 1853 -145 1857 -128 ct 1862 -110 1868 -95 1877 -82 ct 
1886 -70 1898 -60 1912 -53 ct 1925 -46 1942 -42 1962 -42 ct 1990 -42 2013 -48 2030 -60 ct 
2048 -71 2059 -86 2065 -103 ct 2123 -87 l  2119 -76 2113 -65 2106 -54 ct 2098 -43 2088 -33 2076 -24 ct 
2063 -15 2048 -7 2029 -2 ct 2011 4 1988 7 1962 7 ct 1903 7 1858 -10 1828 -45 ct 
1797 -80 1782 -132 1782 -201 ct 1782 -238 1787 -270 1796 -295 ct 1805 -321 1818 -342 1834 -358 ct 
1850 -374 1869 -386 1890 -393 ct 1912 -400 1935 -404 1959 -404 ct 1992 -404 2020 -399 2042 -388 ct 
2065 -377 2083 -362 2096 -343 ct 2110 -325 2119 -302 2125 -277 ct 2131 -251 2134 -224 2134 -194 ct 
2134 -185 l  1851 -185 l  p
2066 -236 m  2062 -277 2051 -308 2034 -327 ct 2016 -346 1991 -355 1958 -355 ct 
1947 -355 1935 -353 1923 -350 ct 1911 -346 1900 -340 1890 -331 ct 1880 -322 1871 -310 1864 -295 ct 
1857 -279 1853 -259 1852 -236 ct 2066 -236 l  p ef
2191 0 m  2191 -304 l  2191 -313 2191 -321 2191 -330 ct 2191 -338 2191 -347 2190 -355 ct 
2190 -363 2190 -371 2190 -378 ct 2189 -385 2189 -391 2189 -397 ct 2251 -397 l 
2251 -391 2252 -385 2252 -377 ct 2252 -370 2253 -363 2253 -355 ct 2253 -348 2254 -340 2254 -333 ct 
2254 -326 2254 -321 2254 -316 ct 2255 -316 l  2260 -331 2265 -344 2270 -355 ct 
2276 -366 2282 -375 2289 -383 ct 2296 -390 2304 -395 2314 -399 ct 2324 -402 2336 -404 2350 -404 ct 
2355 -404 2360 -404 2365 -403 ct 2370 -402 2374 -401 2376 -400 ct 2376 -340 l 
2372 -341 2367 -342 2361 -343 ct 2355 -343 2348 -344 2341 -344 ct 2326 -344 2313 -340 2303 -333 ct 
2292 -326 2283 -317 2277 -305 ct 2270 -293 2265 -278 2262 -262 ct 2259 -245 2257 -227 2257 -207 ct 
2257 0 l  2191 0 l  p ef
2372 8 m  2523 -544 l  2580 -544 l  2431 8 l  2372 8 l  p ef
2917 -110 m  2917 -91 2913 -75 2906 -60 ct 2899 -46 2888 -33 2875 -24 ct 2861 -14 2844 -6 2824 -1 ct 
2805 4 2782 7 2756 7 ct 2733 7 2712 5 2694 2 ct 2676 -2 2659 -8 2646 -15 ct 2632 -23 2620 -33 2611 -46 ct 
2601 -59 2594 -75 2590 -93 ct 2648 -105 l  2654 -84 2665 -68 2683 -58 ct 2700 -48 2725 -43 2756 -43 ct 
2770 -43 2783 -44 2795 -46 ct 2807 -48 2817 -51 2826 -56 ct 2834 -61 2841 -67 2846 -75 ct 
2850 -83 2853 -93 2853 -105 ct 2853 -117 2850 -127 2844 -134 ct 2839 -142 2831 -148 2821 -154 ct 
2811 -159 2799 -163 2785 -167 ct 2770 -171 2755 -175 2737 -180 ct 2722 -184 2706 -188 2690 -193 ct 
2675 -199 2661 -205 2648 -214 ct 2635 -222 2625 -233 2617 -245 ct 2610 -258 2606 -273 2606 -292 ct 
2606 -328 2619 -356 2644 -375 ct 2670 -394 2708 -403 2757 -403 ct 2801 -403 2835 -395 2861 -380 ct 
2887 -365 2903 -340 2910 -306 ct 2851 -299 l  2848 -309 2844 -317 2839 -324 ct 
2833 -331 2826 -337 2817 -341 ct 2809 -346 2800 -349 2789 -350 ct 2779 -352 2768 -353 2757 -353 ct 
2727 -353 2705 -349 2691 -340 ct 2677 -331 2670 -317 2670 -299 ct 2670 -288 2672 -279 2678 -272 ct 
2683 -265 2690 -259 2700 -254 ct 2709 -250 2720 -245 2733 -242 ct 2747 -238 2761 -235 2777 -231 ct 
2788 -228 2798 -225 2809 -222 ct 2820 -219 2831 -215 2841 -211 ct 2852 -207 2861 -202 2871 -196 ct 
2880 -190 2888 -184 2895 -175 ct 2901 -167 2907 -158 2911 -147 ct 2915 -136 2917 -124 2917 -110 ct 
p ef
pom
0.996 c 16247 15009 m  12821 15009 l  12821 10518 l  19673 10518 l  19673 15009 l 
16247 15009 l  pc
pum
13347 13025 t
0.000 c 547 -261 m  547 -220 542 -184 530 -151 ct 519 -118 502 -90 480 -66 ct 
458 -43 431 -25 399 -12 ct 367 1 331 7 291 7 ct 249 7 211 0 179 -13 ct 147 -26 121 -45 100 -69 ct 
78 -92 62 -121 52 -153 ct 41 -186 36 -222 36 -261 ct 36 -301 41 -337 52 -370 ct 
64 -402 80 -430 102 -453 ct 124 -476 150 -493 182 -506 ct 214 -518 251 -524 292 -524 ct 
333 -524 369 -518 401 -506 ct 433 -493 460 -475 481 -452 ct 503 -429 519 -402 531 -369 ct 
542 -337 547 -301 547 -261 ct p
476 -261 m  476 -292 472 -320 464 -345 ct 456 -371 445 -393 429 -411 ct 414 -429 394 -443 371 -452 ct 
348 -462 322 -467 292 -467 ct 261 -467 234 -462 211 -452 ct 188 -443 168 -429 153 -411 ct 
137 -393 126 -371 118 -345 ct 110 -320 107 -292 107 -261 ct 107 -230 111 -201 118 -176 ct 
126 -150 138 -128 154 -109 ct 169 -90 188 -76 211 -65 ct 235 -55 261 -50 291 -50 ct 
323 -50 351 -55 374 -66 ct 398 -76 417 -91 432 -109 ct 447 -128 458 -150 465 -176 ct 
472 -202 476 -230 476 -261 ct p ef
977 0 m  900 0 l  837 -256 l  835 -262 833 -271 831 -280 ct 829 -290 827 -300 825 -309 ct 
823 -320 820 -331 818 -342 ct 816 -331 813 -320 811 -310 ct 809 -300 807 -291 805 -281 ct 
802 -271 800 -262 798 -254 ct 733 0 l  657 0 l  546 -397 l  611 -397 l  678 -127 l 
680 -122 682 -115 683 -106 ct 685 -98 687 -90 688 -82 ct 690 -73 692 -64 694 -55 ct 
696 -64 698 -73 700 -82 ct 702 -89 704 -97 706 -105 ct 708 -113 710 -119 711 -124 ct 
783 -397 l  854 -397 l  923 -124 l  924 -118 926 -111 928 -103 ct 930 -95 932 -87 934 -80 ct 
936 -72 938 -63 940 -55 ct 942 -64 943 -73 945 -82 ct 947 -89 949 -97 951 -105 ct 
953 -114 954 -121 956 -127 ct 1026 -397 l  1090 -397 l  977 0 l  p ef
1355 0 m  1355 -252 l  1355 -271 1354 -287 1351 -300 ct 1348 -313 1344 -323 1337 -331 ct 
1331 -339 1322 -345 1312 -348 ct 1302 -351 1289 -353 1273 -353 ct 1258 -353 1244 -350 1231 -345 ct 
1219 -339 1208 -331 1199 -321 ct 1190 -311 1183 -298 1178 -282 ct 1173 -267 1171 -250 1171 -230 ct 
1171 0 l  1105 0 l  1105 -313 l  1105 -321 1105 -330 1105 -339 ct 1105 -348 1105 -357 1104 -365 ct 
1104 -373 1104 -380 1104 -386 ct 1103 -392 1103 -395 1103 -395 ct 1165 -395 l 
1165 -394 1166 -391 1166 -386 ct 1166 -380 1166 -374 1167 -367 ct 1167 -361 1167 -354 1168 -347 ct 
1168 -340 1168 -334 1168 -329 ct 1169 -329 l  1175 -340 1182 -351 1190 -360 ct 
1198 -369 1206 -377 1216 -384 ct 1226 -390 1238 -395 1251 -399 ct 1264 -402 1279 -404 1296 -404 ct 
1318 -404 1337 -401 1353 -396 ct 1368 -391 1381 -382 1392 -371 ct 1402 -360 1410 -345 1414 -328 ct 
1419 -310 1421 -289 1421 -264 ct 1421 0 l  1355 0 l  p ef
1542 -185 m  1542 -164 1544 -145 1548 -128 ct 1553 -110 1559 -95 1568 -82 ct 
1577 -70 1589 -60 1603 -53 ct 1616 -46 1633 -42 1653 -42 ct 1681 -42 1704 -48 1721 -60 ct 
1739 -71 1750 -86 1756 -103 ct 1814 -87 l  1810 -76 1804 -65 1797 -54 ct 1789 -43 1779 -33 1767 -24 ct 
1754 -15 1739 -7 1720 -2 ct 1702 4 1679 7 1653 7 ct 1594 7 1549 -10 1519 -45 ct 
1488 -80 1473 -132 1473 -201 ct 1473 -238 1478 -270 1487 -295 ct 1496 -321 1509 -342 1525 -358 ct 
1541 -374 1560 -386 1581 -393 ct 1603 -400 1626 -404 1650 -404 ct 1683 -404 1711 -399 1733 -388 ct 
1756 -377 1774 -362 1787 -343 ct 1801 -325 1810 -302 1816 -277 ct 1822 -251 1825 -224 1825 -194 ct 
1825 -185 l  1542 -185 l  p
1757 -236 m  1753 -277 1742 -308 1725 -327 ct 1707 -346 1682 -355 1649 -355 ct 
1638 -355 1626 -353 1614 -350 ct 1602 -346 1591 -340 1581 -331 ct 1571 -322 1562 -310 1555 -295 ct 
1548 -279 1544 -259 1543 -236 ct 1757 -236 l  p ef
2130 -64 m  2117 -39 2101 -20 2081 -9 ct 2061 1 2036 7 2006 7 ct 1956 7 1919 -10 1896 -44 ct 
1872 -77 1861 -128 1861 -197 ct 1861 -335 1909 -404 2006 -404 ct 2036 -404 2061 -399 2081 -388 ct 
2101 -377 2117 -359 2130 -335 ct 2130 -335 l  2130 -338 2130 -341 2130 -347 ct 
2130 -352 2130 -357 2130 -363 ct 2130 -369 2130 -374 2130 -379 ct 2130 -385 2130 -388 2130 -390 ct 
2130 -544 l  2196 -544 l  2196 -80 l  2196 -71 2196 -62 2196 -53 ct 2196 -44 2196 -36 2196 -29 ct 
2197 -21 2197 -15 2197 -10 ct 2197 -4 2198 -2 2198 -2 ct 2135 -2 l  2134 -4 2134 -8 2134 -12 ct 
2133 -16 2133 -21 2132 -27 ct 2132 -33 2132 -39 2131 -45 ct 2131 -52 2131 -58 2131 -64 ct 
2130 -64 l  p
1930 -199 m  1930 -172 1931 -148 1935 -129 ct 1938 -109 1944 -93 1951 -80 ct 
1959 -68 1969 -59 1980 -53 ct 1992 -47 2006 -44 2023 -44 ct 2040 -44 2056 -47 2069 -52 ct 
2082 -58 2093 -67 2102 -80 ct 2111 -92 2118 -109 2123 -129 ct 2127 -149 2130 -174 2130 -203 ct 
2130 -231 2127 -255 2123 -274 ct 2118 -294 2111 -310 2102 -322 ct 2093 -334 2082 -342 2069 -347 ct 
2056 -353 2041 -355 2024 -355 ct 2008 -355 1994 -352 1982 -347 ct 1970 -341 1961 -332 1953 -320 ct 
1945 -307 1939 -291 1935 -271 ct 1932 -251 1930 -227 1930 -199 ct p ef
2800 -200 m  2800 -61 2751 8 2654 8 ct 2624 8 2599 2 2579 -9 ct 2559 -19 2543 -37 2530 -61 ct 
2530 -61 l  2530 -55 2530 -48 2529 -41 ct 2529 -34 2528 -28 2528 -22 ct 2528 -16 2527 -11 2527 -7 ct 
2527 -2 2526 0 2526 0 ct 2462 0 l  2463 -3 2463 -6 2463 -11 ct 2463 -17 2464 -23 2464 -30 ct 
2464 -38 2464 -46 2464 -55 ct 2464 -63 2465 -72 2465 -82 ct 2465 -544 l  2530 -544 l 
2530 -389 l  2530 -382 2530 -375 2530 -368 ct 2530 -361 2530 -355 2530 -350 ct 
2529 -344 2529 -338 2529 -333 ct 2530 -333 l  2543 -358 2559 -376 2579 -387 ct 
2599 -398 2624 -404 2654 -404 ct 2704 -404 2741 -387 2764 -353 ct 2788 -320 2800 -268 2800 -200 ct 
p
2730 -198 m  2730 -225 2729 -249 2725 -268 ct 2722 -288 2716 -304 2709 -316 ct 
2701 -329 2692 -338 2680 -344 ct 2668 -350 2654 -353 2637 -353 ct 2620 -353 2604 -350 2591 -345 ct 
2578 -339 2567 -330 2558 -317 ct 2549 -305 2542 -289 2537 -268 ct 2533 -248 2530 -223 2530 -194 ct 
2530 -165 2533 -141 2537 -122 ct 2542 -103 2549 -87 2558 -75 ct 2567 -63 2578 -54 2591 -49 ct 
2604 -44 2619 -41 2636 -41 ct 2652 -41 2666 -44 2678 -49 ct 2690 -55 2700 -64 2707 -77 ct 
2715 -89 2721 -105 2725 -125 ct 2729 -145 2730 -169 2730 -198 ct p ef
3024 -1 m  3015 23 3005 45 2996 64 ct 2986 83 2975 99 2963 113 ct 2951 127 2938 137 2923 144 ct 
2909 151 2892 155 2873 155 ct 2865 155 2857 155 2850 155 ct 2843 155 2835 154 2828 152 ct 
2828 102 l  2832 103 2837 104 2843 104 ct 2849 104 2854 104 2858 104 ct 2878 104 2896 97 2912 82 ct 
2929 68 2943 45 2956 14 ct 2962 -2 l  2805 -397 l  2875 -397 l  2959 -178 l 
2961 -171 2964 -162 2968 -151 ct 2972 -140 2976 -129 2979 -118 ct 2983 -107 2986 -97 2989 -89 ct 
2992 -80 2994 -74 2995 -72 ct 2995 -75 2997 -80 3000 -88 ct 3003 -96 3006 -105 3009 -115 ct 
3013 -124 3017 -134 3020 -144 ct 3024 -154 3027 -163 3029 -170 ct 3107 -397 l 
3177 -397 l  3024 -1 l  p ef
3400 -481 m  3400 -544 l  3466 -544 l  3466 -481 l  3400 -481 l  p
3400 0 m  3400 -397 l  3466 -397 l  3466 0 l  3400 0 l  p ef
3807 0 m  3807 -252 l  3807 -271 3806 -287 3803 -300 ct 3800 -313 3796 -323 3789 -331 ct 
3783 -339 3774 -345 3764 -348 ct 3754 -351 3741 -353 3725 -353 ct 3710 -353 3696 -350 3683 -345 ct 
3671 -339 3660 -331 3651 -321 ct 3642 -311 3635 -298 3630 -282 ct 3625 -267 3623 -250 3623 -230 ct 
3623 0 l  3557 0 l  3557 -313 l  3557 -321 3557 -330 3557 -339 ct 3557 -348 3557 -357 3556 -365 ct 
3556 -373 3556 -380 3556 -386 ct 3555 -392 3555 -395 3555 -395 ct 3617 -395 l 
3617 -394 3618 -391 3618 -386 ct 3618 -380 3618 -374 3619 -367 ct 3619 -361 3619 -354 3620 -347 ct 
3620 -340 3620 -334 3620 -329 ct 3621 -329 l  3627 -340 3634 -351 3642 -360 ct 
3650 -369 3658 -377 3668 -384 ct 3678 -390 3690 -395 3703 -399 ct 3716 -402 3731 -404 3748 -404 ct 
3770 -404 3789 -401 3805 -396 ct 3820 -391 3833 -382 3844 -371 ct 3854 -360 3862 -345 3866 -328 ct 
3871 -310 3873 -289 3873 -264 ct 3873 0 l  3807 0 l  p ef
4117 0 m  4039 0 l  3896 -397 l  3966 -397 l  4053 -139 l  4055 -133 4057 -127 4059 -119 ct 
4061 -111 4064 -103 4066 -95 ct 4069 -87 4071 -79 4073 -71 ct 4075 -63 4077 -57 4078 -52 ct 
4080 -57 4082 -63 4084 -71 ct 4086 -79 4089 -86 4091 -95 ct 4094 -103 4096 -110 4099 -118 ct 
4101 -126 4103 -132 4105 -138 ct 4195 -397 l  4265 -397 l  4117 0 l  p ef
4345 -185 m  4345 -164 4347 -145 4351 -128 ct 4356 -110 4362 -95 4371 -82 ct 
4380 -70 4392 -60 4406 -53 ct 4419 -46 4436 -42 4456 -42 ct 4484 -42 4507 -48 4524 -60 ct 
4542 -71 4553 -86 4559 -103 ct 4617 -87 l  4613 -76 4607 -65 4600 -54 ct 4592 -43 4582 -33 4570 -24 ct 
4557 -15 4542 -7 4523 -2 ct 4505 4 4482 7 4456 7 ct 4397 7 4352 -10 4322 -45 ct 
4291 -80 4276 -132 4276 -201 ct 4276 -238 4281 -270 4290 -295 ct 4299 -321 4312 -342 4328 -358 ct 
4344 -374 4363 -386 4384 -393 ct 4406 -400 4429 -404 4453 -404 ct 4486 -404 4514 -399 4536 -388 ct 
4559 -377 4577 -362 4590 -343 ct 4604 -325 4613 -302 4619 -277 ct 4625 -251 4628 -224 4628 -194 ct 
4628 -185 l  4345 -185 l  p
4560 -236 m  4556 -277 4545 -308 4528 -327 ct 4510 -346 4485 -355 4452 -355 ct 
4441 -355 4429 -353 4417 -350 ct 4405 -346 4394 -340 4384 -331 ct 4374 -322 4365 -310 4358 -295 ct 
4351 -279 4347 -259 4346 -236 ct 4560 -236 l  p ef
4980 -110 m  4980 -91 4976 -75 4969 -60 ct 4962 -46 4951 -33 4938 -24 ct 4924 -14 4907 -6 4887 -1 ct 
4868 4 4845 7 4819 7 ct 4796 7 4775 5 4757 2 ct 4739 -2 4722 -8 4709 -15 ct 4695 -23 4683 -33 4674 -46 ct 
4664 -59 4657 -75 4653 -93 ct 4711 -105 l  4717 -84 4728 -68 4746 -58 ct 4763 -48 4788 -43 4819 -43 ct 
4833 -43 4846 -44 4858 -46 ct 4870 -48 4880 -51 4889 -56 ct 4897 -61 4904 -67 4909 -75 ct 
4913 -83 4916 -93 4916 -105 ct 4916 -117 4913 -127 4907 -134 ct 4902 -142 4894 -148 4884 -154 ct 
4874 -159 4862 -163 4848 -167 ct 4833 -171 4818 -175 4800 -180 ct 4785 -184 4769 -188 4753 -193 ct 
4738 -199 4724 -205 4711 -214 ct 4698 -222 4688 -233 4680 -245 ct 4673 -258 4669 -273 4669 -292 ct 
4669 -328 4682 -356 4707 -375 ct 4733 -394 4771 -403 4820 -403 ct 4864 -403 4898 -395 4924 -380 ct 
4950 -365 4966 -340 4973 -306 ct 4914 -299 l  4911 -309 4907 -317 4902 -324 ct 
4896 -331 4889 -337 4880 -341 ct 4872 -346 4863 -349 4852 -350 ct 4842 -352 4831 -353 4820 -353 ct 
4790 -353 4768 -349 4754 -340 ct 4740 -331 4733 -317 4733 -299 ct 4733 -288 4735 -279 4741 -272 ct 
4746 -265 4753 -259 4763 -254 ct 4772 -250 4783 -245 4796 -242 ct 4810 -238 4824 -235 4840 -231 ct 
4851 -228 4861 -225 4872 -222 ct 4883 -219 4894 -215 4904 -211 ct 4915 -207 4924 -202 4934 -196 ct 
4943 -190 4951 -184 4958 -175 ct 4964 -167 4970 -158 4974 -147 ct 4978 -136 4980 -124 4980 -110 ct 
p ef
5187 -3 m  5177 0 5167 2 5156 4 ct 5146 5 5134 6 5120 6 ct 5068 6 5041 -24 5041 -84 ct 
5041 -349 l  4995 -349 l  4995 -397 l  5044 -397 l  5063 -486 l  5107 -486 l 
5107 -397 l  5180 -397 l  5180 -349 l  5107 -349 l  5107 -98 l  5107 -79 5110 -66 5116 -58 ct 
5123 -50 5133 -46 5149 -46 ct 5155 -46 5161 -47 5167 -48 ct 5173 -49 5180 -50 5187 -52 ct 
5187 -3 l  p ef
5565 -199 m  5565 -130 5549 -78 5519 -44 ct 5488 -10 5444 7 5386 7 ct 5358 7 5334 3 5312 -5 ct 
5290 -14 5272 -26 5257 -44 ct 5242 -61 5230 -82 5222 -108 ct 5214 -134 5211 -164 5211 -199 ct 
5211 -336 5270 -404 5388 -404 ct 5419 -404 5445 -400 5468 -391 ct 5490 -383 5508 -370 5523 -353 ct 
5537 -336 5548 -314 5554 -289 ct 5561 -263 5565 -233 5565 -199 ct p
5495 -199 m  5495 -230 5493 -255 5488 -275 ct 5484 -295 5477 -311 5467 -323 ct 
5458 -335 5447 -343 5434 -348 ct 5421 -353 5406 -355 5389 -355 ct 5372 -355 5357 -353 5344 -348 ct 
5330 -343 5319 -334 5309 -322 ct 5299 -310 5292 -294 5287 -274 ct 5282 -254 5280 -229 5280 -199 ct 
5280 -168 5282 -143 5288 -123 ct 5293 -102 5301 -86 5310 -74 ct 5319 -62 5330 -54 5343 -49 ct 
5356 -44 5370 -42 5385 -42 ct 5402 -42 5417 -44 5431 -49 ct 5445 -54 5456 -62 5466 -74 ct 
5475 -86 5483 -102 5488 -122 ct 5493 -143 5495 -168 5495 -199 ct p ef
5620 0 m  5620 -304 l  5620 -313 5620 -321 5620 -330 ct 5620 -338 5620 -347 5619 -355 ct 
5619 -363 5619 -371 5619 -378 ct 5618 -385 5618 -391 5618 -397 ct 5680 -397 l 
5680 -391 5681 -385 5681 -377 ct 5681 -370 5682 -363 5682 -355 ct 5682 -348 5683 -340 5683 -333 ct 
5683 -326 5683 -321 5683 -316 ct 5684 -316 l  5689 -331 5694 -344 5699 -355 ct 
5705 -366 5711 -375 5718 -383 ct 5725 -390 5733 -395 5743 -399 ct 5753 -402 5765 -404 5779 -404 ct 
5784 -404 5789 -404 5794 -403 ct 5799 -402 5803 -401 5805 -400 ct 5805 -340 l 
5801 -341 5796 -342 5790 -343 ct 5784 -343 5777 -344 5770 -344 ct 5755 -344 5742 -340 5732 -333 ct 
5721 -326 5712 -317 5706 -305 ct 5699 -293 5694 -278 5691 -262 ct 5688 -245 5686 -227 5686 -207 ct 
5686 0 l  5620 0 l  p ef
pom
0.996 c 5968 4255 m  2542 4255 l  2542 -236 l  9395 -236 l  9395 4255 l 
5968 4255 l  p ef
5968 4254 m  2542 4254 l  2542 -236 l  9394 -236 l  9394 4254 l  5968 4254 l 
pc
pum
3144 2270 t
0.000 c 461 -146 m  461 -119 456 -97 445 -79 ct 435 -60 421 -45 404 -34 ct 387 -22 366 -13 344 -8 ct 
321 -3 296 0 271 0 ct 62 0 l  62 -517 l  249 -517 l  278 -517 303 -515 326 -510 ct 
348 -505 367 -498 383 -487 ct 398 -477 410 -464 418 -448 ct 427 -432 431 -413 431 -391 ct 
431 -377 429 -363 425 -351 ct 421 -338 414 -326 406 -316 ct 398 -306 388 -297 376 -289 ct 
363 -282 349 -276 333 -272 ct 353 -270 372 -265 388 -258 ct 404 -251 417 -242 428 -231 ct 
438 -220 447 -207 452 -193 ct 458 -178 461 -162 461 -146 ct p
360 -383 m  360 -411 351 -431 332 -443 ct 313 -455 285 -461 249 -461 ct 131 -461 l 
131 -297 l  249 -297 l  270 -297 287 -299 301 -303 ct 315 -307 327 -313 335 -320 ct 
344 -328 351 -337 355 -347 ct 358 -358 360 -370 360 -383 ct p
390 -151 m  390 -167 387 -181 381 -193 ct 375 -204 366 -214 355 -221 ct 344 -228 331 -234 315 -237 ct 
299 -241 281 -242 262 -242 ct 131 -242 l  131 -56 l  267 -56 l  285 -56 302 -58 317 -60 ct 
332 -63 345 -69 355 -76 ct 366 -83 375 -93 381 -105 ct 387 -117 390 -133 390 -151 ct 
p ef
569 -185 m  569 -164 571 -145 575 -128 ct 580 -110 586 -95 595 -82 ct 604 -70 616 -60 630 -53 ct 
643 -46 660 -42 680 -42 ct 708 -42 731 -48 748 -60 ct 766 -71 777 -86 783 -103 ct 
841 -87 l  837 -76 831 -65 824 -54 ct 816 -43 806 -33 794 -24 ct 781 -15 766 -7 747 -2 ct 
729 4 706 7 680 7 ct 621 7 576 -10 546 -45 ct 515 -80 500 -132 500 -201 ct 500 -238 505 -270 514 -295 ct 
523 -321 536 -342 552 -358 ct 568 -374 587 -386 608 -393 ct 630 -400 653 -404 677 -404 ct 
710 -404 738 -399 760 -388 ct 783 -377 801 -362 814 -343 ct 828 -325 837 -302 843 -277 ct 
849 -251 852 -224 852 -194 ct 852 -185 l  569 -185 l  p
784 -236 m  780 -277 769 -308 752 -327 ct 734 -346 709 -355 676 -355 ct 665 -355 653 -353 641 -350 ct 
629 -346 618 -340 608 -331 ct 598 -322 589 -310 582 -295 ct 575 -279 571 -259 570 -236 ct 
784 -236 l  p ef
989 -349 m  989 -1 l  923 -1 l  923 -349 l  868 -349 l  868 -397 l  923 -397 l 
923 -442 l  923 -456 925 -470 927 -482 ct 930 -494 935 -505 942 -514 ct 949 -524 959 -531 972 -536 ct 
984 -541 1000 -544 1020 -544 ct 1028 -544 1036 -544 1044 -543 ct 1053 -542 1060 -541 1066 -540 ct 
1066 -489 l  1062 -490 1058 -491 1052 -491 ct 1047 -492 1042 -492 1037 -492 ct 
1027 -492 1019 -491 1013 -488 ct 1007 -486 1002 -482 999 -477 ct 995 -472 993 -465 991 -458 ct 
990 -451 989 -442 989 -433 ct 989 -397 l  1066 -397 l  1066 -349 l  989 -349 l 
p ef
1439 -199 m  1439 -130 1423 -78 1393 -44 ct 1362 -10 1318 7 1260 7 ct 1232 7 1208 3 1186 -5 ct 
1164 -14 1146 -26 1131 -44 ct 1116 -61 1104 -82 1096 -108 ct 1088 -134 1085 -164 1085 -199 ct 
1085 -336 1144 -404 1262 -404 ct 1293 -404 1319 -400 1342 -391 ct 1364 -383 1382 -370 1397 -353 ct 
1411 -336 1422 -314 1428 -289 ct 1435 -263 1439 -233 1439 -199 ct p
1369 -199 m  1369 -230 1367 -255 1362 -275 ct 1358 -295 1351 -311 1341 -323 ct 
1332 -335 1321 -343 1308 -348 ct 1295 -353 1280 -355 1263 -355 ct 1246 -355 1231 -353 1218 -348 ct 
1204 -343 1193 -334 1183 -322 ct 1173 -310 1166 -294 1161 -274 ct 1156 -254 1154 -229 1154 -199 ct 
1154 -168 1156 -143 1162 -123 ct 1167 -102 1175 -86 1184 -74 ct 1193 -62 1204 -54 1217 -49 ct 
1230 -44 1244 -42 1259 -42 ct 1276 -42 1291 -44 1305 -49 ct 1319 -54 1330 -62 1340 -74 ct 
1349 -86 1357 -102 1362 -122 ct 1367 -143 1369 -168 1369 -199 ct p ef
1493 0 m  1493 -304 l  1493 -313 1493 -321 1493 -330 ct 1493 -338 1493 -347 1492 -355 ct 
1492 -363 1492 -371 1492 -378 ct 1491 -385 1491 -391 1491 -397 ct 1553 -397 l 
1553 -391 1554 -385 1554 -377 ct 1554 -370 1555 -363 1555 -355 ct 1555 -348 1556 -340 1556 -333 ct 
1556 -326 1556 -321 1556 -316 ct 1557 -316 l  1562 -331 1567 -344 1572 -355 ct 
1578 -366 1584 -375 1591 -383 ct 1598 -390 1606 -395 1616 -399 ct 1626 -402 1638 -404 1652 -404 ct 
1657 -404 1662 -404 1667 -403 ct 1672 -402 1676 -401 1678 -400 ct 1678 -340 l 
1674 -341 1669 -342 1663 -343 ct 1657 -343 1650 -344 1643 -344 ct 1628 -344 1615 -340 1605 -333 ct 
1594 -326 1585 -317 1579 -305 ct 1572 -293 1567 -278 1564 -262 ct 1561 -245 1559 -227 1559 -207 ct 
1559 0 l  1493 0 l  p ef
1777 -185 m  1777 -164 1779 -145 1783 -128 ct 1788 -110 1794 -95 1803 -82 ct 
1812 -70 1824 -60 1838 -53 ct 1851 -46 1868 -42 1888 -42 ct 1916 -42 1939 -48 1956 -60 ct 
1974 -71 1985 -86 1991 -103 ct 2049 -87 l  2045 -76 2039 -65 2032 -54 ct 2024 -43 2014 -33 2002 -24 ct 
1989 -15 1974 -7 1955 -2 ct 1937 4 1914 7 1888 7 ct 1829 7 1784 -10 1754 -45 ct 
1723 -80 1708 -132 1708 -201 ct 1708 -238 1713 -270 1722 -295 ct 1731 -321 1744 -342 1760 -358 ct 
1776 -374 1795 -386 1816 -393 ct 1838 -400 1861 -404 1885 -404 ct 1918 -404 1946 -399 1968 -388 ct 
1991 -377 2009 -362 2022 -343 ct 2036 -325 2045 -302 2051 -277 ct 2057 -251 2060 -224 2060 -194 ct 
2060 -185 l  1777 -185 l  p
1992 -236 m  1988 -277 1977 -308 1960 -327 ct 1942 -346 1917 -355 1884 -355 ct 
1873 -355 1861 -353 1849 -350 ct 1837 -346 1826 -340 1816 -331 ct 1806 -322 1797 -310 1790 -295 ct 
1783 -279 1779 -259 1778 -236 ct 1992 -236 l  p ef
2310 -481 m  2310 -544 l  2376 -544 l  2376 -481 l  2310 -481 l  p
2310 0 m  2310 -397 l  2376 -397 l  2376 0 l  2310 0 l  p ef
2716 0 m  2716 -252 l  2716 -271 2715 -287 2712 -300 ct 2709 -313 2705 -323 2698 -331 ct 
2692 -339 2683 -345 2673 -348 ct 2663 -351 2650 -353 2634 -353 ct 2619 -353 2605 -350 2592 -345 ct 
2580 -339 2569 -331 2560 -321 ct 2551 -311 2544 -298 2539 -282 ct 2534 -267 2532 -250 2532 -230 ct 
2532 0 l  2466 0 l  2466 -313 l  2466 -321 2466 -330 2466 -339 ct 2466 -348 2466 -357 2465 -365 ct 
2465 -373 2465 -380 2465 -386 ct 2464 -392 2464 -395 2464 -395 ct 2526 -395 l 
2526 -394 2527 -391 2527 -386 ct 2527 -380 2527 -374 2528 -367 ct 2528 -361 2528 -354 2529 -347 ct 
2529 -340 2529 -334 2529 -329 ct 2530 -329 l  2536 -340 2543 -351 2551 -360 ct 
2559 -369 2567 -377 2577 -384 ct 2587 -390 2599 -395 2612 -399 ct 2625 -402 2640 -404 2657 -404 ct 
2679 -404 2698 -401 2714 -396 ct 2729 -391 2742 -382 2753 -371 ct 2763 -360 2771 -345 2775 -328 ct 
2780 -310 2782 -289 2782 -264 ct 2782 0 l  2716 0 l  p ef
3027 0 m  2949 0 l  2806 -397 l  2876 -397 l  2963 -139 l  2965 -133 2967 -127 2969 -119 ct 
2971 -111 2974 -103 2976 -95 ct 2979 -87 2981 -79 2983 -71 ct 2985 -63 2987 -57 2988 -52 ct 
2990 -57 2992 -63 2994 -71 ct 2996 -79 2999 -86 3001 -95 ct 3004 -103 3006 -110 3009 -118 ct 
3011 -126 3013 -132 3015 -138 ct 3105 -397 l  3175 -397 l  3027 0 l  p ef
3254 -185 m  3254 -164 3256 -145 3260 -128 ct 3265 -110 3271 -95 3280 -82 ct 
3289 -70 3301 -60 3315 -53 ct 3328 -46 3345 -42 3365 -42 ct 3393 -42 3416 -48 3433 -60 ct 
3451 -71 3462 -86 3468 -103 ct 3526 -87 l  3522 -76 3516 -65 3509 -54 ct 3501 -43 3491 -33 3479 -24 ct 
3466 -15 3451 -7 3432 -2 ct 3414 4 3391 7 3365 7 ct 3306 7 3261 -10 3231 -45 ct 
3200 -80 3185 -132 3185 -201 ct 3185 -238 3190 -270 3199 -295 ct 3208 -321 3221 -342 3237 -358 ct 
3253 -374 3272 -386 3293 -393 ct 3315 -400 3338 -404 3362 -404 ct 3395 -404 3423 -399 3445 -388 ct 
3468 -377 3486 -362 3499 -343 ct 3513 -325 3522 -302 3528 -277 ct 3534 -251 3537 -224 3537 -194 ct 
3537 -185 l  3254 -185 l  p
3469 -236 m  3465 -277 3454 -308 3437 -327 ct 3419 -346 3394 -355 3361 -355 ct 
3350 -355 3338 -353 3326 -350 ct 3314 -346 3303 -340 3293 -331 ct 3283 -322 3274 -310 3267 -295 ct 
3260 -279 3256 -259 3255 -236 ct 3469 -236 l  p ef
3890 -110 m  3890 -91 3886 -75 3879 -60 ct 3872 -46 3861 -33 3848 -24 ct 3834 -14 3817 -6 3797 -1 ct 
3778 4 3755 7 3729 7 ct 3706 7 3685 5 3667 2 ct 3649 -2 3632 -8 3619 -15 ct 3605 -23 3593 -33 3584 -46 ct 
3574 -59 3567 -75 3563 -93 ct 3621 -105 l  3627 -84 3638 -68 3656 -58 ct 3673 -48 3698 -43 3729 -43 ct 
3743 -43 3756 -44 3768 -46 ct 3780 -48 3790 -51 3799 -56 ct 3807 -61 3814 -67 3819 -75 ct 
3823 -83 3826 -93 3826 -105 ct 3826 -117 3823 -127 3817 -134 ct 3812 -142 3804 -148 3794 -154 ct 
3784 -159 3772 -163 3758 -167 ct 3743 -171 3728 -175 3710 -180 ct 3695 -184 3679 -188 3663 -193 ct 
3648 -199 3634 -205 3621 -214 ct 3608 -222 3598 -233 3590 -245 ct 3583 -258 3579 -273 3579 -292 ct 
3579 -328 3592 -356 3617 -375 ct 3643 -394 3681 -403 3730 -403 ct 3774 -403 3808 -395 3834 -380 ct 
3860 -365 3876 -340 3883 -306 ct 3824 -299 l  3821 -309 3817 -317 3812 -324 ct 
3806 -331 3799 -337 3790 -341 ct 3782 -346 3773 -349 3762 -350 ct 3752 -352 3741 -353 3730 -353 ct 
3700 -353 3678 -349 3664 -340 ct 3650 -331 3643 -317 3643 -299 ct 3643 -288 3645 -279 3651 -272 ct 
3656 -265 3663 -259 3673 -254 ct 3682 -250 3693 -245 3706 -242 ct 3720 -238 3734 -235 3750 -231 ct 
3761 -228 3771 -225 3782 -222 ct 3793 -219 3804 -215 3814 -211 ct 3825 -207 3834 -202 3844 -196 ct 
3853 -190 3861 -184 3868 -175 ct 3874 -167 3880 -158 3884 -147 ct 3888 -136 3890 -124 3890 -110 ct 
p ef
4096 -3 m  4086 0 4076 2 4065 4 ct 4055 5 4043 6 4029 6 ct 3977 6 3950 -24 3950 -84 ct 
3950 -349 l  3904 -349 l  3904 -397 l  3953 -397 l  3972 -486 l  4016 -486 l 
4016 -397 l  4089 -397 l  4089 -349 l  4016 -349 l  4016 -98 l  4016 -79 4019 -66 4025 -58 ct 
4032 -50 4042 -46 4058 -46 ct 4064 -46 4070 -47 4076 -48 ct 4082 -49 4089 -50 4096 -52 ct 
4096 -3 l  p ef
4370 0 m  4370 -252 l  4370 -271 4369 -287 4367 -300 ct 4364 -313 4360 -323 4354 -331 ct 
4349 -339 4341 -345 4332 -348 ct 4323 -351 4311 -353 4298 -353 ct 4284 -353 4271 -350 4260 -345 ct 
4249 -339 4239 -331 4231 -321 ct 4223 -311 4217 -298 4213 -282 ct 4209 -267 4207 -250 4207 -230 ct 
4207 0 l  4141 0 l  4141 -313 l  4141 -321 4141 -330 4141 -339 ct 4141 -348 4141 -357 4140 -365 ct 
4140 -373 4140 -380 4140 -386 ct 4139 -392 4139 -395 4139 -395 ct 4201 -395 l 
4201 -394 4202 -391 4202 -386 ct 4202 -380 4202 -374 4203 -367 ct 4203 -361 4203 -354 4204 -347 ct 
4204 -340 4204 -334 4204 -329 ct 4205 -329 l  4211 -340 4217 -351 4224 -360 ct 
4231 -369 4239 -377 4248 -384 ct 4257 -390 4268 -395 4280 -399 ct 4291 -402 4305 -404 4321 -404 ct 
4351 -404 4375 -398 4392 -386 ct 4409 -374 4422 -355 4428 -329 ct 4430 -329 l 
4435 -340 4442 -351 4449 -360 ct 4457 -369 4465 -377 4475 -384 ct 4485 -390 4496 -395 4508 -399 ct 
4520 -402 4534 -404 4550 -404 ct 4570 -404 4587 -401 4602 -396 ct 4616 -391 4628 -382 4637 -371 ct 
4647 -360 4653 -345 4658 -328 ct 4662 -310 4664 -289 4664 -264 ct 4664 0 l  4599 0 l 
4599 -252 l  4599 -271 4598 -287 4595 -300 ct 4593 -313 4589 -323 4583 -331 ct 
4577 -339 4570 -345 4561 -348 ct 4551 -351 4540 -353 4527 -353 ct 4513 -353 4500 -350 4489 -345 ct 
4478 -340 4468 -332 4460 -322 ct 4452 -312 4446 -299 4442 -283 ct 4438 -268 4435 -250 4435 -230 ct 
4435 0 l  4370 0 l  p ef
4775 -185 m  4775 -164 4777 -145 4781 -128 ct 4786 -110 4792 -95 4801 -82 ct 
4810 -70 4822 -60 4836 -53 ct 4849 -46 4866 -42 4886 -42 ct 4914 -42 4937 -48 4954 -60 ct 
4972 -71 4983 -86 4989 -103 ct 5047 -87 l  5043 -76 5037 -65 5030 -54 ct 5022 -43 5012 -33 5000 -24 ct 
4987 -15 4972 -7 4953 -2 ct 4935 4 4912 7 4886 7 ct 4827 7 4782 -10 4752 -45 ct 
4721 -80 4706 -132 4706 -201 ct 4706 -238 4711 -270 4720 -295 ct 4729 -321 4742 -342 4758 -358 ct 
4774 -374 4793 -386 4814 -393 ct 4836 -400 4859 -404 4883 -404 ct 4916 -404 4944 -399 4966 -388 ct 
4989 -377 5007 -362 5020 -343 ct 5034 -325 5043 -302 5049 -277 ct 5055 -251 5058 -224 5058 -194 ct 
5058 -185 l  4775 -185 l  p
4990 -236 m  4986 -277 4975 -308 4958 -327 ct 4940 -346 4915 -355 4882 -355 ct 
4871 -355 4859 -353 4847 -350 ct 4835 -346 4824 -340 4814 -331 ct 4804 -322 4795 -310 4788 -295 ct 
4781 -279 4777 -259 4776 -236 ct 4990 -236 l  p ef
5364 0 m  5364 -252 l  5364 -271 5363 -287 5360 -300 ct 5357 -313 5353 -323 5346 -331 ct 
5340 -339 5331 -345 5321 -348 ct 5311 -351 5298 -353 5282 -353 ct 5267 -353 5253 -350 5240 -345 ct 
5228 -339 5217 -331 5208 -321 ct 5199 -311 5192 -298 5187 -282 ct 5182 -267 5180 -250 5180 -230 ct 
5180 0 l  5114 0 l  5114 -313 l  5114 -321 5114 -330 5114 -339 ct 5114 -348 5114 -357 5113 -365 ct 
5113 -373 5113 -380 5113 -386 ct 5112 -392 5112 -395 5112 -395 ct 5174 -395 l 
5174 -394 5175 -391 5175 -386 ct 5175 -380 5175 -374 5176 -367 ct 5176 -361 5176 -354 5177 -347 ct 
5177 -340 5177 -334 5177 -329 ct 5178 -329 l  5184 -340 5191 -351 5199 -360 ct 
5207 -369 5215 -377 5225 -384 ct 5235 -390 5247 -395 5260 -399 ct 5273 -402 5288 -404 5305 -404 ct 
5327 -404 5346 -401 5362 -396 ct 5377 -391 5390 -382 5401 -371 ct 5411 -360 5419 -345 5423 -328 ct 
5428 -310 5430 -289 5430 -264 ct 5430 0 l  5364 0 l  p ef
5654 -3 m  5644 0 5634 2 5623 4 ct 5613 5 5601 6 5587 6 ct 5535 6 5508 -24 5508 -84 ct 
5508 -349 l  5462 -349 l  5462 -397 l  5511 -397 l  5530 -486 l  5574 -486 l 
5574 -397 l  5647 -397 l  5647 -349 l  5574 -349 l  5574 -98 l  5574 -79 5577 -66 5583 -58 ct 
5590 -50 5600 -46 5616 -46 ct 5622 -46 5628 -47 5634 -48 ct 5640 -49 5647 -50 5654 -52 ct 
5654 -3 l  p ef
pom
0.996 c 16358 4136 m  12932 4136 l  12932 -355 l  19784 -355 l  19784 4136 l 
16358 4136 l  p ef
16357 4136 m  12931 4136 l  12931 -354 l  19784 -354 l  19784 4136 l  16357 4136 l 
pc
pum
13825 2152 t
0.000 c 427 0 m  368 -151 l  133 -151 l  74 0 l  1 0 l  212 -517 l  292 -517 l 
499 0 l  427 0 l  p
281 -376 m  277 -386 274 -396 270 -406 ct 267 -416 263 -425 261 -433 ct 258 -441 256 -448 254 -454 ct 
252 -459 251 -462 251 -464 ct 250 -462 249 -459 248 -453 ct 246 -448 244 -441 241 -433 ct 
238 -424 235 -415 231 -405 ct 228 -395 224 -385 220 -375 ct 155 -206 l  348 -206 l 
281 -376 l  p ef
600 -349 m  600 -1 l  534 -1 l  534 -349 l  479 -349 l  479 -397 l  534 -397 l 
534 -442 l  534 -456 536 -470 538 -482 ct 541 -494 546 -505 553 -514 ct 560 -524 570 -531 583 -536 ct 
595 -541 611 -544 631 -544 ct 639 -544 647 -544 655 -543 ct 664 -542 671 -541 677 -540 ct 
677 -489 l  673 -490 669 -491 663 -491 ct 658 -492 653 -492 648 -492 ct 638 -492 630 -491 624 -488 ct 
618 -486 613 -482 610 -477 ct 606 -472 604 -465 602 -458 ct 601 -451 600 -442 600 -433 ct 
600 -397 l  677 -397 l  677 -349 l  600 -349 l  p ef
867 -3 m  857 0 847 2 836 4 ct 826 5 814 6 800 6 ct 748 6 721 -24 721 -84 ct 721 -349 l 
675 -349 l  675 -397 l  724 -397 l  743 -486 l  787 -486 l  787 -397 l 
860 -397 l  860 -349 l  787 -349 l  787 -98 l  787 -79 790 -66 796 -58 ct 
803 -50 813 -46 829 -46 ct 835 -46 841 -47 847 -48 ct 853 -49 860 -50 867 -52 ct 
867 -3 l  p ef
962 -185 m  962 -164 964 -145 968 -128 ct 973 -110 979 -95 988 -82 ct 997 -70 1009 -60 1023 -53 ct 
1036 -46 1053 -42 1073 -42 ct 1101 -42 1124 -48 1141 -60 ct 1159 -71 1170 -86 1176 -103 ct 
1234 -87 l  1230 -76 1224 -65 1217 -54 ct 1209 -43 1199 -33 1187 -24 ct 1174 -15 1159 -7 1140 -2 ct 
1122 4 1099 7 1073 7 ct 1014 7 969 -10 939 -45 ct 908 -80 893 -132 893 -201 ct 
893 -238 898 -270 907 -295 ct 916 -321 929 -342 945 -358 ct 961 -374 980 -386 1001 -393 ct 
1023 -400 1046 -404 1070 -404 ct 1103 -404 1131 -399 1153 -388 ct 1176 -377 1194 -362 1207 -343 ct 
1221 -325 1230 -302 1236 -277 ct 1242 -251 1245 -224 1245 -194 ct 1245 -185 l 
962 -185 l  p
1177 -236 m  1173 -277 1162 -308 1145 -327 ct 1127 -346 1102 -355 1069 -355 ct 
1058 -355 1046 -353 1034 -350 ct 1022 -346 1011 -340 1001 -331 ct 991 -322 982 -310 975 -295 ct 
968 -279 964 -259 963 -236 ct 1177 -236 l  p ef
1301 0 m  1301 -304 l  1301 -313 1301 -321 1301 -330 ct 1301 -338 1301 -347 1300 -355 ct 
1300 -363 1300 -371 1300 -378 ct 1299 -385 1299 -391 1299 -397 ct 1361 -397 l 
1361 -391 1362 -385 1362 -377 ct 1362 -370 1363 -363 1363 -355 ct 1363 -348 1364 -340 1364 -333 ct 
1364 -326 1364 -321 1364 -316 ct 1365 -316 l  1370 -331 1375 -344 1380 -355 ct 
1386 -366 1392 -375 1399 -383 ct 1406 -390 1414 -395 1424 -399 ct 1434 -402 1446 -404 1460 -404 ct 
1465 -404 1470 -404 1475 -403 ct 1480 -402 1484 -401 1486 -400 ct 1486 -340 l 
1482 -341 1477 -342 1471 -343 ct 1465 -343 1458 -344 1451 -344 ct 1436 -344 1423 -340 1413 -333 ct 
1402 -326 1393 -317 1387 -305 ct 1380 -293 1375 -278 1372 -262 ct 1369 -245 1367 -227 1367 -207 ct 
1367 0 l  1301 0 l  p ef
1730 -481 m  1730 -544 l  1796 -544 l  1796 -481 l  1730 -481 l  p
1730 0 m  1730 -397 l  1796 -397 l  1796 0 l  1730 0 l  p ef
2136 0 m  2136 -252 l  2136 -271 2135 -287 2132 -300 ct 2129 -313 2125 -323 2118 -331 ct 
2112 -339 2103 -345 2093 -348 ct 2083 -351 2070 -353 2054 -353 ct 2039 -353 2025 -350 2012 -345 ct 
2000 -339 1989 -331 1980 -321 ct 1971 -311 1964 -298 1959 -282 ct 1954 -267 1952 -250 1952 -230 ct 
1952 0 l  1886 0 l  1886 -313 l  1886 -321 1886 -330 1886 -339 ct 1886 -348 1886 -357 1885 -365 ct 
1885 -373 1885 -380 1885 -386 ct 1884 -392 1884 -395 1884 -395 ct 1946 -395 l 
1946 -394 1947 -391 1947 -386 ct 1947 -380 1947 -374 1948 -367 ct 1948 -361 1948 -354 1949 -347 ct 
1949 -340 1949 -334 1949 -329 ct 1950 -329 l  1956 -340 1963 -351 1971 -360 ct 
1979 -369 1987 -377 1997 -384 ct 2007 -390 2019 -395 2032 -399 ct 2045 -402 2060 -404 2077 -404 ct 
2099 -404 2118 -401 2134 -396 ct 2149 -391 2162 -382 2173 -371 ct 2183 -360 2191 -345 2195 -328 ct 
2200 -310 2202 -289 2202 -264 ct 2202 0 l  2136 0 l  p ef
2447 0 m  2369 0 l  2226 -397 l  2296 -397 l  2383 -139 l  2385 -133 2387 -127 2389 -119 ct 
2391 -111 2394 -103 2396 -95 ct 2399 -87 2401 -79 2403 -71 ct 2405 -63 2407 -57 2408 -52 ct 
2410 -57 2412 -63 2414 -71 ct 2416 -79 2419 -86 2421 -95 ct 2424 -103 2426 -110 2429 -118 ct 
2431 -126 2433 -132 2435 -138 ct 2525 -397 l  2595 -397 l  2447 0 l  p ef
2674 -185 m  2674 -164 2676 -145 2680 -128 ct 2685 -110 2691 -95 2700 -82 ct 
2709 -70 2721 -60 2735 -53 ct 2748 -46 2765 -42 2785 -42 ct 2813 -42 2836 -48 2853 -60 ct 
2871 -71 2882 -86 2888 -103 ct 2946 -87 l  2942 -76 2936 -65 2929 -54 ct 2921 -43 2911 -33 2899 -24 ct 
2886 -15 2871 -7 2852 -2 ct 2834 4 2811 7 2785 7 ct 2726 7 2681 -10 2651 -45 ct 
2620 -80 2605 -132 2605 -201 ct 2605 -238 2610 -270 2619 -295 ct 2628 -321 2641 -342 2657 -358 ct 
2673 -374 2692 -386 2713 -393 ct 2735 -400 2758 -404 2782 -404 ct 2815 -404 2843 -399 2865 -388 ct 
2888 -377 2906 -362 2919 -343 ct 2933 -325 2942 -302 2948 -277 ct 2954 -251 2957 -224 2957 -194 ct 
2957 -185 l  2674 -185 l  p
2889 -236 m  2885 -277 2874 -308 2857 -327 ct 2839 -346 2814 -355 2781 -355 ct 
2770 -355 2758 -353 2746 -350 ct 2734 -346 2723 -340 2713 -331 ct 2703 -322 2694 -310 2687 -295 ct 
2680 -279 2676 -259 2675 -236 ct 2889 -236 l  p ef
3310 -110 m  3310 -91 3306 -75 3299 -60 ct 3292 -46 3281 -33 3268 -24 ct 3254 -14 3237 -6 3217 -1 ct 
3198 4 3175 7 3149 7 ct 3126 7 3105 5 3087 2 ct 3069 -2 3052 -8 3039 -15 ct 3025 -23 3013 -33 3004 -46 ct 
2994 -59 2987 -75 2983 -93 ct 3041 -105 l  3047 -84 3058 -68 3076 -58 ct 3093 -48 3118 -43 3149 -43 ct 
3163 -43 3176 -44 3188 -46 ct 3200 -48 3210 -51 3219 -56 ct 3227 -61 3234 -67 3239 -75 ct 
3243 -83 3246 -93 3246 -105 ct 3246 -117 3243 -127 3237 -134 ct 3232 -142 3224 -148 3214 -154 ct 
3204 -159 3192 -163 3178 -167 ct 3163 -171 3148 -175 3130 -180 ct 3115 -184 3099 -188 3083 -193 ct 
3068 -199 3054 -205 3041 -214 ct 3028 -222 3018 -233 3010 -245 ct 3003 -258 2999 -273 2999 -292 ct 
2999 -328 3012 -356 3037 -375 ct 3063 -394 3101 -403 3150 -403 ct 3194 -403 3228 -395 3254 -380 ct 
3280 -365 3296 -340 3303 -306 ct 3244 -299 l  3241 -309 3237 -317 3232 -324 ct 
3226 -331 3219 -337 3210 -341 ct 3202 -346 3193 -349 3182 -350 ct 3172 -352 3161 -353 3150 -353 ct 
3120 -353 3098 -349 3084 -340 ct 3070 -331 3063 -317 3063 -299 ct 3063 -288 3065 -279 3071 -272 ct 
3076 -265 3083 -259 3093 -254 ct 3102 -250 3113 -245 3126 -242 ct 3140 -238 3154 -235 3170 -231 ct 
3181 -228 3191 -225 3202 -222 ct 3213 -219 3224 -215 3234 -211 ct 3245 -207 3254 -202 3264 -196 ct 
3273 -190 3281 -184 3288 -175 ct 3294 -167 3300 -158 3304 -147 ct 3308 -136 3310 -124 3310 -110 ct 
p ef
3515 -3 m  3505 0 3495 2 3484 4 ct 3474 5 3462 6 3448 6 ct 3396 6 3369 -24 3369 -84 ct 
3369 -349 l  3323 -349 l  3323 -397 l  3372 -397 l  3391 -486 l  3435 -486 l 
3435 -397 l  3508 -397 l  3508 -349 l  3435 -349 l  3435 -98 l  3435 -79 3438 -66 3444 -58 ct 
3451 -50 3461 -46 3477 -46 ct 3483 -46 3489 -47 3495 -48 ct 3501 -49 3508 -50 3515 -52 ct 
3515 -3 l  p ef
3790 0 m  3790 -252 l  3790 -271 3789 -287 3787 -300 ct 3784 -313 3780 -323 3774 -331 ct 
3769 -339 3761 -345 3752 -348 ct 3743 -351 3731 -353 3718 -353 ct 3704 -353 3691 -350 3680 -345 ct 
3669 -339 3659 -331 3651 -321 ct 3643 -311 3637 -298 3633 -282 ct 3629 -267 3627 -250 3627 -230 ct 
3627 0 l  3561 0 l  3561 -313 l  3561 -321 3561 -330 3561 -339 ct 3561 -348 3561 -357 3560 -365 ct 
3560 -373 3560 -380 3560 -386 ct 3559 -392 3559 -395 3559 -395 ct 3621 -395 l 
3621 -394 3622 -391 3622 -386 ct 3622 -380 3622 -374 3623 -367 ct 3623 -361 3623 -354 3624 -347 ct 
3624 -340 3624 -334 3624 -329 ct 3625 -329 l  3631 -340 3637 -351 3644 -360 ct 
3651 -369 3659 -377 3668 -384 ct 3677 -390 3688 -395 3700 -399 ct 3711 -402 3725 -404 3741 -404 ct 
3771 -404 3795 -398 3812 -386 ct 3829 -374 3842 -355 3848 -329 ct 3850 -329 l 
3855 -340 3862 -351 3869 -360 ct 3877 -369 3885 -377 3895 -384 ct 3905 -390 3916 -395 3928 -399 ct 
3940 -402 3954 -404 3970 -404 ct 3990 -404 4007 -401 4022 -396 ct 4036 -391 4048 -382 4057 -371 ct 
4067 -360 4073 -345 4078 -328 ct 4082 -310 4084 -289 4084 -264 ct 4084 0 l  4019 0 l 
4019 -252 l  4019 -271 4018 -287 4015 -300 ct 4013 -313 4009 -323 4003 -331 ct 
3997 -339 3990 -345 3981 -348 ct 3971 -351 3960 -353 3947 -353 ct 3933 -353 3920 -350 3909 -345 ct 
3898 -340 3888 -332 3880 -322 ct 3872 -312 3866 -299 3862 -283 ct 3858 -268 3855 -250 3855 -230 ct 
3855 0 l  3790 0 l  p ef
4195 -185 m  4195 -164 4197 -145 4201 -128 ct 4206 -110 4212 -95 4221 -82 ct 
4230 -70 4242 -60 4256 -53 ct 4269 -46 4286 -42 4306 -42 ct 4334 -42 4357 -48 4374 -60 ct 
4392 -71 4403 -86 4409 -103 ct 4467 -87 l  4463 -76 4457 -65 4450 -54 ct 4442 -43 4432 -33 4420 -24 ct 
4407 -15 4392 -7 4373 -2 ct 4355 4 4332 7 4306 7 ct 4247 7 4202 -10 4172 -45 ct 
4141 -80 4126 -132 4126 -201 ct 4126 -238 4131 -270 4140 -295 ct 4149 -321 4162 -342 4178 -358 ct 
4194 -374 4213 -386 4234 -393 ct 4256 -400 4279 -404 4303 -404 ct 4336 -404 4364 -399 4386 -388 ct 
4409 -377 4427 -362 4440 -343 ct 4454 -325 4463 -302 4469 -277 ct 4475 -251 4478 -224 4478 -194 ct 
4478 -185 l  4195 -185 l  p
4410 -236 m  4406 -277 4395 -308 4378 -327 ct 4360 -346 4335 -355 4302 -355 ct 
4291 -355 4279 -353 4267 -350 ct 4255 -346 4244 -340 4234 -331 ct 4224 -322 4215 -310 4208 -295 ct 
4201 -279 4197 -259 4196 -236 ct 4410 -236 l  p ef
4785 0 m  4785 -252 l  4785 -271 4784 -287 4781 -300 ct 4778 -313 4774 -323 4767 -331 ct 
4761 -339 4752 -345 4742 -348 ct 4732 -351 4719 -353 4703 -353 ct 4688 -353 4674 -350 4661 -345 ct 
4649 -339 4638 -331 4629 -321 ct 4620 -311 4613 -298 4608 -282 ct 4603 -267 4601 -250 4601 -230 ct 
4601 0 l  4535 0 l  4535 -313 l  4535 -321 4535 -330 4535 -339 ct 4535 -348 4535 -357 4534 -365 ct 
4534 -373 4534 -380 4534 -386 ct 4533 -392 4533 -395 4533 -395 ct 4595 -395 l 
4595 -394 4596 -391 4596 -386 ct 4596 -380 4596 -374 4597 -367 ct 4597 -361 4597 -354 4598 -347 ct 
4598 -340 4598 -334 4598 -329 ct 4599 -329 l  4605 -340 4612 -351 4620 -360 ct 
4628 -369 4636 -377 4646 -384 ct 4656 -390 4668 -395 4681 -399 ct 4694 -402 4709 -404 4726 -404 ct 
4748 -404 4767 -401 4783 -396 ct 4798 -391 4811 -382 4822 -371 ct 4832 -360 4840 -345 4844 -328 ct 
4849 -310 4851 -289 4851 -264 ct 4851 0 l  4785 0 l  p ef
5074 -3 m  5064 0 5054 2 5043 4 ct 5033 5 5021 6 5007 6 ct 4955 6 4928 -24 4928 -84 ct 
4928 -349 l  4882 -349 l  4882 -397 l  4931 -397 l  4950 -486 l  4994 -486 l 
4994 -397 l  5067 -397 l  5067 -349 l  4994 -349 l  4994 -98 l  4994 -79 4997 -66 5003 -58 ct 
5010 -50 5020 -46 5036 -46 ct 5042 -46 5048 -47 5054 -48 ct 5060 -49 5067 -50 5074 -52 ct 
5074 -3 l  p ef
pom
0.996 c 16136 11581 m  12710 11581 l  12710 7090 l  19563 7090 l  19563 11581 l 
16136 11581 l  pc
pum
14462 9177 t
0.000 c 547 -261 m  547 -220 542 -184 530 -151 ct 519 -118 502 -90 480 -66 ct 
458 -43 431 -25 399 -12 ct 367 1 331 7 291 7 ct 249 7 211 0 179 -13 ct 147 -26 121 -45 100 -69 ct 
78 -92 62 -121 52 -153 ct 41 -186 36 -222 36 -261 ct 36 -301 41 -337 52 -370 ct 
64 -402 80 -430 102 -453 ct 124 -476 150 -493 182 -506 ct 214 -518 251 -524 292 -524 ct 
333 -524 369 -518 401 -506 ct 433 -493 460 -475 481 -452 ct 503 -429 519 -402 531 -369 ct 
542 -337 547 -301 547 -261 ct p
476 -261 m  476 -292 472 -320 464 -345 ct 456 -371 445 -393 429 -411 ct 414 -429 394 -443 371 -452 ct 
348 -462 322 -467 292 -467 ct 261 -467 234 -462 211 -452 ct 188 -443 168 -429 153 -411 ct 
137 -393 126 -371 118 -345 ct 110 -320 107 -292 107 -261 ct 107 -230 111 -201 118 -176 ct 
126 -150 138 -128 154 -109 ct 169 -90 188 -76 211 -65 ct 235 -55 261 -50 291 -50 ct 
323 -50 351 -55 374 -66 ct 398 -76 417 -91 432 -109 ct 447 -128 458 -150 465 -176 ct 
472 -202 476 -230 476 -261 ct p ef
977 0 m  900 0 l  837 -256 l  835 -262 833 -271 831 -280 ct 829 -290 827 -300 825 -309 ct 
823 -320 820 -331 818 -342 ct 816 -331 813 -320 811 -310 ct 809 -300 807 -291 805 -281 ct 
802 -271 800 -262 798 -254 ct 733 0 l  657 0 l  546 -397 l  611 -397 l  678 -127 l 
680 -122 682 -115 683 -106 ct 685 -98 687 -90 688 -82 ct 690 -73 692 -64 694 -55 ct 
696 -64 698 -73 700 -82 ct 702 -89 704 -97 706 -105 ct 708 -113 710 -119 711 -124 ct 
783 -397 l  854 -397 l  923 -124 l  924 -118 926 -111 928 -103 ct 930 -95 932 -87 934 -80 ct 
936 -72 938 -63 940 -55 ct 942 -64 943 -73 945 -82 ct 947 -89 949 -97 951 -105 ct 
953 -114 954 -121 956 -127 ct 1026 -397 l  1090 -397 l  977 0 l  p ef
1355 0 m  1355 -252 l  1355 -271 1354 -287 1351 -300 ct 1348 -313 1344 -323 1337 -331 ct 
1331 -339 1322 -345 1312 -348 ct 1302 -351 1289 -353 1273 -353 ct 1258 -353 1244 -350 1231 -345 ct 
1219 -339 1208 -331 1199 -321 ct 1190 -311 1183 -298 1178 -282 ct 1173 -267 1171 -250 1171 -230 ct 
1171 0 l  1105 0 l  1105 -313 l  1105 -321 1105 -330 1105 -339 ct 1105 -348 1105 -357 1104 -365 ct 
1104 -373 1104 -380 1104 -386 ct 1103 -392 1103 -395 1103 -395 ct 1165 -395 l 
1165 -394 1166 -391 1166 -386 ct 1166 -380 1166 -374 1167 -367 ct 1167 -361 1167 -354 1168 -347 ct 
1168 -340 1168 -334 1168 -329 ct 1169 -329 l  1175 -340 1182 -351 1190 -360 ct 
1198 -369 1206 -377 1216 -384 ct 1226 -390 1238 -395 1251 -399 ct 1264 -402 1279 -404 1296 -404 ct 
1318 -404 1337 -401 1353 -396 ct 1368 -391 1381 -382 1392 -371 ct 1402 -360 1410 -345 1414 -328 ct 
1419 -310 1421 -289 1421 -264 ct 1421 0 l  1355 0 l  p ef
1542 -185 m  1542 -164 1544 -145 1548 -128 ct 1553 -110 1559 -95 1568 -82 ct 
1577 -70 1589 -60 1603 -53 ct 1616 -46 1633 -42 1653 -42 ct 1681 -42 1704 -48 1721 -60 ct 
1739 -71 1750 -86 1756 -103 ct 1814 -87 l  1810 -76 1804 -65 1797 -54 ct 1789 -43 1779 -33 1767 -24 ct 
1754 -15 1739 -7 1720 -2 ct 1702 4 1679 7 1653 7 ct 1594 7 1549 -10 1519 -45 ct 
1488 -80 1473 -132 1473 -201 ct 1473 -238 1478 -270 1487 -295 ct 1496 -321 1509 -342 1525 -358 ct 
1541 -374 1560 -386 1581 -393 ct 1603 -400 1626 -404 1650 -404 ct 1683 -404 1711 -399 1733 -388 ct 
1756 -377 1774 -362 1787 -343 ct 1801 -325 1810 -302 1816 -277 ct 1822 -251 1825 -224 1825 -194 ct 
1825 -185 l  1542 -185 l  p
1757 -236 m  1753 -277 1742 -308 1725 -327 ct 1707 -346 1682 -355 1649 -355 ct 
1638 -355 1626 -353 1614 -350 ct 1602 -346 1591 -340 1581 -331 ct 1571 -322 1562 -310 1555 -295 ct 
1548 -279 1544 -259 1543 -236 ct 1757 -236 l  p ef
2130 -64 m  2117 -39 2101 -20 2081 -9 ct 2061 1 2036 7 2006 7 ct 1956 7 1919 -10 1896 -44 ct 
1872 -77 1861 -128 1861 -197 ct 1861 -335 1909 -404 2006 -404 ct 2036 -404 2061 -399 2081 -388 ct 
2101 -377 2117 -359 2130 -335 ct 2130 -335 l  2130 -338 2130 -341 2130 -347 ct 
2130 -352 2130 -357 2130 -363 ct 2130 -369 2130 -374 2130 -379 ct 2130 -385 2130 -388 2130 -390 ct 
2130 -544 l  2196 -544 l  2196 -80 l  2196 -71 2196 -62 2196 -53 ct 2196 -44 2196 -36 2196 -29 ct 
2197 -21 2197 -15 2197 -10 ct 2197 -4 2198 -2 2198 -2 ct 2135 -2 l  2134 -4 2134 -8 2134 -12 ct 
2133 -16 2133 -21 2132 -27 ct 2132 -33 2132 -39 2131 -45 ct 2131 -52 2131 -58 2131 -64 ct 
2130 -64 l  p
1930 -199 m  1930 -172 1931 -148 1935 -129 ct 1938 -109 1944 -93 1951 -80 ct 
1959 -68 1969 -59 1980 -53 ct 1992 -47 2006 -44 2023 -44 ct 2040 -44 2056 -47 2069 -52 ct 
2082 -58 2093 -67 2102 -80 ct 2111 -92 2118 -109 2123 -129 ct 2127 -149 2130 -174 2130 -203 ct 
2130 -231 2127 -255 2123 -274 ct 2118 -294 2111 -310 2102 -322 ct 2093 -334 2082 -342 2069 -347 ct 
2056 -353 2041 -355 2024 -355 ct 2008 -355 1994 -352 1982 -347 ct 1970 -341 1961 -332 1953 -320 ct 
1945 -307 1939 -291 1935 -271 ct 1932 -251 1930 -227 1930 -199 ct p ef
2800 -200 m  2800 -61 2751 8 2654 8 ct 2624 8 2599 2 2579 -9 ct 2559 -19 2543 -37 2530 -61 ct 
2530 -61 l  2530 -55 2530 -48 2529 -41 ct 2529 -34 2528 -28 2528 -22 ct 2528 -16 2527 -11 2527 -7 ct 
2527 -2 2526 0 2526 0 ct 2462 0 l  2463 -3 2463 -6 2463 -11 ct 2463 -17 2464 -23 2464 -30 ct 
2464 -38 2464 -46 2464 -55 ct 2464 -63 2465 -72 2465 -82 ct 2465 -544 l  2530 -544 l 
2530 -389 l  2530 -382 2530 -375 2530 -368 ct 2530 -361 2530 -355 2530 -350 ct 
2529 -344 2529 -338 2529 -333 ct 2530 -333 l  2543 -358 2559 -376 2579 -387 ct 
2599 -398 2624 -404 2654 -404 ct 2704 -404 2741 -387 2764 -353 ct 2788 -320 2800 -268 2800 -200 ct 
p
2730 -198 m  2730 -225 2729 -249 2725 -268 ct 2722 -288 2716 -304 2709 -316 ct 
2701 -329 2692 -338 2680 -344 ct 2668 -350 2654 -353 2637 -353 ct 2620 -353 2604 -350 2591 -345 ct 
2578 -339 2567 -330 2558 -317 ct 2549 -305 2542 -289 2537 -268 ct 2533 -248 2530 -223 2530 -194 ct 
2530 -165 2533 -141 2537 -122 ct 2542 -103 2549 -87 2558 -75 ct 2567 -63 2578 -54 2591 -49 ct 
2604 -44 2619 -41 2636 -41 ct 2652 -41 2666 -44 2678 -49 ct 2690 -55 2700 -64 2707 -77 ct 
2715 -89 2721 -105 2725 -125 ct 2729 -145 2730 -169 2730 -198 ct p ef
3024 -1 m  3015 23 3005 45 2996 64 ct 2986 83 2975 99 2963 113 ct 2951 127 2938 137 2923 144 ct 
2909 151 2892 155 2873 155 ct 2865 155 2857 155 2850 155 ct 2843 155 2835 154 2828 152 ct 
2828 102 l  2832 103 2837 104 2843 104 ct 2849 104 2854 104 2858 104 ct 2878 104 2896 97 2912 82 ct 
2929 68 2943 45 2956 14 ct 2962 -2 l  2805 -397 l  2875 -397 l  2959 -178 l 
2961 -171 2964 -162 2968 -151 ct 2972 -140 2976 -129 2979 -118 ct 2983 -107 2986 -97 2989 -89 ct 
2992 -80 2994 -74 2995 -72 ct 2995 -75 2997 -80 3000 -88 ct 3003 -96 3006 -105 3009 -115 ct 
3013 -124 3017 -134 3020 -144 ct 3024 -154 3027 -163 3029 -170 ct 3107 -397 l 
3177 -397 l  3024 -1 l  p ef
pom
pum
14677 10017 t
132 -349 m  132 -1 l  66 -1 l  66 -349 l  11 -349 l  11 -397 l  66 -397 l 
66 -442 l  66 -456 68 -470 70 -482 ct 73 -494 78 -505 85 -514 ct 92 -524 102 -531 115 -536 ct 
127 -541 143 -544 163 -544 ct 171 -544 179 -544 187 -543 ct 196 -542 203 -541 209 -540 ct 
209 -489 l  205 -490 201 -491 195 -491 ct 190 -492 185 -492 180 -492 ct 170 -492 162 -491 156 -488 ct 
150 -486 145 -482 142 -477 ct 138 -472 136 -465 134 -458 ct 133 -451 132 -442 132 -433 ct 
132 -397 l  209 -397 l  209 -349 l  132 -349 l  p ef
583 -199 m  583 -130 567 -78 537 -44 ct 506 -10 462 7 404 7 ct 376 7 352 3 330 -5 ct 
308 -14 290 -26 275 -44 ct 260 -61 248 -82 240 -108 ct 232 -134 229 -164 229 -199 ct 
229 -336 288 -404 406 -404 ct 437 -404 463 -400 486 -391 ct 508 -383 526 -370 541 -353 ct 
555 -336 566 -314 572 -289 ct 579 -263 583 -233 583 -199 ct p
513 -199 m  513 -230 511 -255 506 -275 ct 502 -295 495 -311 485 -323 ct 476 -335 465 -343 452 -348 ct 
439 -353 424 -355 407 -355 ct 390 -355 375 -353 362 -348 ct 348 -343 337 -334 327 -322 ct 
317 -310 310 -294 305 -274 ct 300 -254 298 -229 298 -199 ct 298 -168 300 -143 306 -123 ct 
311 -102 319 -86 328 -74 ct 337 -62 348 -54 361 -49 ct 374 -44 388 -42 403 -42 ct 
420 -42 435 -44 449 -49 ct 463 -54 474 -62 484 -74 ct 493 -86 501 -102 506 -122 ct 
511 -143 513 -168 513 -199 ct p ef
700 -397 m  700 -146 l  700 -126 701 -110 704 -97 ct 707 -84 712 -74 718 -66 ct 
724 -58 733 -52 743 -49 ct 753 -46 766 -44 782 -44 ct 797 -44 811 -47 824 -52 ct 
837 -58 847 -66 856 -76 ct 865 -86 872 -99 877 -115 ct 882 -130 884 -147 884 -167 ct 
884 -397 l  950 -397 l  950 -84 l  950 -76 950 -67 950 -58 ct 950 -48 951 -40 951 -31 ct 
951 -23 951 -16 952 -10 ct 952 -4 952 -1 952 -1 ct 890 -1 l  890 -3 890 -6 889 -11 ct 
889 -16 889 -23 888 -29 ct 888 -36 888 -43 887 -50 ct 887 -57 887 -63 887 -68 ct 
886 -68 l  880 -57 873 -46 865 -37 ct 858 -28 849 -20 839 -13 ct 829 -7 817 -2 804 2 ct 
791 5 776 7 759 7 ct 737 7 718 4 703 -1 ct 687 -6 674 -15 663 -26 ct 653 -37 646 -52 641 -69 ct 
636 -87 634 -108 634 -133 ct 634 -397 l  700 -397 l  p ef
1276 0 m  1276 -252 l  1276 -271 1275 -287 1272 -300 ct 1269 -313 1265 -323 1258 -331 ct 
1252 -339 1243 -345 1233 -348 ct 1223 -351 1210 -353 1194 -353 ct 1179 -353 1165 -350 1152 -345 ct 
1140 -339 1129 -331 1120 -321 ct 1111 -311 1104 -298 1099 -282 ct 1094 -267 1092 -250 1092 -230 ct 
1092 0 l  1026 0 l  1026 -313 l  1026 -321 1026 -330 1026 -339 ct 1026 -348 1026 -357 1025 -365 ct 
1025 -373 1025 -380 1025 -386 ct 1024 -392 1024 -395 1024 -395 ct 1086 -395 l 
1086 -394 1087 -391 1087 -386 ct 1087 -380 1087 -374 1088 -367 ct 1088 -361 1088 -354 1089 -347 ct 
1089 -340 1089 -334 1089 -329 ct 1090 -329 l  1096 -340 1103 -351 1111 -360 ct 
1119 -369 1127 -377 1137 -384 ct 1147 -390 1159 -395 1172 -399 ct 1185 -402 1200 -404 1217 -404 ct 
1239 -404 1258 -401 1274 -396 ct 1289 -391 1302 -382 1313 -371 ct 1323 -360 1331 -345 1335 -328 ct 
1340 -310 1342 -289 1342 -264 ct 1342 0 l  1276 0 l  p ef
1663 -64 m  1650 -39 1634 -20 1614 -9 ct 1594 1 1569 7 1539 7 ct 1489 7 1452 -10 1429 -44 ct 
1405 -77 1394 -128 1394 -197 ct 1394 -335 1442 -404 1539 -404 ct 1569 -404 1594 -399 1614 -388 ct 
1634 -377 1650 -359 1663 -335 ct 1663 -335 l  1663 -338 1663 -341 1663 -347 ct 
1663 -352 1663 -357 1663 -363 ct 1663 -369 1663 -374 1663 -379 ct 1663 -385 1663 -388 1663 -390 ct 
1663 -544 l  1729 -544 l  1729 -80 l  1729 -71 1729 -62 1729 -53 ct 1729 -44 1729 -36 1729 -29 ct 
1730 -21 1730 -15 1730 -10 ct 1730 -4 1731 -2 1731 -2 ct 1668 -2 l  1667 -4 1667 -8 1667 -12 ct 
1666 -16 1666 -21 1665 -27 ct 1665 -33 1665 -39 1664 -45 ct 1664 -52 1664 -58 1664 -64 ct 
1663 -64 l  p
1463 -199 m  1463 -172 1464 -148 1468 -129 ct 1471 -109 1477 -93 1484 -80 ct 
1492 -68 1502 -59 1513 -53 ct 1525 -47 1539 -44 1556 -44 ct 1573 -44 1589 -47 1602 -52 ct 
1615 -58 1626 -67 1635 -80 ct 1644 -92 1651 -109 1656 -129 ct 1660 -149 1663 -174 1663 -203 ct 
1663 -231 1660 -255 1656 -274 ct 1651 -294 1644 -310 1635 -322 ct 1626 -334 1615 -342 1602 -347 ct 
1589 -353 1574 -355 1557 -355 ct 1541 -355 1527 -352 1515 -347 ct 1503 -341 1494 -332 1486 -320 ct 
1478 -307 1472 -291 1468 -271 ct 1465 -251 1463 -227 1463 -199 ct p ef
1851 -185 m  1851 -164 1853 -145 1857 -128 ct 1862 -110 1868 -95 1877 -82 ct 
1886 -70 1898 -60 1912 -53 ct 1925 -46 1942 -42 1962 -42 ct 1990 -42 2013 -48 2030 -60 ct 
2048 -71 2059 -86 2065 -103 ct 2123 -87 l  2119 -76 2113 -65 2106 -54 ct 2098 -43 2088 -33 2076 -24 ct 
2063 -15 2048 -7 2029 -2 ct 2011 4 1988 7 1962 7 ct 1903 7 1858 -10 1828 -45 ct 
1797 -80 1782 -132 1782 -201 ct 1782 -238 1787 -270 1796 -295 ct 1805 -321 1818 -342 1834 -358 ct 
1850 -374 1869 -386 1890 -393 ct 1912 -400 1935 -404 1959 -404 ct 1992 -404 2020 -399 2042 -388 ct 
2065 -377 2083 -362 2096 -343 ct 2110 -325 2119 -302 2125 -277 ct 2131 -251 2134 -224 2134 -194 ct 
2134 -185 l  1851 -185 l  p
2066 -236 m  2062 -277 2051 -308 2034 -327 ct 2016 -346 1991 -355 1958 -355 ct 
1947 -355 1935 -353 1923 -350 ct 1911 -346 1900 -340 1890 -331 ct 1880 -322 1871 -310 1864 -295 ct 
1857 -279 1853 -259 1852 -236 ct 2066 -236 l  p ef
2191 0 m  2191 -304 l  2191 -313 2191 -321 2191 -330 ct 2191 -338 2191 -347 2190 -355 ct 
2190 -363 2190 -371 2190 -378 ct 2189 -385 2189 -391 2189 -397 ct 2251 -397 l 
2251 -391 2252 -385 2252 -377 ct 2252 -370 2253 -363 2253 -355 ct 2253 -348 2254 -340 2254 -333 ct 
2254 -326 2254 -321 2254 -316 ct 2255 -316 l  2260 -331 2265 -344 2270 -355 ct 
2276 -366 2282 -375 2289 -383 ct 2296 -390 2304 -395 2314 -399 ct 2324 -402 2336 -404 2350 -404 ct 
2355 -404 2360 -404 2365 -403 ct 2370 -402 2374 -401 2376 -400 ct 2376 -340 l 
2372 -341 2367 -342 2361 -343 ct 2355 -343 2348 -344 2341 -344 ct 2326 -344 2313 -340 2303 -333 ct 
2292 -326 2283 -317 2277 -305 ct 2270 -293 2265 -278 2262 -262 ct 2259 -245 2257 -227 2257 -207 ct 
2257 0 l  2191 0 l  p ef
2372 8 m  2523 -544 l  2580 -544 l  2431 8 l  2372 8 l  p ef
2917 -110 m  2917 -91 2913 -75 2906 -60 ct 2899 -46 2888 -33 2875 -24 ct 2861 -14 2844 -6 2824 -1 ct 
2805 4 2782 7 2756 7 ct 2733 7 2712 5 2694 2 ct 2676 -2 2659 -8 2646 -15 ct 2632 -23 2620 -33 2611 -46 ct 
2601 -59 2594 -75 2590 -93 ct 2648 -105 l  2654 -84 2665 -68 2683 -58 ct 2700 -48 2725 -43 2756 -43 ct 
2770 -43 2783 -44 2795 -46 ct 2807 -48 2817 -51 2826 -56 ct 2834 -61 2841 -67 2846 -75 ct 
2850 -83 2853 -93 2853 -105 ct 2853 -117 2850 -127 2844 -134 ct 2839 -142 2831 -148 2821 -154 ct 
2811 -159 2799 -163 2785 -167 ct 2770 -171 2755 -175 2737 -180 ct 2722 -184 2706 -188 2690 -193 ct 
2675 -199 2661 -205 2648 -214 ct 2635 -222 2625 -233 2617 -245 ct 2610 -258 2606 -273 2606 -292 ct 
2606 -328 2619 -356 2644 -375 ct 2670 -394 2708 -403 2757 -403 ct 2801 -403 2835 -395 2861 -380 ct 
2887 -365 2903 -340 2910 -306 ct 2851 -299 l  2848 -309 2844 -317 2839 -324 ct 
2833 -331 2826 -337 2817 -341 ct 2809 -346 2800 -349 2789 -350 ct 2779 -352 2768 -353 2757 -353 ct 
2727 -353 2705 -349 2691 -340 ct 2677 -331 2670 -317 2670 -299 ct 2670 -288 2672 -279 2678 -272 ct 
2683 -265 2690 -259 2700 -254 ct 2709 -250 2720 -245 2733 -242 ct 2747 -238 2761 -235 2777 -231 ct 
2788 -228 2798 -225 2809 -222 ct 2820 -219 2831 -215 2841 -211 ct 2852 -207 2861 -202 2871 -196 ct 
2880 -190 2888 -184 2895 -175 ct 2901 -167 2907 -158 2911 -147 ct 2915 -136 2917 -124 2917 -110 ct 
p ef
pom
gr
gs
1105 1182 m 22104 1182 l 22104 14181 l 1105 14181 l 1105 1182 l eoclip newpath
gr
gr
0 13000 t 
pom
count op_count sub {pop} repeat countdictstack dict_count sub {end} repeat b4_inc_state restore
%%PageTrailer
%%Trailer
%%EOF
