car_pos_meter , car_pos_cell, car_speed, ped_pos_meter, ped_pos_cell, ped_speed
-5.125, 5, 1, 3.994416, 5, 1
-5.114625, 5, 1, 3.982356, 5, 1
-5.10425, 5, 2, 3.970406, 5, 1
-5.083425, 5, 2, 3.964467, 5, 1
-5.0626, 5, 1, 3.952959, 5, 1
-5.052225, 5, 1, 3.941129, 5, 1
-5.04185, 5, 1, 3.929473, 5, 1
-5.031475, 5, 1, 3.91739, 5, 1
-5.0211, 5, 2, 3.911236, 5, 1
-5.000275, 5, 1, 3.898939, 5, 1
-4.9899, 4, 2, 3.886581, 5, 1
-4.969075, 4, 2, 3.874033, 5, 1
-4.94825, 4, 2, 3.860598, 5, 1
-4.927425, 4, 2, 3.853622, 5, 1
-4.9066, 4, 1, 3.839676, 4, 1
-4.896225, 4, 1, 3.825609, 4, 1
-4.88585, 4, 2, 3.811443, 4, 1
-4.865026, 4, 1, 3.804398, 4, 1
-4.85465, 4, 2, 3.782756, 4, 1
-4.833826, 4, 1, 3.768406, 4, 1
-4.823451, 4, 1, 3.754239, 4, 1
-4.813076, 4, 2, 3.740904, 4, 1
-4.792251, 4, 2, 3.734236, 4, 1
-4.771426, 4, 2, 3.720452, 4, 1
-4.750601, 4, 1, 3.706697, 4, 1
-4.740226, 4, 1, 3.69315, 4, 1
-4.729851, 4, 1, 3.679806, 4, 1
-4.719476, 4, 2, 3.673188, 4, 1
-4.698651, 4, 1, 3.66003, 4, 1
-4.688276, 4, 1, 3.646887, 4, 1
-4.677901, 4, 2, 3.634225, 4, 1
-4.657076, 4, 2, 3.621268, 4, 1
-4.636251, 4, 2, 3.614806, 4, 1
-4.615426, 4, 1, 3.601531, 4, 1
-4.605051, 4, 1, 3.588283, 4, 1
-4.594676, 4, 1, 3.574831, 4, 1
-4.584301, 4, 2, 3.560462, 4, 1
-4.563476, 4, 2, 3.553453, 4, 1
-4.542651, 4, 1, 3.538369, 4, 1
-4.532276, 4, 1, 3.522845, 4, 1
-4.521901, 4, 2, 3.507037, 4, 1
-4.501076, 4, 1, 3.498846, 4, 1
-4.490701, 4, 1, 3.482627, 4, 1
-4.480326, 4, 1, 3.46584, 4, 1
-4.469951, 4, 1, 3.448575, 4, 1
-4.459576, 4, 1, 3.439686, 4, 1
-4.449201, 4, 2, 3.421772, 4, 1
-4.428376, 4, 2, 3.403786, 4, 1
-4.407551, 4, 1, 3.385161, 4, 1
-4.397176, 4, 1, 3.37581, 4, 1
-4.386801, 4, 2, 3.356092, 4, 1
-4.365976, 4, 1, 3.335103, 4, 1
-4.355601, 4, 1, 3.312643, 4, 1
-4.345226, 4, 1, 3.300866, 4, 1
-4.334851, 4, 1, 3.277738, 4, 1
-4.324476, 4, 2, 3.254693, 4, 1
-4.303651, 4, 1, 3.231311, 4, 1
-4.293276, 4, 2, 3.207851, 4, 1
-4.272451, 4, 1, 3.19663, 4, 1
-4.262076, 4, 1, 3.173856, 4, 1
-4.251701, 4, 2, 3.151442, 4, 1
-4.230876, 4, 1, 3.130824, 4, 1
-4.220501, 4, 1, 3.111598, 4, 1
-4.210126, 4, 1, 3.102192, 4, 1
-4.199751, 4, 1, 3.083314, 4, 1
-4.189376, 4, 2, 3.064422, 3, 1
-4.168551, 4, 2, 3.04487, 3, 1
-4.147727, 4, 2, 3.02526, 3, 1
-4.126902, 4, 2, 3.015351, 3, 1
-4.106077, 4, 2, 2.995059, 3, 1
-4.085252, 4, 2, 2.974676, 3, 1
-4.064427, 4, 2, 2.953913, 3, 1
-4.043602, 4, 2, 2.932719, 3, 1
-4.022777, 4, 2, 2.921969, 3, 1
-4.001952, 4, 2, 2.900114, 3, 1
-3.981127, 3, 2, 2.878275, 3, 1
-3.960302, 3, 2, 2.856793, 3, 1
-3.939477, 3, 1, 2.835089, 3, 1
-3.929102, 3, 1, 2.823768, 3, 1
-3.918727, 3, 2, 2.801265, 3, 1
-3.897902, 3, 1, 2.778868, 3, 1
-3.887527, 3, 1, 2.756464, 3, 1
-3.877152, 3, 1, 2.73551, 3, 1
-3.866777, 3, 1, 2.725088, 3, 1
-3.856402, 3, 2, 2.70457, 3, 1
-3.835577, 3, 2, 2.683805, 3, 1
-3.814753, 3, 1, 2.663835, 3, 1
-3.804378, 3, 1, 2.64453, 3, 1
-3.794003, 3, 1, 2.634801, 3, 1
-3.783628, 3, 2, 2.616181, 3, 1
-3.762803, 3, 1, 2.597882, 3, 1
-3.752428, 3, 2, 2.579212, 3, 1
-3.731603, 3, 1, 2.560275, 3, 1
-3.721228, 3, 1, 2.550705, 3, 1
-3.710853, 3, 2, 2.531546, 3, 1
-3.690028, 3, 2, 2.512206, 3, 1
-3.669203, 3, 1, 2.492932, 3, 1
-3.658828, 3, 1, 2.473595, 3, 1
-3.648453, 3, 1, 2.463823, 3, 1
-3.638078, 3, 2, 2.443763, 3, 1
-3.617253, 3, 1, 2.42325, 3, 1
-3.606878, 3, 2, 2.402261, 3, 1
-3.586053, 3, 2, 2.381388, 3, 1
-3.565228, 3, 2, 2.370518, 3, 1
-3.544403, 3, 2, 2.348524, 3, 1
-3.523578, 3, 1, 2.326331, 3, 1
-3.513203, 3, 2, 2.30387, 2, 1
-3.492378, 3, 2, 2.28136, 2, 1
-3.471553, 3, 2, 2.26977, 2, 1
-3.450728, 3, 2, 2.246713, 2, 1
-3.429904, 3, 2, 2.223316, 2, 1
-3.409079, 3, 2, 2.200155, 2, 1
-3.388254, 3, 2, 2.176896, 2, 1
-3.367429, 3, 2, 2.165458, 2, 1
-3.346604, 3, 2, 2.142321, 2, 1
-3.325779, 3, 2, 2.118851, 2, 1
-3.304954, 3, 2, 2.095526, 2, 1
-3.284129, 3, 2, 2.071931, 2, 1
-3.263304, 3, 2, 2.05989, 2, 1
-3.242479, 3, 2, 2.035134, 2, 1
-3.221654, 3, 2, 2.010363, 2, 1
-3.20083, 3, 2, 1.984974, 2, 1
-3.180005, 3, 2, 1.958565, 2, 1
-3.15918, 3, 2, 1.945043, 2, 1
-3.138355, 3, 2, 1.917311, 2, 1
-3.11753, 3, 2, 1.889099, 2, 1
-3.096705, 3, 2, 1.861361, 2, 1
-3.07588, 3, 2, 1.834315, 2, 1
-3.055055, 3, 2, 1.820862, 2, 1
-3.03423, 3, 2, 1.794126, 2, 1
-3.013405, 3, 2, 1.766614, 2, 1
-2.99258, 2, 2, 1.740573, 2, 1
-2.971756, 2, 2, 1.714148, 2, 1
-2.950931, 2, 2, 1.701302, 2, 1
-2.930106, 2, 1, 1.676124, 2, 1
-2.919731, 2, 1, 1.650691, 2, 1
-2.909356, 2, 2, 1.625882, 2, 1
-2.888531, 2, 2, 1.601238, 2, 1
-2.867706, 2, 2, 1.588863, 2, 1
-2.846881, 2, 1, 1.565, 2, 1
-2.836506, 2, 2, 1.541458, 2, 1
-2.815681, 2, 2, 1.520591, 1, 1
-2.794856, 2, 2, 1.499957, 1, 1
-2.774031, 2, 2, 1.48965, 1, 1
-2.753206, 2, 2, 1.469939, 1, 1
-2.732381, 2, 2, 1.451671, 1, 1
-2.711556, 2, 2, 1.433387, 1, 1
-2.690732, 2, 2, 1.415571, 1, 1
-2.669907, 2, 2, 1.406344, 1, 1
-2.649082, 2, 2, 1.388834, 1, 1
-2.628257, 2, 2, 1.370417, 1, 1
-2.607432, 2, 2, 1.350623, 1, 1
-2.586607, 2, 2, 1.330276, 1, 1
-2.565782, 2, 2, 1.320115, 1, 1
-2.544957, 2, 2, 1.29843, 1, 1
-2.524132, 2, 2, 1.27684, 1, 1
-2.503307, 2, 2, 1.255628, 1, 1
-2.482482, 2, 2, 1.233732, 1, 1
-2.461658, 2, 2, 1.211885, 1, 1
-2.440833, 2, 2, 1.200686, 1, 1
-2.420008, 2, 2, 1.178751, 1, 1
-2.399183, 2, 2, 1.15689, 1, 1
-2.378358, 2, 2, 1.134882, 1, 1
-2.357533, 2, 2, 1.112842, 1, 1
-2.336708, 2, 2, 1.101716, 1, 1
-2.315883, 2, 2, 1.079508, 1, 1
-2.295058, 2, 2, 1.05812, 1, 1
-2.274233, 2, 2, 1.037198, 1, 1
-2.253408, 2, 2, 1.016873, 1, 1
-2.232584, 2, 2, 1.00669, 1, 1
-2.211759, 2, 2, 0.9858365, 1, 1
-2.190934, 2, 2, 0.9656501, 1, 1
-2.170109, 2, 2, 0.9448364, 1, 1
-2.149284, 2, 2, 0.9244213, 1, 1
-2.128459, 2, 2, 0.914505, 1, 1
-2.107634, 2, 2, 0.8947926, 1, 1
-2.086809, 2, 2, 0.8752501, 1, 1
-2.065984, 2, 2, 0.8554473, 1, 1
-2.045159, 2, 2, 0.835896, 1, 1
-2.024334, 2, 2, 0.8260353, 1, 1
-2.00351, 2, 2, 0.806334, 1, 1
-1.982684, 1, 2, 0.7862246, 1, 1
-1.961859, 1, 2, 0.7663684, 0, 1
-1.941034, 1, 2, 0.7461672, 0, 1
-1.920209, 1, 2, 0.7359512, 0, 1
-1.899384, 1, 2, 0.7151406, 0, 1
-1.878559, 1, 2, 0.6948793, 0, 1
-1.857734, 1, 2, 0.6741946, 0, 1
-1.836909, 1, 2, 0.6533329, 0, 1
-1.816084, 1, 2, 0.6431427, 0, 1
-1.795259, 1, 2, 0.6223722, 0, 1
-1.774434, 1, 2, 0.601769, 0, 1
-1.753609, 1, 2, 0.581356, 0, 1
-1.732784, 1, 2, 0.5608063, 0, 1
-1.711959, 1, 2, 0.5506442, 0, 1
-1.691134, 1, 2, 0.5303054, 0, 1
-1.670309, 1, 2, 0.5099061, 0, 1
-1.649484, 1, 2, 0.4896359, 0, 1
-1.628659, 1, 2, 0.4698985, 0, 1
-1.607834, 1, 2, 0.4605031, 0, 1
-1.587009, 1, 2, 0.4415843, 0, 1
-1.566184, 1, 2, 0.4228837, 0, 1
-1.545359, 1, 2, 0.4046409, 0, 1
-1.524534, 1, 2, 0.3865676, 0, 1
-1.503709, 1, 2, 0.3778903, 0, 1
-1.482884, 1, 2, 0.3612061, 0, 1
-1.462059, 1, 2, 0.3452961, 0, 1
-1.441234, 1, 2, 0.3298645, 0, 1
-1.420409, 1, 2, 0.3152318, 0, 1
-1.399584, 1, 2, 0.3079095, 0, 1
-1.378759, 1, 2, 0.293695, 0, 1
-1.357934, 1, 2, 0.2793615, 0, 1
-1.337109, 1, 2, 0.2648468, 0, 1
-1.316284, 1, 2, 0.2506552, 0, 1
-1.295459, 1, 2, 0.2435896, 0, 1
-1.274634, 1, 2, 0.2293935, 0, 1
-1.253808, 1, 2, 0.2151885, 0, 1
-1.232983, 1, 2, 0.2013185, 0, 1
-1.212158, 1, 2, 0.1943784, 0, 1
-1.191333, 1, 2, 0.1802201, 0, 1
-1.170508, 1, 2, 0.1661162, 0, 1
-1.149683, 1, 2, 0.152164, 0, 1
-1.128858, 1, 2, 0.1383979, 0, 1
-1.108033, 1, 2, 0.1247211, 0, 1
-1.087208, 1, 2, 0.1177709, 0, 1
-1.066383, 1, 2, 0.1038771, 0, 1
-1.045558, 1, 2, 0.09003258, 0, 1
-1.024733, 1, 2, 0.07596803, 0, 1
-1.003908, 1, 2, 0.06220102, 0, 1
-0.9830831, 0, 2, 0.05514264, 0, 1
-0.9622581, 0, 2, 0.04120708, 0, 1
-0.9414331, 0, 2, 0.02711535, 0, 1
-0.920608, 0, 2, 0.01327229, 0, 1
-0.899783, 0, 2, -0.0002269745, 0, 1
-0.878958, 0, 2, -0.006976128, 0, 1
-0.858133, 0, 2, -0.02029753, 0, 1
-0.8373079, 0, 2, -0.03338718, 0, 1
-0.8164829, 0, 2, -0.04636717, 0, 1
-0.7956579, 0, 2, -0.05929279, 0, 1
-0.7748328, 0, 2, -0.06569242, 0, 1
-0.7540078, 0, 2, -0.07852364, 0, 1
-0.7331828, 0, 2, -0.09122419, 0, 1
-0.7123578, 0, 2, -0.1040282, 0, 1
-0.6915327, 0, 2, -0.1167464, 0, 1
-0.6707077, 0, 2, -0.1231151, 0, 1
-0.6498827, 0, 2, -0.1360269, 0, 1
-0.6290576, 0, 2, -0.1490107, 0, 1
-0.6082326, 0, 2, -0.1621585, 0, 1
-0.5874076, 0, 2, -0.1753068, 0, 1
-0.5665826, 0, 2, -0.1818795, 0, 1
-0.5457575, 0, 2, -0.1954064, 0, 1
-0.5249325, 0, 2, -0.2093415, 0, 1
-0.5041075, 0, 2, -0.2236876, 0, 1
-0.4832825, 0, 2, -0.2380843, 0, 1
-0.4624575, 0, 2, -0.2451577, 0, 1
-0.4416325, 0, 2, -0.2594757, 0, 1
-0.4208075, 0, 2, -0.273643, 0, 1
-0.3999825, 0, 2, -0.2878485, 0, 1
-0.3791575, 0, 2, -0.3012905, 0, 1
-0.3583325, 0, 2, -0.3077412, 0, 1
-0.3375075, 0, 2, -0.3200121, 0, 1
-0.3166825, 0, 2, -0.3315849, 0, 1
-0.2958575, 0, 2, -0.3423815, 0, 1
-0.2750325, 0, 2, -0.3526154, 0, 1
-0.2542075, 0, 2, -0.3575354, 0, 1
-0.2333825, 0, 2, -0.3667059, 0, 1
-0.2125575, 0, 2, -0.3753009, 0, 1
-0.1917325, 0, 2, -0.3831453, 0, 1
-0.1709075, 0, 2, -0.3898048, 0, 1
-0.1500825, 0, 2, -0.3941669, 0, 1
-0.1292575, 0, 2, -0.399775, 0, 1
-0.1084325, 0, 2, -0.4056392, 0, 1
-0.0876075, 0, 2, -0.4109564, 0, 1
-0.0667825, 0, 2, -0.4148402, 0, 1
-0.04595751, 0, 2, -0.4169312, 0, 1
-0.02513251, 0, 2, -0.4201074, 0, 1
-0.004307508, 0, 2, -0.42278, 0, 1
0.01651749, 0, 2, -0.421196, 0, 1
0.03734249, 0, 2, -0.4227629, 0, 1
0.05816749, 0, 2, -0.423346, 0, 1
0.07899249, 0, 2, -0.4246616, 0, 1
0.09981748, 0, 2, -0.4263806, 0, 1
0.1206425, 0, 2, -0.4269524, 0, 1
0.1414675, 0, 2, -0.4284549, 0, 1
0.1622925, 0, 2, -0.4293551, 0, 1
0.1831175, 0, 2, -0.4314098, 0, 1
0.2039425, 0, 2, -0.4337149, 0, 1
0.2247675, 0, 2, -0.4364538, 0, 1
0.2455925, 0, 2, -0.4395847, 0, 1
0.2664175, 0, 2, -0.4413948, 0, 1
0.2872425, 0, 2, -0.4451423, 0, 1
0.3080675, 0, 2, -0.4490671, 0, 1
0.3288925, 0, 2, -0.4521933, 0, 1
0.3497175, 0, 2, -0.4560909, 0, 1
0.3705425, 0, 2, -0.4577637, 0, 1
0.3913675, 0, 2, -0.4608922, 0, 1
0.4121925, 0, 2, -0.4637423, 0, 1
0.4330175, 0, 2, -0.4660349, 0, 1
0.4538425, 0, 2, -0.4681787, 0, 1
0.4746675, 0, 2, -0.4690485, 0, 1
0.4954925, 0, 2, -0.4706364, 0, 1
0.5163175, 0, 2, -0.4721527, 0, 1
0.5371425, 0, 2, -0.4735174, 0, 1
0.5579675, 0, 2, -0.4742384, 0, 1
0.5787926, 0, 2, -0.4744759, 0, 1
0.5996176, 0, 2, -0.4745569, 0, 1
0.6204426, 0, 2, -0.4746981, 0, 1
0.6412677, 0, 2, -0.4746323, 0, 1
0.6620927, 0, 2, -0.4744196, 0, 1
0.6829177, 0, 2, -0.4743056, 0, 1
0.7037427, 0, 2, -0.474041, 0, 1
0.7245678, 0, 2, -0.4736314, 0, 1
0.7453928, 0, 2, -0.4733686, 0, 1
0.7662178, 0, 2, -0.4729948, 0, 1
0.7870429, 0, 2, -0.4728479, 0, 1
0.8078679, 0, 2, -0.4725952, 0, 1
0.8286929, 0, 2, -0.4723644, 0, 1
0.8495179, 0, 2, -0.4723711, 0, 1
0.870343, 0, 2, -0.4725661, 0, 1
0.891168, 0, 2, -0.4727159, 0, 1
0.911993, 0, 2, -0.4731331, 0, 1
0.9328181, 0, 2, -0.4736862, 0, 1
0.9536431, 0, 2, -0.4743061, 0, 1
0.9744681, 0, 2, -0.474658, 0, 1
0.9952931, 0, 2, -0.4747658, 0, 1
1.016118, -1, 2, -0.4749308, 0, 1
1.036943, -1, 2, -0.4746714, 0, 1
1.057768, -1, 2, -0.4741817, 0, 1
1.078593, -1, 2, -0.4732547, 0, 1
1.099418, -1, 2, -0.4727092, 0, 1
1.120243, -1, 2, -0.4710999, 0, 1
1.141068, -1, 2, -0.4696112, 0, 1
1.161893, -1, 2, -0.468554, 0, 1
1.182718, -1, 2, -0.4669161, 0, 1
1.203543, -1, 2, -0.4663191, 0, 1
1.224368, -1, 2, -0.4647675, 0, 1
1.245193, -1, 2, -0.4637208, 0, 1
1.266019, -1, 2, -0.4633055, 0, 1
1.286844, -1, 2, -0.4627552, 0, 1
1.307669, -1, 2, -0.4619412, 0, 1
1.328494, -1, 2, -0.4614825, 0, 1
1.349319, -1, 2, -0.4606299, 0, 1
1.370144, -1, 2, -0.4601979, 0, 1
1.390969, -1, 2, -0.459579, 0, 1
1.411794, -1, 2, -0.4591684, 0, 1
1.432619, -1, 2, -0.4582653, 0, 1
1.453444, -1, 2, -0.4572554, 0, 1
1.474269, -1, 2, -0.4577999, 0, 1
1.495094, -1, 2, -0.4559383, 0, 1
1.515919, -1, 2, -0.4534459, 0, 1
1.536744, -1, 2, -0.4527211, 0, 1
1.557569, -1, 2, -0.4508257, 0, 1
1.578394, -1, 2, -0.4491062, 0, 1
1.599219, -1, 2, -0.4472723, 0, 1
1.620044, -1, 2, -0.4463015, 0, 1
1.640869, -1, 2, -0.4438877, 0, 1
1.661694, -1, 2, -0.4408264, 0, 1
1.682519, -1, 2, -0.4381781, 0, 1
1.703344, -1, 2, -0.4354887, 0, 1
1.724169, -1, 2, -0.4337707, 0, 1
1.744994, -1, 2, -0.4307952, 0, 1
1.765819, -1, 2, -0.4283314, 0, 1
1.786644, -1, 2, -0.4254713, 0, 1
1.807469, -1, 2, -0.4226985, 0, 1
1.828294, -1, 2, -0.4213314, 0, 1
1.849119, -1, 2, -0.418561, 0, 1
1.869944, -1, 2, -0.415647, 0, 1
1.890769, -1, 2, -0.4128342, 0, 1
1.911594, -1, 2, -0.4113936, 0, 1
1.932419, -1, 2, -0.4082923, 0, 1
1.953244, -1, 2, -0.4050241, 0, 1
1.974069, -1, 2, -0.4018927, 0, 1
1.994895, -1, 2, -0.398387, 0, 1
2.015719, -2, 2, -0.3948441, 0, 1
2.036544, -2, 2, -0.3931031, 0, 1
2.057369, -2, 2, -0.3897896, 0, 1
2.078194, -2, 2, -0.3863845, 0, 1
2.099019, -2, 2, -0.3828502, 0, 1
2.119844, -2, 2, -0.3791065, 0, 1
