car_pos_meter , car_pos_cell, car_speed, ped_pos_meter, ped_pos_cell, ped_speed
-5.125, 5, 2, 4.097229, 5, 1
-5.104175, 5, 2, 4.090609, 5, 1
-5.08335, 5, 2, 4.076806, 5, 1
-5.0417, 5, 2, 4.047432, 5, 1
-4.521078, 4, 1, 3.686012, 4, 1
-4.449206, 4, 2, 3.2931, 4, 1
-3.928584, 3, 1, 2.848015, 3, 1
-3.856706, 3, 2, 2.345257, 3, 1
-3.336084, 3, 2, 1.864007, 2, 1
-2.815461, 2, 2, 1.37002, 1, 1
-2.294838, 2, 2, 0.9228458, 1, 1
-1.774214, 1, 2, 0.4919076, 0, 1
-1.253588, 1, 2, 0.05385923, 0, 1
-0.7329626, 0, 2, -0.3951349, 0, 1
-0.2123373, 0, 2, -0.7760644, -1, 1
0.2874626, 0, 2, -1.047647, -1, 1
0.8080881, 0, 2, -1.122117, -1, 1
1.328714, -1, 2, -1.112248, -1, 1
