timestamp_sec,frame_id,game_played,yielding,player1discrete,player2discrete,player1yieldprob,player2yieldprob,player1_pose_x,player1_pose_y,player1_pose_z,player1_pose_orient_x,player1_pose_orient_y,player1_pose_orient_z,player1_pose_orient_w,player2_pose_x,player2_pose_y,player2_pose_z,player2_pose_orient_x,player2_pose_orient_y,player2_pose_orient_z,player2_pose_orient_w
1718122593.755121,map,True,False,5,5,0.612995793784914,0.612995793784914,1.408773422241211,-1.559563159942627,0.0,0.0,0.0,0.02863663481025498,0.9995898806484876,3.17749641030919,-6.758717803011557,0.8052094283299774,0.0,0.0,0.0,1.0
1718122593.8057938,map,True,True,5,5,0.612995793784914,0.612995793784914,1.408773422241211,-1.559563159942627,0.0,0.0,0.0,0.02863663481025498,0.9995898806484876,3.1721234107849194,-6.66808892945934,0.8105558288553515,0.0,0.0,0.0,1.0
1718122593.9070406,map,True,True,5,5,0.612995793784914,0.612995793784914,1.5324698686599731,-1.5886611938476562,0.0,0.0,0.0,0.029913507089919793,0.9995524925036751,3.1721234107849194,-6.66808892945934,0.8105558288553515,0.0,0.0,0.0,1.0
1718122593.9565003,map,True,True,5,5,0.612995793784914,0.612995793784914,1.5324698686599731,-1.5886611938476562,0.0,0.0,0.0,0.029913507089919793,0.9995524925036751,3.1721234107849194,-6.66808892945934,0.8105558288553515,0.0,0.0,0.0,1.0
1718122594.0577521,map,True,True,5,5,0.612995793784914,0.612995793784914,1.5324698686599731,-1.5886611938476562,0.0,0.0,0.0,0.029913507089919793,0.9995524925036751,3.1721234107849194,-6.66808892945934,0.8105558288553515,0.0,0.0,0.0,1.0
1718122594.1079292,map,True,False,5,5,0.612995793784914,0.612995793784914,1.5324698686599731,-1.5886611938476562,0.0,0.0,0.0,0.029913507089919793,0.9995524925036751,3.2446945559712663,-6.32574680662838,0.7809734231375592,0.0,0.0,0.0,1.0
1718122594.1585739,map,True,True,5,5,0.612995793784914,0.612995793784914,1.5324698686599731,-1.5886611938476562,0.0,0.0,0.0,0.029913507089919793,0.9995524925036751,3.2446945559712663,-6.32574680662838,0.7809734231375592,0.0,0.0,0.0,1.0
1718122594.4589918,map,True,True,5,5,0.612995793784914,0.612995793784914,1.5324698686599731,-1.5886611938476562,0.0,0.0,0.0,0.029913507089919793,0.9995524925036751,3.2713269123405904,-5.984044032665757,0.7802941374314687,0.0,0.0,0.0,1.0
1718122594.5108516,map,True,False,5,4,0.0,0.0,1.5324698686599731,-1.5886611938476562,0.0,0.0,0.0,0.029913507089919793,0.9995524925036751,3.260052813662046,-5.870711821025289,0.7840874118160339,0.0,0.0,0.0,1.0
1718122594.5615542,map,True,False,5,4,0.0,0.0,1.5324698686599731,-1.5886611938476562,0.0,0.0,0.0,0.029913507089919793,0.9995524925036751,3.260052813662046,-5.870711821025289,0.7840874118160339,0.0,0.0,0.0,1.0
1718122594.609851,map,True,False,5,4,0.0,0.0,1.5324698686599731,-1.5886611938476562,0.0,0.0,0.0,0.029913507089919793,0.9995524925036751,3.260052813662046,-5.870711821025289,0.7840874118160339,0.0,0.0,0.0,1.0
1718122594.6598835,map,True,False,5,4,0.0,0.0,1.5324698686599731,-1.5886611938476562,0.0,0.0,0.0,0.029913507089919793,0.9995524925036751,3.260052813662046,-5.870711821025289,0.7840874118160339,0.0,0.0,0.0,1.0
1718122594.7106102,map,True,False,5,4,0.0,0.0,1.5324698686599731,-1.5886611938476562,0.0,0.0,0.0,0.029913507089919793,0.9995524925036751,3.260052813662046,-5.870711821025289,0.7840874118160339,0.0,0.0,0.0,1.0
1718122594.7601068,map,True,False,5,4,0.0,0.0,1.5324698686599731,-1.5886611938476562,0.0,0.0,0.0,0.029913507089919793,0.9995524925036751,3.260052813662046,-5.870711821025289,0.7840874118160339,0.0,0.0,0.0,1.0
1718122594.8129554,map,True,False,5,4,0.0,0.0,1.5324698686599731,-1.5886611938476562,0.0,0.0,0.0,0.029913507089919793,0.9995524925036751,3.3022071127412187,-5.8276723616275845,0.7953941988227656,0.0,0.0,0.0,1.0
1718122594.86094,map,True,True,4,4,0.5922520728754596,0.5922520728754596,1.737964391708374,-1.6429259777069092,0.0,0.0,0.0,0.03280426708056152,0.9994617891349837,3.3022071127412187,-5.8276723616275845,0.7953941988227656,0.0,0.0,0.0,1.0
1718122594.9614267,map,True,False,4,4,0.5922520728754596,0.5922520728754596,1.737964391708374,-1.6429259777069092,0.0,0.0,0.0,0.03280426708056152,0.9994617891349837,3.3022071127412187,-5.8276723616275845,0.7953941988227656,0.0,0.0,0.0,1.0
1718122595.0114658,map,True,False,4,4,0.5922520728754596,0.5922520728754596,1.737964391708374,-1.6429259777069092,0.0,0.0,0.0,0.03280426708056152,0.9994617891349837,3.3022071127412187,-5.8276723616275845,0.7953941988227656,0.0,0.0,0.0,1.0
1718122595.06242,map,True,False,4,4,0.5922520728754596,0.5922520728754596,1.737964391708374,-1.6429259777069092,0.0,0.0,0.0,0.03280426708056152,0.9994617891349837,3.3022071127412187,-5.8276723616275845,0.7953941988227656,0.0,0.0,0.0,1.0
1718122595.1658933,map,True,False,4,4,0.5922520728754596,0.5922520728754596,1.737964391708374,-1.6429259777069092,0.0,0.0,0.0,0.03280426708056152,0.9994617891349837,3.305398108592722,-5.450511188281961,0.7570379394166036,0.0,0.0,0.0,1.0
1718122595.2139509,map,True,True,4,4,0.5922520728754596,0.5922520728754596,1.737964391708374,-1.6429259777069092,0.0,0.0,0.0,0.03280426708056152,0.9994617891349837,3.305398108592722,-5.450511188281961,0.7570379394166036,0.0,0.0,0.0,1.0
1718122595.5621786,map,True,False,4,4,0.5922520728754596,0.5922520728754596,1.737964391708374,-1.6429259777069092,0.0,0.0,0.0,0.03280426708056152,0.9994617891349837,3.3824127967628272,-5.217703752749222,0.7573023822846288,0.0,0.0,0.0,1.0
1718122595.6138513,map,True,True,4,4,0.5922520728754596,0.5922520728754596,1.737964391708374,-1.6429259777069092,0.0,0.0,0.0,0.03280426708056152,0.9994617891349837,3.3824127967628272,-5.217703752749222,0.7573023822846288,0.0,0.0,0.0,1.0
1718122595.6624775,map,True,True,4,4,0.5922520728754596,0.5922520728754596,1.737964391708374,-1.6429259777069092,0.0,0.0,0.0,0.03280426708056152,0.9994617891349837,3.3824127967628272,-5.217703752749222,0.7573023822846288,0.0,0.0,0.0,1.0
1718122595.7125168,map,True,False,4,4,0.5922520728754596,0.5922520728754596,1.737964391708374,-1.6429259777069092,0.0,0.0,0.0,0.03280426708056152,0.9994617891349837,3.3824127967628272,-5.217703752749222,0.7573023822846288,0.0,0.0,0.0,1.0
1718122595.7634954,map,True,False,4,4,0.5922520728754596,0.5922520728754596,1.8397505283355713,-1.6659059524536133,0.0,0.0,0.0,0.033998489568892794,0.9994218913582958,3.3824127967628272,-5.217703752749222,0.7573023822846288,0.0,0.0,0.0,1.0
1718122595.8637586,map,True,False,4,3,0.0,0.0,1.8397505283355713,-1.6659059524536133,0.0,0.0,0.0,0.033998489568892794,0.9994218913582958,3.3783413928537667,-4.9271607834778735,0.7266418559441827,0.0,0.0,0.0,1.0
1718122595.913454,map,True,False,4,3,0.0,0.0,1.8397505283355713,-1.6659059524536133,0.0,0.0,0.0,0.033998489568892794,0.9994218913582958,3.3783413928537667,-4.9271607834778735,0.7266418559441827,0.0,0.0,0.0,1.0
1718122595.9643545,map,True,False,4,3,0.0,0.0,1.8397505283355713,-1.6659059524536133,0.0,0.0,0.0,0.033998489568892794,0.9994218913582958,3.3783413928537667,-4.9271607834778735,0.7266418559441827,0.0,0.0,0.0,1.0
1718122596.0154696,map,True,False,4,3,0.0,0.0,1.8397505283355713,-1.6659059524536133,0.0,0.0,0.0,0.033998489568892794,0.9994218913582958,3.3783413928537667,-4.9271607834778735,0.7266418559441827,0.0,0.0,0.0,1.0
1718122596.0648527,map,True,False,4,3,0.0,0.0,1.8397505283355713,-1.6659059524536133,0.0,0.0,0.0,0.033998489568892794,0.9994218913582958,3.3783413928537667,-4.9271607834778735,0.7266418559441827,0.0,0.0,0.0,1.0
1718122596.166933,map,True,False,4,3,0.0,0.0,1.8397505283355713,-1.6659059524536133,0.0,0.0,0.0,0.033998489568892794,0.9994218913582958,3.4393737557558732,-4.769873539780242,0.7386149586361735,0.0,0.0,0.0,1.0
1718122596.2155952,map,True,False,4,3,0.0,0.0,1.8397505283355713,-1.6659059524536133,0.0,0.0,0.0,0.033998489568892794,0.9994218913582958,3.4699591506623886,-4.690424499723,0.7233451392954736,0.0,0.0,0.0,1.0
1718122596.5173407,map,True,False,4,3,0.0,0.0,1.8397505283355713,-1.6659059524536133,0.0,0.0,0.0,0.033998489568892794,0.9994218913582958,3.4937002920577465,-4.509956546248683,0.7383288457426573,0.0,0.0,0.0,1.0
1718122596.5664334,map,True,False,4,3,0.0,0.0,1.8397505283355713,-1.6659059524536133,0.0,0.0,0.0,0.033998489568892794,0.9994218913582958,3.4767160056914364,-4.357099868176517,0.7104964717268838,0.0,0.0,0.0,1.0
1718122596.667967,map,True,True,3,3,0.6616527499769684,0.6616527499769684,2.0040483474731445,-1.7072925567626953,0.0,0.0,0.0,0.035651176196287625,0.9993642932158471,3.4767160056914364,-4.357099868176517,0.7104964717268838,0.0,0.0,0.0,1.0
1718122596.7167714,map,True,True,3,3,0.6616527499769684,0.6616527499769684,2.0040483474731445,-1.7072925567626953,0.0,0.0,0.0,0.035651176196287625,0.9993642932158471,3.4767160056914364,-4.357099868176517,0.7104964717268838,0.0,0.0,0.0,1.0
1718122596.8260763,map,True,False,3,3,0.6616527499769684,0.6616527499769684,2.0040483474731445,-1.7072925567626953,0.0,0.0,0.0,0.035651176196287625,0.9993642932158471,3.4767160056914364,-4.357099868176517,0.7104964717268838,0.0,0.0,0.0,1.0
1718122596.8718762,map,True,False,3,3,0.6616527499769684,0.6616527499769684,2.0040483474731445,-1.7072925567626953,0.0,0.0,0.0,0.035651176196287625,0.9993642932158471,3.5246250353716126,-4.274965918845502,0.7013560420443428,0.0,0.0,0.0,1.0
1718122596.9682555,map,True,True,3,3,0.6616527499769684,0.6616527499769684,2.0040483474731445,-1.7072925567626953,0.0,0.0,0.0,0.035651176196287625,0.9993642932158471,3.5035021078010504,-4.1642745568084845,0.6851966345786242,0.0,0.0,0.0,1.0
1718122597.069002,map,True,False,3,3,0.6616527499769684,0.6616527499769684,2.0040483474731445,-1.7072925567626953,0.0,0.0,0.0,0.035651176196287625,0.9993642932158471,3.5035021078010504,-4.1642745568084845,0.6851966345786242,0.0,0.0,0.0,1.0
1718122597.1187842,map,True,True,3,3,0.6616527499769684,0.6616527499769684,2.0040483474731445,-1.7072925567626953,0.0,0.0,0.0,0.035651176196287625,0.9993642932158471,3.5035021078010504,-4.1642745568084845,0.6851966345786242,0.0,0.0,0.0,1.0
1718122597.1712723,map,True,False,3,3,0.6616527499769684,0.6616527499769684,2.0040483474731445,-1.7072925567626953,0.0,0.0,0.0,0.035651176196287625,0.9993642932158471,3.5035021078010504,-4.1642745568084845,0.6851966345786242,0.0,0.0,0.0,1.0
1718122597.5185466,map,True,False,3,2,0.0,0.0,2.0236458778381348,-1.7098219394683838,0.0,0.0,0.0,0.03580020862208254,0.9993589701031943,3.595165305473376,-3.905304062892103,0.6913405573792952,0.0,0.0,0.0,1.0
1718122597.5691524,map,True,False,3,2,0.0,0.0,2.0236458778381348,-1.7098219394683838,0.0,0.0,0.0,0.03580020862208254,0.9993589701031943,3.5604724226540143,-3.8020379285611723,0.6908327699292562,0.0,0.0,0.0,1.0
1718122597.6692176,map,True,False,3,2,0.0,0.0,2.0236458778381348,-1.7098219394683838,0.0,0.0,0.0,0.03580020862208254,0.9993589701031943,3.5604724226540143,-3.8020379285611723,0.6908327699292562,0.0,0.0,0.0,1.0
1718122597.7691972,map,True,False,3,2,0.0,0.0,2.0236458778381348,-1.7098219394683838,0.0,0.0,0.0,0.03580020862208254,0.9993589701031943,3.5604724226540143,-3.8020379285611723,0.6908327699292562,0.0,0.0,0.0,1.0
1718122597.819166,map,True,False,3,2,0.0,0.0,2.0236458778381348,-1.7098219394683838,0.0,0.0,0.0,0.03580020862208254,0.9993589701031943,3.5604724226540143,-3.8020379285611723,0.6908327699292562,0.0,0.0,0.0,1.0
1718122597.8728116,map,True,False,3,2,0.0,0.0,2.0236458778381348,-1.7098219394683838,0.0,0.0,0.0,0.03580020862208254,0.9993589701031943,3.6046540256706683,-3.5597839131476987,0.6837458246262659,0.0,0.0,0.0,1.0
1718122597.970553,map,True,False,3,2,0.0,0.0,2.0236458778381348,-1.7098219394683838,0.0,0.0,0.0,0.03580020862208254,0.9993589701031943,3.602658598225341,-3.528032895065223,0.6865355799694135,0.0,0.0,0.0,1.0
1718122598.0201375,map,True,False,3,2,0.0,0.0,2.0236458778381348,-1.7098219394683838,0.0,0.0,0.0,0.03580020862208254,0.9993589701031943,3.602658598225341,-3.528032895065223,0.6865355799694135,0.0,0.0,0.0,1.0
1718122598.1201982,map,True,False,3,2,0.0,0.0,2.210850715637207,-1.7627743482589722,0.0,0.0,0.0,0.038315879878637445,0.9992656842886479,3.602658598225341,-3.528032895065223,0.6865355799694135,0.0,0.0,0.0,1.0
1718122598.173519,map,True,False,3,2,0.0,0.0,2.210850715637207,-1.7627743482589722,0.0,0.0,0.0,0.038315879878637445,0.9992656842886479,3.602658598225341,-3.528032895065223,0.6865355799694135,0.0,0.0,0.0,1.0
1718122598.6207635,map,True,False,3,2,0.0,0.0,2.210850715637207,-1.7627743482589722,0.0,0.0,0.0,0.038315879878637445,0.9992656842886479,3.62854177849925,-3.342720991785784,0.6858276214940673,0.0,0.0,0.0,1.0
1718122598.7196438,map,True,False,3,2,0.0,0.0,2.210850715637207,-1.7627743482589722,0.0,0.0,0.0,0.038315879878637445,0.9992656842886479,3.62854177849925,-3.342720991785784,0.6858276214940673,0.0,0.0,0.0,1.0
1718122598.7719746,map,True,False,3,2,0.0,0.0,2.210850715637207,-1.7627743482589722,0.0,0.0,0.0,0.038315879878637445,0.9992656842886479,3.62854177849925,-3.342720991785784,0.6858276214940673,0.0,0.0,0.0,1.0
1718122598.8204563,map,True,True,2,2,0.49874686716791977,0.49874686716791977,2.3863415718078613,-1.8154329061508179,0.0,0.0,0.0,0.040789707090901635,0.9991677516542153,3.62854177849925,-3.342720991785784,0.6858276214940673,0.0,0.0,0.0,1.0
1718122598.9203434,map,True,True,2,2,0.49874686716791977,0.49874686716791977,2.3863415718078613,-1.8154329061508179,0.0,0.0,0.0,0.040789707090901635,0.9991677516542153,3.691541932154631,-3.3322998674167392,0.6857269978850933,0.0,0.0,0.0,1.0
1718122598.9711735,map,True,False,2,2,0.49874686716791977,0.49874686716791977,2.3863415718078613,-1.8154329061508179,0.0,0.0,0.0,0.040789707090901635,0.9991677516542153,3.691541932154631,-3.3322998674167392,0.6857269978850933,0.0,0.0,0.0,1.0
1718122599.0279202,map,True,True,2,2,0.49874686716791977,0.49874686716791977,2.3863415718078613,-1.8154329061508179,0.0,0.0,0.0,0.040789707090901635,0.9991677516542153,3.691541932154631,-3.3322998674167392,0.6857269978850933,0.0,0.0,0.0,1.0
1718122599.1258075,map,True,True,2,2,0.49874686716791977,0.49874686716791977,2.3863415718078613,-1.8154329061508179,0.0,0.0,0.0,0.040789707090901635,0.9991677516542153,3.691541932154631,-3.3322998674167392,0.6857269978850933,0.0,0.0,0.0,1.0
1718122599.1754408,map,True,False,2,2,0.49874686716791977,0.49874686716791977,2.3863415718078613,-1.8154329061508179,0.0,0.0,0.0,0.040789707090901635,0.9991677516542153,3.691541932154631,-3.3322998674167392,0.6857269978850933,0.0,0.0,0.0,1.0
1718122599.5775778,map,True,False,2,2,0.49874686716791977,0.49874686716791977,2.499079704284668,-1.867941975593567,0.0,0.0,0.0,0.043693039205755166,0.99904500540891,3.7687710419757696,-3.2909788745955404,0.6855168876422327,0.0,0.0,0.0,1.0
1718122599.626172,map,True,True,2,2,0.49874686716791977,0.49874686716791977,2.499079704284668,-1.867941975593567,0.0,0.0,0.0,0.043693039205755166,0.99904500540891,3.7687710419757696,-3.2909788745955404,0.6855168876422327,0.0,0.0,0.0,1.0
1718122599.6767788,map,True,False,2,2,0.49874686716791977,0.49874686716791977,2.499079704284668,-1.867941975593567,0.0,0.0,0.0,0.043693039205755166,0.99904500540891,3.7687710419757696,-3.2909788745955404,0.6855168876422327,0.0,0.0,0.0,1.0
1718122599.7766094,map,True,True,2,2,0.49874686716791977,0.49874686716791977,2.499079704284668,-1.867941975593567,0.0,0.0,0.0,0.043693039205755166,0.99904500540891,3.7687710419757696,-3.2909788745955404,0.6855168876422327,0.0,0.0,0.0,1.0
1718122599.8770716,map,True,False,2,2,0.49874686716791977,0.49874686716791977,2.499079704284668,-1.867941975593567,0.0,0.0,0.0,0.043693039205755166,0.99904500540891,3.7687710419757696,-3.2909788745955404,0.6855168876422327,0.0,0.0,0.0,1.0
1718122599.9303477,map,True,False,2,2,0.49874686716791977,0.49874686716791977,2.499079704284668,-1.867941975593567,0.0,0.0,0.0,0.043693039205755166,0.99904500540891,3.7849029515301207,-3.3092653134574253,0.6855783761193024,0.0,0.0,0.0,1.0
1718122599.9805112,map,True,True,2,2,0.49874686716791977,0.49874686716791977,2.499079704284668,-1.867941975593567,0.0,0.0,0.0,0.043693039205755166,0.99904500540891,3.7849029515301207,-3.3092653134574253,0.6855783761193024,0.0,0.0,0.0,1.0
1718122600.0790591,map,True,False,2,2,0.49874686716791977,0.49874686716791977,2.499079704284668,-1.867941975593567,0.0,0.0,0.0,0.043693039205755166,0.99904500540891,3.7849029515301207,-3.3092653134574253,0.6855783761193024,0.0,0.0,0.0,1.0
1718122600.179911,map,True,True,2,2,0.49874686716791977,0.49874686716791977,2.499079704284668,-1.867941975593567,0.0,0.0,0.0,0.043693039205755166,0.99904500540891,3.7849029515301207,-3.3092653134574253,0.6855783761193024,0.0,0.0,0.0,1.0
