car_pos_meter , car_pos_cell, car_speed, ped_pos_meter, ped_pos_cell, ped_speed
-5.125, 5, 2, 2.685308, 3, 1
-4.604377, 4, 2, 2.684965, 3, 1
-4.083755, 4, 2, 2.684345, 3, 1
-3.563132, 3, 1, 2.683949, 3, 1
-3.532871, 3, 1, 2.683728, 3, 1
-3.507666, 3, 1, 2.683164, 3, 1
-3.478802, 3, 2, 2.68354, 3, 1
-2.958705, 2, 2, 2.683609, 3, 1
-2.438602, 2, 2, 2.683434, 3, 1
-1.91849, 1, 2, 2.720844, 3, 1
-1.398368, 1, 2, 2.719278, 3, 1
