car_pos_meter , car_pos_cell, car_speed, ped_pos_meter, ped_pos_cell, ped_speed
-30.37037, 30, 2, 3.997967, 31, 1
-30.28815, 30, 2, 3.980644, 31, 1
-30.20592, 30, 2, 3.972079, 30, 1
-30.1237, 30, 2, 3.956102, 30, 1
-30.04148, 30, 2, 3.940755, 30, 1
-29.95926, 29, 2, 3.926303, 30, 1
-29.87704, 29, 2, 3.912916, 30, 1
-29.79481, 29, 2, 3.906453, 30, 1
-29.71259, 29, 2, 3.894243, 30, 1
-29.63037, 29, 2, 3.882436, 30, 1
-29.54815, 29, 2, 3.876615, 30, 1
-29.46593, 29, 2, 3.85942, 30, 1
-29.3837, 29, 2, 3.853616, 30, 1
-29.30148, 29, 2, 3.842489, 29, 1
-29.21926, 29, 2, 3.831523, 29, 1
-29.13704, 29, 2, 3.82071, 29, 1
-29.05481, 29, 2, 3.815396, 29, 1
-28.97259, 28, 2, 3.805042, 29, 1
-28.89037, 28, 2, 3.794675, 29, 1
-28.80815, 28, 2, 3.7843, 29, 1
-28.72593, 28, 2, 3.773719, 29, 1
-28.6437, 28, 2, 3.762931, 29, 1
-28.56148, 28, 2, 3.757428, 29, 1
-28.47926, 28, 2, 3.74643, 29, 1
-28.39704, 28, 2, 3.735079, 29, 1
-28.31481, 28, 2, 3.7235, 29, 1
-28.23259, 28, 2, 3.711571, 28, 1
-28.15037, 28, 2, 3.705507, 28, 1
-28.06815, 28, 2, 3.693069, 28, 1
-27.98592, 27, 2, 3.679938, 28, 1
-27.9037, 27, 2, 3.666369, 28, 1
-27.82148, 27, 2, 3.652293, 28, 1
-27.73926, 27, 2, 3.64507, 28, 1
-27.65704, 27, 2, 3.630537, 28, 1
-27.57481, 27, 2, 3.615608, 28, 1
-27.49259, 27, 2, 3.600254, 28, 1
-27.41037, 27, 2, 3.584455, 27, 1
-27.32815, 27, 2, 3.576107, 27, 1
-27.24592, 27, 2, 3.559902, 27, 1
-27.1637, 27, 2, 3.543122, 27, 1
-27.08148, 27, 2, 3.526155, 27, 1
-26.99926, 26, 2, 3.509229, 27, 1
-26.91703, 26, 2, 3.500713, 27, 1
-26.83481, 26, 2, 3.483535, 27, 1
-26.75259, 26, 2, 3.466042, 27, 1
-26.67037, 26, 2, 3.448832, 26, 1
-26.58815, 26, 2, 3.431962, 26, 1
-26.50592, 26, 2, 3.423683, 26, 1
-26.4237, 26, 2, 3.4076, 26, 1
-26.34148, 26, 2, 3.392523, 26, 1
-26.25926, 26, 2, 3.378759, 26, 1
-26.17703, 26, 2, 3.365514, 26, 1
-26.09481, 26, 2, 3.359177, 26, 1
-26.01259, 26, 2, 3.346485, 26, 1
-25.93037, 25, 2, 3.333436, 26, 1
-25.84814, 25, 2, 3.320312, 25, 1
-25.76592, 25, 1, 3.306838, 25, 1
-25.73259, 25, 2, 3.299987, 25, 1
-25.65037, 25, 2, 3.28593, 25, 1
-25.56815, 25, 2, 3.27148, 25, 1
-25.48592, 25, 2, 3.257016, 25, 1
-25.4037, 25, 2, 3.242548, 25, 1
-25.32148, 25, 2, 3.234853, 25, 1
-25.23926, 25, 2, 3.220465, 25, 1
-25.15704, 25, 2, 3.205851, 25, 1
-25.07481, 25, 2, 3.191043, 24, 1
-24.99259, 24, 2, 3.1763, 24, 1
-24.91037, 24, 2, 3.168542, 24, 1
-24.82815, 24, 2, 3.153205, 24, 1
-24.74592, 24, 2, 3.13681, 24, 1
-24.6637, 24, 2, 3.120258, 24, 1
-24.58148, 24, 2, 3.103353, 24, 1
-24.49926, 24, 2, 3.094549, 24, 1
-24.41703, 24, 2, 3.077122, 24, 1
-24.33481, 24, 2, 3.058916, 23, 1
-24.25259, 24, 2, 3.03996, 23, 1
-24.17037, 24, 2, 3.020727, 23, 1
-24.08815, 24, 2, 3.010686, 23, 1
-24.00592, 24, 2, 2.990878, 23, 1
-23.9237, 23, 2, 2.97008, 23, 1
-23.84148, 23, 2, 2.948447, 22, 1
-23.75926, 23, 2, 2.926706, 22, 1
-23.67703, 23, 2, 2.915146, 22, 1
-23.59481, 23, 2, 2.892876, 22, 1
-23.51259, 23, 2, 2.870421, 22, 1
-23.43037, 23, 2, 2.846697, 22, 1
-23.34814, 23, 2, 2.823243, 22, 1
-23.26592, 23, 2, 2.811736, 21, 1
-23.1837, 23, 2, 2.788281, 21, 1
-23.10148, 23, 2, 2.765187, 21, 1
-23.01926, 23, 2, 2.743082, 21, 1
-22.93703, 22, 2, 2.722248, 21, 1
-22.85481, 22, 2, 2.712317, 21, 1
-22.77259, 22, 2, 2.693523, 21, 1
-22.69037, 22, 2, 2.675566, 20, 1
-22.60814, 22, 2, 2.65813, 20, 1
-22.52592, 22, 2, 2.641315, 20, 1
-22.4437, 22, 2, 2.632658, 20, 1
-22.36148, 22, 2, 2.616247, 20, 1
-22.27925, 22, 2, 2.600021, 20, 1
-22.19703, 22, 2, 2.584161, 20, 1
-22.11481, 22, 2, 2.5681, 20, 1
-22.03259, 22, 2, 2.560291, 19, 1
-21.95037, 21, 2, 2.544318, 19, 1
-21.86814, 21, 2, 2.527937, 19, 1
-21.78592, 21, 2, 2.51151, 19, 1
-21.7037, 21, 2, 2.495139, 19, 1
-21.62148, 21, 2, 2.487043, 19, 1
-21.53926, 21, 2, 2.470531, 19, 1
-21.45703, 21, 2, 2.453523, 19, 1
-21.37481, 21, 2, 2.436982, 19, 1
-21.29259, 21, 2, 2.419691, 18, 1
-21.21037, 21, 2, 2.411256, 18, 1
-21.12814, 21, 2, 2.393678, 18, 1
-21.04592, 21, 2, 2.376249, 18, 1
-20.9637, 20, 2, 2.35832, 18, 1
-20.88148, 20, 2, 2.340422, 18, 1
-20.79926, 20, 2, 2.331511, 18, 1
-20.71703, 20, 2, 2.31325, 18, 1
-20.63481, 20, 2, 2.294952, 17, 1
-20.55259, 20, 2, 2.276106, 17, 1
-20.47037, 20, 2, 2.257705, 17, 1
-20.38814, 20, 2, 2.248902, 17, 1
-20.30592, 20, 2, 2.230809, 17, 1
-20.2237, 20, 2, 2.212576, 17, 1
-20.14148, 20, 2, 2.19413, 17, 1
-20.05925, 20, 2, 2.17628, 16, 1
-19.97703, 19, 2, 2.166915, 16, 1
-19.89481, 19, 2, 2.148659, 16, 1
-19.81259, 19, 2, 2.130617, 16, 1
-19.73037, 19, 2, 2.112937, 16, 1
-19.64814, 19, 2, 2.095526, 16, 1
-19.56592, 19, 2, 2.08691, 16, 1
-19.4837, 19, 2, 2.069618, 16, 1
-19.40148, 19, 2, 2.052186, 16, 1
-19.31925, 19, 2, 2.03438, 15, 1
-19.23703, 19, 2, 2.016183, 15, 1
-19.15481, 19, 2, 2.006795, 15, 1
-19.07259, 19, 2, 1.987411, 15, 1
-18.99037, 18, 2, 1.967966, 15, 1
-18.90814, 18, 2, 1.947464, 15, 1
-18.82592, 18, 2, 1.926706, 15, 1
-18.7437, 18, 2, 1.915823, 14, 1
-18.66148, 18, 2, 1.894548, 14, 1
-18.57925, 18, 2, 1.873689, 14, 1
-18.49703, 18, 2, 1.852203, 14, 1
-18.41481, 18, 2, 1.830943, 14, 1
-18.33259, 18, 2, 1.820598, 14, 1
-18.25036, 18, 2, 1.799715, 14, 1
-18.16814, 18, 2, 1.779082, 13, 1
-18.08592, 18, 2, 1.757895, 13, 1
-18.0037, 18, 2, 1.737389, 13, 1
-17.92148, 17, 2, 1.717472, 13, 1
-17.83925, 17, 2, 1.707005, 13, 1
-17.75703, 17, 2, 1.686564, 13, 1
-17.67481, 17, 2, 1.666003, 12, 1
-17.59259, 17, 2, 1.645452, 12, 1
-17.51036, 17, 2, 1.624809, 12, 1
-17.42814, 17, 2, 1.613995, 12, 1
-17.34592, 17, 2, 1.591926, 12, 1
-17.2637, 17, 2, 1.570824, 12, 1
-17.18147, 17, 2, 1.550073, 12, 1
-17.09925, 17, 2, 1.539933, 12, 1
-17.01703, 17, 2, 1.519517, 11, 1
-16.93481, 16, 2, 1.499763, 11, 1
-16.85259, 16, 2, 1.480796, 11, 1
-16.77036, 16, 2, 1.46271, 11, 1
-16.68814, 16, 2, 1.445735, 11, 1
-16.60592, 16, 2, 1.43744, 11, 1
-16.5237, 16, 2, 1.4217, 11, 1
-16.44147, 16, 2, 1.406408, 10, 1
-16.35925, 16, 2, 1.391196, 10, 1
-16.27703, 16, 2, 1.383525, 10, 1
-16.19481, 16, 2, 1.368227, 10, 1
-16.11259, 16, 2, 1.352401, 10, 1
-16.03036, 16, 2, 1.336219, 10, 1
-15.94814, 15, 2, 1.319594, 10, 1
-15.86592, 15, 2, 1.303233, 10, 1
-15.7837, 15, 2, 1.295118, 10, 1
-15.70147, 15, 2, 1.278474, 9, 1
-15.61925, 15, 2, 1.261725, 9, 1
-15.53703, 15, 2, 1.244707, 9, 1
-15.45481, 15, 2, 1.227379, 9, 1
-15.37259, 15, 2, 1.218614, 9, 1
-15.29036, 15, 2, 1.200993, 9, 1
-15.20814, 15, 2, 1.183103, 9, 1
-15.12592, 15, 2, 1.165312, 9, 1
-15.0437, 15, 2, 1.146443, 8, 1
-14.96147, 14, 2, 1.136715, 8, 1
-14.87925, 14, 2, 1.117514, 8, 1
-14.79703, 14, 2, 1.097859, 8, 1
-14.71481, 14, 2, 1.077709, 8, 1
-14.63259, 14, 2, 1.067696, 8, 1
-14.55036, 14, 2, 1.046978, 8, 1
-14.46814, 14, 2, 1.026008, 8, 1
-14.38592, 14, 2, 1.005047, 7, 1
-14.3037, 14, 2, 0.984509, 7, 1
-14.22147, 14, 2, 0.9649088, 7, 1
-14.13925, 14, 2, 0.9554393, 7, 1
-14.05703, 14, 2, 0.9353774, 7, 1
-13.97481, 13, 2, 0.9162133, 7, 1
-13.89258, 13, 2, 0.8981774, 7, 1
-13.81036, 13, 2, 0.8806167, 6, 1
-13.72814, 13, 2, 0.8722486, 6, 1
-13.64592, 13, 2, 0.8558545, 6, 1
-13.5637, 13, 2, 0.8406677, 6, 1
-13.48147, 13, 2, 0.8261871, 6, 1
-13.39925, 13, 2, 0.8113177, 6, 1
-13.31703, 13, 2, 0.8037691, 6, 1
-13.23481, 13, 2, 0.7890015, 6, 1
-13.15258, 13, 2, 0.7741573, 6, 1
-13.07036, 13, 2, 0.7595892, 5, 1
-12.98814, 12, 2, 0.7450886, 5, 1
-12.90592, 12, 2, 0.7379215, 5, 1
-12.8237, 12, 2, 0.7233808, 5, 1
-12.74147, 12, 2, 0.7096829, 5, 1
-12.65925, 12, 2, 0.6956983, 5, 1
-12.57703, 12, 2, 0.6818743, 5, 1
-12.49481, 12, 2, 0.6751282, 5, 1
-12.41258, 12, 2, 0.6618361, 5, 1
-12.33036, 12, 2, 0.6484592, 5, 1
-12.24814, 12, 2, 0.6349409, 4, 1
-12.16592, 12, 2, 0.6211352, 4, 1
-12.08369, 12, 2, 0.6144209, 4, 1
-12.00147, 12, 2, 0.6006763, 4, 1
-11.91925, 11, 2, 0.5869143, 4, 1
-11.83703, 11, 2, 0.5725036, 4, 1
-11.75481, 11, 2, 0.5582035, 4, 1
-11.67258, 11, 2, 0.5508282, 4, 1
-11.59036, 11, 2, 0.5359781, 4, 1
-11.50814, 11, 2, 0.5206888, 4, 1
-11.42592, 11, 2, 0.5048795, 3, 1
-11.34369, 11, 2, 0.4884553, 3, 1
-11.26147, 11, 2, 0.4798844, 3, 1
-11.17925, 11, 2, 0.4624121, 3, 1
-11.09703, 11, 2, 0.4443269, 3, 1
-11.01481, 11, 2, 0.4257755, 3, 1
-10.93258, 10, 2, 0.4069998, 3, 1
-10.85036, 10, 2, 0.3973284, 3, 1
-10.76814, 10, 2, 0.3781495, 2, 1
-10.68592, 10, 2, 0.3586173, 2, 1
-10.60369, 10, 2, 0.3383007, 2, 1
-10.52147, 10, 2, 0.3181572, 2, 1
-10.43925, 10, 2, 0.3078823, 2, 1
-10.35703, 10, 2, 0.2876079, 2, 1
-10.27481, 10, 2, 0.2677288, 2, 1
-10.19258, 10, 2, 0.2484634, 1, 1
-10.11036, 10, 2, 0.2303491, 1, 1
-10.02814, 10, 2, 0.2219017, 1, 1
-9.945916, 9, 2, 0.2061601, 1, 1
-9.863693, 9, 2, 0.1911712, 1, 1
-9.781471, 9, 2, 0.1772618, 1, 1
-9.699249, 9, 2, 0.1640642, 1, 1
-9.617027, 9, 2, 0.1576557, 1, 1
-9.534804, 9, 2, 0.145586, 1, 1
-9.452582, 9, 2, 0.1339357, 1, 1
-9.37036, 9, 2, 0.1227541, 0, 1
-9.288137, 9, 2, 0.1117573, 0, 1
-9.205915, 9, 2, 0.1062858, 0, 1
-9.123693, 9, 2, 0.09545898, 0, 1
-9.041471, 9, 2, 0.08481026, 0, 1
-8.959249, 8, 2, 0.07420135, 0, 1
-8.877027, 8, 2, 0.06378078, 0, 1
-8.794805, 8, 2, 0.0585227, 0, 1
-8.712582, 8, 2, 0.04781151, 0, 1
-8.63036, 8, 2, 0.03685284, 0, 1
-8.548138, 8, 2, 0.02615309, 0, 1
-8.465915, 8, 2, 0.01538801, 0, 1
-8.383693, 8, 2, 0.009867191, 0, 1
-8.301471, 8, 2, -0.0006871223, 0, 1
-8.219249, 8, 2, -0.01070499, 0, 1
-8.137026, 8, 2, -0.02014923, 0, 1
-8.054804, 8, 2, -0.02949238, 0, 1
-7.972581, 7, 2, -0.03402519, 0, 1
-7.890359, 7, 2, -0.0429616, 0, 1
-7.808137, 7, 2, -0.05171967, 0, 1
-7.725914, 7, 2, -0.06001377, 0, 1
-7.643692, 7, 2, -0.06807661, 0, 1
-7.56147, 7, 2, -0.07191086, 0, 1
-7.479248, 7, 2, -0.07967472, 0, 1
-7.397026, 7, 2, -0.08708525, 0, 1
-7.314804, 7, 2, -0.09424782, 0, 1
-7.232581, 7, 2, -0.1014204, 0, 1
-7.150359, 7, 2, -0.104691, 0, 1
-7.068137, 7, 2, -0.1116648, 0, 1
-6.985914, 6, 2, -0.1180186, 0, 1
-6.903692, 6, 2, -0.1241393, 0, 1
-6.82147, 6, 2, -0.1301041, -1, 1
-6.739247, 6, 2, -0.1332202, -1, 1
-6.657025, 6, 2, -0.1388388, -1, 1
-6.574803, 6, 2, -0.1449795, -1, 1
-6.492581, 6, 2, -0.1509409, -1, 1
-6.410358, 6, 2, -0.1571074, -1, 1
-6.328136, 6, 2, -0.160408, -1, 1
-6.245914, 6, 2, -0.1669536, -1, 1
-6.163692, 6, 2, -0.1738214, -1, 1
-6.08147, 6, 2, -0.1809707, -1, 1
-5.999247, 5, 2, -0.1885033, -1, 1
-5.917025, 5, 2, -0.1922827, -1, 1
-5.834803, 5, 2, -0.1998782, -1, 1
-5.75258, 5, 2, -0.2075725, -1, 1
-5.670358, 5, 2, -0.2153358, -1, 1
-5.588136, 5, 2, -0.2235689, -1, 1
-5.505914, 5, 2, -0.2276425, -1, 1
-5.423691, 5, 2, -0.2360535, -1, 1
-5.341469, 5, 2, -0.2448406, -1, 1
-5.259247, 5, 2, -0.253655, -1, 1
-5.177024, 5, 2, -0.2626362, -2, 1
-5.094802, 5, 2, -0.2670336, -2, 1
-5.01258, 5, 2, -0.2762389, -2, 1
-4.930357, 4, 2, -0.285708, -2, 1
-4.848135, 4, 2, -0.2952576, -2, 1
-4.765913, 4, 2, -0.3046179, -2, 1
-4.683691, 4, 2, -0.3094721, -2, 1
-4.601469, 4, 2, -0.3195181, -2, 1
-4.519246, 4, 2, -0.3298883, -2, 1
-4.437024, 4, 2, -0.3403902, -2, 1
-4.354802, 4, 2, -0.3511868, -2, 1
-4.27258, 4, 2, -0.3566766, -2, 1
-4.190357, 4, 2, -0.3684583, -2, 1
-4.108135, 4, 2, -0.3792534, -2, 1
-4.025913, 4, 2, -0.3898239, -3, 1
-3.943691, 3, 2, -0.4000673, -3, 1
-3.861468, 3, 2, -0.4050827, -3, 1
-3.779246, 3, 2, -0.4141088, -3, 1
-3.697024, 3, 2, -0.4228792, -3, 1
-3.614801, 3, 2, -0.4310679, -3, 1
-3.532579, 3, 2, -0.4385505, -3, 1
-3.450357, 3, 2, -0.4418039, -3, 1
-3.368134, 3, 2, -0.4480667, -3, 1
-3.285912, 3, 2, -0.4535198, -3, 1
-3.20369, 3, 2, -0.4580498, -3, 1
-3.121468, 3, 2, -0.4622107, -3, 1
-3.039246, 3, 2, -0.4639196, -3, 1
-2.957023, 2, 2, -0.4668818, -3, 1
-2.874801, 2, 2, -0.4692912, -3, 1
-2.792579, 2, 2, -0.4709849, -3, 1
-2.710356, 2, 2, -0.4721179, -3, 1
-2.628134, 2, 2, -0.472271, -3, 1
-2.545912, 2, 2, -0.4721746, -3, 1
-2.46369, 2, 2, -0.4712982, -3, 1
-2.381467, 2, 2, -0.4701757, -3, 1
-2.299245, 2, 2, -0.468688, -3, 1
-2.217023, 2, 2, -0.4677558, -3, 1
-2.134801, 2, 2, -0.4659147, -3, 1
-2.052578, 2, 2, -0.4635286, -3, 1
-1.970356, 1, 2, -0.4609623, -3, 1
-1.888134, 1, 2, -0.4587898, -3, 1
-1.805912, 1, 2, -0.4571247, -3, 1
-1.723689, 1, 2, -0.4507613, -3, 1
-1.641467, 1, 2, -0.4464302, -3, 1
-1.559245, 1, 2, -0.4420881, -3, 1
-1.477023, 1, 2, -0.4375734, -3, 1
-1.3948, 1, 2, -0.4351931, -3, 1
-1.312578, 1, 2, -0.4302874, -3, 1
-1.230356, 1, 2, -0.4260201, -3, 1
-1.148133, 1, 2, -0.4215498, -3, 1
-1.065911, 1, 2, -0.4170756, -3, 1
-0.9836889, 0, 2, -0.4147792, -3, 1
-0.9014666, 0, 2, -0.4102283, -3, 1
-0.8192444, 0, 2, -0.4056063, -3, 1
-0.7370222, 0, 2, -0.4009447, -3, 1
-0.6547999, 0, 2, -0.3959074, -3, 1
-0.5725777, 0, 2, -0.393549, -3, 1
-0.4903555, 0, 2, -0.3898363, -3, 1
-0.4081333, 0, 2, -0.3854141, -3, 1
-0.325911, 0, 2, -0.3811002, -2, 1
-0.2436888, 0, 2, -0.3769855, -2, 1
-0.1614666, 0, 2, -0.3747339, -2, 1
-0.07924438, 0, 2, -0.3711376, -2, 1
0.002977848, 0, 2, -0.3677063, -2, 1
0.08520007, 0, 2, -0.3640323, -2, 1
0.1674223, 0, 2, -0.3625288, -2, 1
