timestamp_sec,frame_id,game_played,yielding,player1discrete,player2discrete,player1yieldprob,player2yieldprob,player1_pose_x,player1_pose_y,player1_pose_z,player1_pose_orient_x,player1_pose_orient_y,player1_pose_orient_z,player1_pose_orient_w,player2_pose_x,player2_pose_y,player2_pose_z,player2_pose_orient_x,player2_pose_orient_y,player2_pose_orient_z,player2_pose_orient_w
1717775522.0658708,map,True,False,3,3,0.6616527499769684,0.6616527499769684,3.0004215240478516,-2.672992706298828,0.0,0.0,0.0,0.05077611247333335,0.9987100685835907,4.580591770161747,-5.47298909832055,0.805097405030926,0.0,0.0,0.0,1.0
1717775522.1166458,map,True,True,3,3,0.6616527499769684,0.6616527499769684,3.0004215240478516,-2.672992706298828,0.0,0.0,0.0,0.05077611247333335,0.9987100685835907,4.580591770161747,-5.47298909832055,0.805097405030926,0.0,0.0,0.0,1.0
1717775522.1681733,map,True,True,3,3,0.6616527499769684,0.6616527499769684,3.0004215240478516,-2.672992706298828,0.0,0.0,0.0,0.05077611247333335,0.9987100685835907,4.580591770161747,-5.47298909832055,0.805097405030926,0.0,0.0,0.0,1.0
1717775522.2163937,map,True,True,3,3,0.6616527499769684,0.6616527499769684,3.1386685371398926,-2.691959857940674,0.0,0.0,0.0,0.05046259649095994,0.9987259586911634,4.580591770161747,-5.47298909832055,0.805097405030926,0.0,0.0,0.0,1.0
1717775522.2675858,map,True,True,3,3,0.6616527499769684,0.6616527499769684,3.1386685371398926,-2.691959857940674,0.0,0.0,0.0,0.05046259649095994,0.9987259586911634,4.580591770161747,-5.47298909832055,0.805097405030926,0.0,0.0,0.0,1.0
1717775522.367551,map,True,True,3,3,0.6616527499769684,0.6616527499769684,3.1386685371398926,-2.691959857940674,0.0,0.0,0.0,0.05046259649095994,0.9987259586911634,4.649561835765127,-5.194702956414021,0.6743331968150276,0.0,0.0,0.0,1.0
1717775522.4704318,map,True,False,3,3,0.6616527499769684,0.6616527499769684,3.1386685371398926,-2.691959857940674,0.0,0.0,0.0,0.05046259649095994,0.9987259586911634,4.649561835765127,-5.194702956414021,0.6743331968150276,0.0,0.0,0.0,1.0
1717775522.5169423,map,True,False,3,3,0.6616527499769684,0.6616527499769684,3.1386685371398926,-2.691959857940674,0.0,0.0,0.0,0.05046259649095994,0.9987259586911634,4.649561835765127,-5.194702956414021,0.6743331968150276,0.0,0.0,0.0,1.0
1717775522.6155155,map,True,True,3,3,0.6616527499769684,0.6616527499769684,3.1386685371398926,-2.691959857940674,0.0,0.0,0.0,0.05046259649095994,0.9987259586911634,4.649561835765127,-5.194702956414021,0.6743331968150276,0.0,0.0,0.0,1.0
1717775522.768561,map,True,False,3,3,0.6616527499769684,0.6616527499769684,3.1386685371398926,-2.691959857940674,0.0,0.0,0.0,0.05046259649095994,0.9987259586911634,4.6686830204190715,-4.91246877723582,0.6884541335025247,0.0,0.0,0.0,1.0
1717775522.8172073,map,True,True,3,3,0.6616527499769684,0.6616527499769684,3.294506072998047,-2.7381105422973633,0.0,0.0,0.0,0.05104281269067179,0.9986964610792525,4.6686830204190715,-4.91246877723582,0.6884541335025247,0.0,0.0,0.0,1.0
1717775522.8689759,map,True,True,3,3,0.6616527499769684,0.6616527499769684,3.294506072998047,-2.7381105422973633,0.0,0.0,0.0,0.05104281269067179,0.9986964610792525,4.6686830204190715,-4.91246877723582,0.6884541335025247,0.0,0.0,0.0,1.0
1717775522.9179628,map,True,True,3,3,0.6616527499769684,0.6616527499769684,3.294506072998047,-2.7381105422973633,0.0,0.0,0.0,0.05104281269067179,0.9986964610792525,4.6686830204190715,-4.91246877723582,0.6884541335025247,0.0,0.0,0.0,1.0
1717775523.0190964,map,True,True,3,3,0.6616527499769684,0.6616527499769684,3.294506072998047,-2.7381105422973633,0.0,0.0,0.0,0.05104281269067179,0.9986964610792525,4.672176114658628,-4.78924356331672,0.684759282154232,0.0,0.0,0.0,1.0
1717775523.1174984,map,True,False,3,3,0.6616527499769684,0.6616527499769684,3.294506072998047,-2.7381105422973633,0.0,0.0,0.0,0.05104281269067179,0.9986964610792525,4.665726963442565,-4.75989707490664,0.68786570966654,0.0,0.0,0.0,1.0
1717775523.1696033,map,True,True,3,3,0.6616527499769684,0.6616527499769684,3.294506072998047,-2.7381105422973633,0.0,0.0,0.0,0.05104281269067179,0.9986964610792525,4.665726963442565,-4.75989707490664,0.68786570966654,0.0,0.0,0.0,1.0
1717775523.2183082,map,True,True,3,3,0.6616527499769684,0.6616527499769684,3.294506072998047,-2.7381105422973633,0.0,0.0,0.0,0.05104281269067179,0.9986964610792525,4.665726963442565,-4.75989707490664,0.68786570966654,0.0,0.0,0.0,1.0
1717775523.269384,map,True,False,3,3,0.6616527499769684,0.6616527499769684,3.294506072998047,-2.7381105422973633,0.0,0.0,0.0,0.05104281269067179,0.9986964610792525,4.665726963442565,-4.75989707490664,0.68786570966654,0.0,0.0,0.0,1.0
1717775523.3203108,map,True,False,3,3,0.6616527499769684,0.6616527499769684,3.294506072998047,-2.7381105422973633,0.0,0.0,0.0,0.05104281269067179,0.9986964610792525,4.665726963442565,-4.75989707490664,0.68786570966654,0.0,0.0,0.0,1.0
1717775523.3815358,map,True,False,2,2,0.49874686716791977,0.49874686716791977,3.4000086784362793,-2.75406551361084,0.0,0.0,0.0,0.05221791319156284,0.9986357174254197,4.65778331545277,-4.652776687254492,0.6844843669249362,0.0,0.0,0.0,1.0
1717775523.4274871,map,True,False,2,2,0.49874686716791977,0.49874686716791977,3.4000086784362793,-2.75406551361084,0.0,0.0,0.0,0.05221791319156284,0.9986357174254197,4.656880338700208,-4.648472142304709,0.6844754805243328,0.0,0.0,0.0,1.0
1717775523.5284162,map,True,False,2,2,0.49874686716791977,0.49874686716791977,3.4000086784362793,-2.75406551361084,0.0,0.0,0.0,0.05221791319156284,0.9986357174254197,4.656880338700208,-4.648472142304709,0.6844754805243328,0.0,0.0,0.0,1.0
1717775523.677528,map,True,False,2,2,0.49874686716791977,0.49874686716791977,3.4000086784362793,-2.75406551361084,0.0,0.0,0.0,0.05221791319156284,0.9986357174254197,4.693401650355225,-4.616619103659856,0.6843943921188307,0.0,0.0,0.0,1.0
1717775523.7283556,map,True,False,2,2,0.49874686716791977,0.49874686716791977,3.4000086784362793,-2.75406551361084,0.0,0.0,0.0,0.05221791319156284,0.9986357174254197,4.6891666282827735,-4.622231572463088,0.6873383622907778,0.0,0.0,0.0,1.0
1717775523.8283272,map,True,True,2,2,0.49874686716791977,0.49874686716791977,3.4000086784362793,-2.75406551361084,0.0,0.0,0.0,0.05221791319156284,0.9986357174254197,4.6891666282827735,-4.622231572463088,0.6873383622907778,0.0,0.0,0.0,1.0
1717775523.927777,map,True,True,2,2,0.49874686716791977,0.49874686716791977,3.4291491508483887,-2.766568660736084,0.0,0.0,0.0,0.05302019346455046,0.9985934438691545,4.6891666282827735,-4.622231572463088,0.6873383622907778,0.0,0.0,0.0,1.0
1717775523.977866,map,True,True,2,2,0.49874686716791977,0.49874686716791977,3.4291491508483887,-2.766568660736084,0.0,0.0,0.0,0.05302019346455046,0.9985934438691545,4.6891666282827735,-4.622231572463088,0.6873383622907778,0.0,0.0,0.0,1.0
1717775524.0774968,map,True,False,2,2,0.49874686716791977,0.49874686716791977,3.4291491508483887,-2.766568660736084,0.0,0.0,0.0,0.05302019346455046,0.9985934438691545,4.70464156428403,-4.645789350297903,0.7078092908613433,0.0,0.0,0.0,1.0
1717775524.1288924,map,True,True,2,2,0.49874686716791977,0.49874686716791977,3.4291491508483887,-2.766568660736084,0.0,0.0,0.0,0.05302019346455046,0.9985934438691545,4.70464156428403,-4.645789350297903,0.7078092908613433,0.0,0.0,0.0,1.0
1717775524.179507,map,True,False,2,2,0.49874686716791977,0.49874686716791977,3.4291491508483887,-2.766568660736084,0.0,0.0,0.0,0.05302019346455046,0.9985934438691545,4.70464156428403,-4.645789350297903,0.7078092908613433,0.0,0.0,0.0,1.0
1717775524.2785661,map,True,True,2,2,0.49874686716791977,0.49874686716791977,3.4291491508483887,-2.766568660736084,0.0,0.0,0.0,0.05302019346455046,0.9985934438691545,4.70464156428403,-4.645789350297903,0.7078092908613433,0.0,0.0,0.0,1.0
1717775524.329096,map,True,False,2,2,0.49874686716791977,0.49874686716791977,3.4291491508483887,-2.766568660736084,0.0,0.0,0.0,0.05302019346455046,0.9985934438691545,4.70464156428403,-4.645789350297903,0.7078092908613433,0.0,0.0,0.0,1.0
1717775524.3790405,map,True,True,2,2,0.49874686716791977,0.49874686716791977,3.4291491508483887,-2.766568660736084,0.0,0.0,0.0,0.05302019346455046,0.9985934438691545,4.726294772605186,-4.630037355247294,0.7534083617106885,0.0,0.0,0.0,1.0
1717775524.481011,map,True,False,2,2,0.49874686716791977,0.49874686716791977,3.4291491508483887,-2.766568660736084,0.0,0.0,0.0,0.05302019346455046,0.9985934438691545,4.726294772605186,-4.630037355247294,0.7534083617106885,0.0,0.0,0.0,1.0
1717775524.5299199,map,True,True,2,2,0.49874686716791977,0.49874686716791977,3.4291491508483887,-2.766568660736084,0.0,0.0,0.0,0.05302019346455046,0.9985934438691545,4.726294772605186,-4.630037355247294,0.7534083617106885,0.0,0.0,0.0,1.0
