timestamp_sec,frame_id,game_played,yielding,player1discrete,player2discrete,player1yieldprob,player2yieldprob,player1_pose_x,player1_pose_y,player1_pose_z,player1_pose_orient_x,player1_pose_orient_y,player1_pose_orient_z,player1_pose_orient_w,player2_pose_x,player2_pose_y,player2_pose_z,player2_pose_orient_x,player2_pose_orient_y,player2_pose_orient_z,player2_pose_orient_w
1718107721.7825387,map,True,True,4,4,0.5922520728754596,0.5922520728754596,1.7411636114120483,-1.663967490196228,0.0,0.0,0.0,0.06373871327121361,0.9979666212927323,3.611483680896272,-5.325350159638518,0.7667863606575109,0.0,0.0,0.0,1.0
1718107722.1348658,map,True,True,4,4,0.5922520728754596,0.5922520728754596,1.8229180574417114,-1.6735961437225342,0.0,0.0,0.0,0.06431742603515757,0.9979294859050181,3.6137280098205795,-5.023082110127662,0.7594756979484312,0.0,0.0,0.0,1.0
1718107722.2356746,map,True,True,4,4,0.5922520728754596,0.5922520728754596,1.8229180574417114,-1.6735961437225342,0.0,0.0,0.0,0.06431742603515757,0.9979294859050181,3.6137280098205795,-5.023082110127662,0.7594756979484312,0.0,0.0,0.0,1.0
1718107722.3351283,map,True,True,4,4,0.5922520728754596,0.5922520728754596,1.9193613529205322,-1.690886378288269,0.0,0.0,0.0,0.06517488998278737,0.9978738623632545,3.6137280098205795,-5.023082110127662,0.7594756979484312,0.0,0.0,0.0,1.0
1718107722.4340136,map,True,False,4,3,0.0,0.0,1.9193613529205322,-1.690886378288269,0.0,0.0,0.0,0.06517488998278737,0.9978738623632545,3.662567276753697,-4.928088236066301,0.7922981122166475,0.0,0.0,0.0,1.0
1718107722.4846597,map,True,False,4,3,0.0,0.0,1.9193613529205322,-1.690886378288269,0.0,0.0,0.0,0.06517488998278737,0.9978738623632545,3.662567276753697,-4.928088236066301,0.7922981122166475,0.0,0.0,0.0,1.0
1718107722.5352437,map,True,False,4,3,0.0,0.0,1.9193613529205322,-1.690886378288269,0.0,0.0,0.0,0.06517488998278737,0.9978738623632545,3.662567276753697,-4.928088236066301,0.7922981122166475,0.0,0.0,0.0,1.0
1718107722.635605,map,True,False,4,3,0.0,0.0,1.9193613529205322,-1.690886378288269,0.0,0.0,0.0,0.06517488998278737,0.9978738623632545,3.662567276753697,-4.928088236066301,0.7922981122166475,0.0,0.0,0.0,1.0
1718107722.6852665,map,True,False,4,3,0.0,0.0,1.9193613529205322,-1.690886378288269,0.0,0.0,0.0,0.06517488998278737,0.9978738623632545,3.662567276753697,-4.928088236066301,0.7922981122166475,0.0,0.0,0.0,1.0
1718107722.7367554,map,True,False,4,3,0.0,0.0,1.9193613529205322,-1.690886378288269,0.0,0.0,0.0,0.06517488998278737,0.9978738623632545,3.701884595491333,-4.711379957166679,0.7246577334818691,0.0,0.0,0.0,1.0
1718107723.0871615,map,True,False,3,3,0.6616527499769684,0.6616527499769684,2.013317823410034,-1.7068978548049927,0.0,0.0,0.0,0.06636453130326823,0.9977954465685347,3.636297371971219,-4.0683890339909325,0.6929094375458691,0.0,0.0,0.0,1.0
1718107723.1863375,map,True,True,3,3,0.6616527499769684,0.6616527499769684,2.013317823410034,-1.7068978548049927,0.0,0.0,0.0,0.06636453130326823,0.9977954465685347,3.636297371971219,-4.0683890339909325,0.6929094375458691,0.0,0.0,0.0,1.0
1718107723.2368858,map,True,True,3,3,0.6616527499769684,0.6616527499769684,2.013317823410034,-1.7068978548049927,0.0,0.0,0.0,0.06636453130326823,0.9977954465685347,3.636297371971219,-4.0683890339909325,0.6929094375458691,0.0,0.0,0.0,1.0
1718107723.3358994,map,True,True,3,3,0.6616527499769684,0.6616527499769684,2.0920116901397705,-1.7173740863800049,0.0,0.0,0.0,0.06718300093257462,0.997740666844037,3.636297371971219,-4.0683890339909325,0.6929094375458691,0.0,0.0,0.0,1.0
1718107723.388839,map,True,True,3,3,0.6616527499769684,0.6616527499769684,2.0920116901397705,-1.7173740863800049,0.0,0.0,0.0,0.06718300093257462,0.997740666844037,3.636297371971219,-4.0683890339909325,0.6929094375458691,0.0,0.0,0.0,1.0
1718107723.440265,map,True,False,3,2,0.0,0.0,2.0920116901397705,-1.7173740863800049,0.0,0.0,0.0,0.06718300093257462,0.997740666844037,3.6560844609374197,-3.9056571961814965,0.6991647728231942,0.0,0.0,0.0,1.0
1718107723.4899526,map,True,False,3,2,0.0,0.0,2.0920116901397705,-1.7173740863800049,0.0,0.0,0.0,0.06718300093257462,0.997740666844037,3.6560844609374197,-3.9056571961814965,0.6991647728231942,0.0,0.0,0.0,1.0
1718107723.5903199,map,True,False,3,2,0.0,0.0,2.0920116901397705,-1.7173740863800049,0.0,0.0,0.0,0.06718300093257462,0.997740666844037,3.6560844609374197,-3.9056571961814965,0.6991647728231942,0.0,0.0,0.0,1.0
1718107723.6407585,map,True,False,3,2,0.0,0.0,2.0920116901397705,-1.7173740863800049,0.0,0.0,0.0,0.06718300093257462,0.997740666844037,3.6560844609374197,-3.9056571961814965,0.6991647728231942,0.0,0.0,0.0,1.0
1718107723.741971,map,True,False,3,2,0.0,0.0,2.0920116901397705,-1.7173740863800049,0.0,0.0,0.0,0.06718300093257462,0.997740666844037,3.7157179752403353,-3.6150880611607814,0.6841016413923495,0.0,0.0,0.0,1.0
1718107724.141106,map,True,False,3,2,0.0,0.0,2.1420161724090576,-1.723964810371399,0.0,0.0,0.0,0.06758090194983501,0.99771379858976,3.705276363833537,-3.2406150441315345,0.6831729924080054,0.0,0.0,0.0,1.0
1718107724.1949494,map,True,False,3,2,0.0,0.0,2.1420161724090576,-1.723964810371399,0.0,0.0,0.0,0.06758090194983501,0.99771379858976,3.705276363833537,-3.2406150441315345,0.6831729924080054,0.0,0.0,0.0,1.0
1718107724.242715,map,True,False,3,2,0.0,0.0,2.1420161724090576,-1.723964810371399,0.0,0.0,0.0,0.06758090194983501,0.99771379858976,3.705276363833537,-3.2406150441315345,0.6831729924080054,0.0,0.0,0.0,1.0
1718107724.3414302,map,True,False,3,2,0.0,0.0,2.2775745391845703,-1.743637204170227,0.0,0.0,0.0,0.06920291243417269,0.9976025990374282,3.705276363833537,-3.2406150441315345,0.6831729924080054,0.0,0.0,0.0,1.0
1718107724.3920302,map,True,False,3,2,0.0,0.0,2.2775745391845703,-1.743637204170227,0.0,0.0,0.0,0.06920291243417269,0.9976025990374282,3.764288024780745,-3.0363228169896193,0.6826319816308082,0.0,0.0,0.0,1.0
1718107724.4457107,map,True,False,3,2,0.0,0.0,2.2775745391845703,-1.743637204170227,0.0,0.0,0.0,0.06920291243417269,0.9976025990374282,3.779884585968891,-2.981200666231185,0.6824427685604437,0.0,0.0,0.0,1.0
1718107724.5436876,map,True,False,3,2,0.0,0.0,2.2775745391845703,-1.743637204170227,0.0,0.0,0.0,0.06920291243417269,0.9976025990374282,3.779884585968891,-2.981200666231185,0.6824427685604437,0.0,0.0,0.0,1.0
1718107724.5956883,map,True,False,3,2,0.0,0.0,2.2775745391845703,-1.743637204170227,0.0,0.0,0.0,0.06920291243417269,0.9976025990374282,3.779884585968891,-2.981200666231185,0.6824427685604437,0.0,0.0,0.0,1.0
1718107724.6468964,map,True,False,3,2,0.0,0.0,2.2775745391845703,-1.743637204170227,0.0,0.0,0.0,0.06920291243417269,0.9976025990374282,3.779884585968891,-2.981200666231185,0.6824427685604437,0.0,0.0,0.0,1.0
1718107724.694856,map,True,False,3,2,0.0,0.0,2.2775745391845703,-1.743637204170227,0.0,0.0,0.0,0.06920291243417269,0.9976025990374282,3.779884585968891,-2.981200666231185,0.6824427685604437,0.0,0.0,0.0,1.0
1718107724.7948139,map,True,False,3,1,0.0,0.0,2.2775745391845703,-1.743637204170227,0.0,0.0,0.0,0.06920291243417269,0.9976025990374282,3.8704135857341835,-2.6581252812337803,0.6814658898668255,0.0,0.0,0.0,1.0
1718107725.1486373,map,True,False,3,1,0.0,0.0,2.3756654262542725,-1.7493253946304321,0.0,0.0,0.0,0.06942536813090663,0.9975871540897481,3.8432216939630237,-2.454006806907648,0.6812253998859183,0.0,0.0,0.0,1.0
1718107725.196381,map,True,False,3,1,0.0,0.0,2.3756654262542725,-1.7493253946304321,0.0,0.0,0.0,0.06942536813090663,0.9975871540897481,3.8432216939630237,-2.454006806907648,0.6812253998859183,0.0,0.0,0.0,1.0
1718107725.2482967,map,True,False,3,1,0.0,0.0,2.3756654262542725,-1.7493253946304321,0.0,0.0,0.0,0.06942536813090663,0.9975871540897481,3.8432216939630237,-2.454006806907648,0.6812253998859183,0.0,0.0,0.0,1.0
1718107725.3459585,map,True,False,2,1,0.0,0.0,2.487196207046509,-1.7630257606506348,0.0,0.0,0.0,0.06943841198297038,0.9975862429199879,3.8432216939630237,-2.454006806907648,0.6812253998859183,0.0,0.0,0.0,1.0
1718107725.3964825,map,True,False,2,1,0.0,0.0,2.487196207046509,-1.7630257606506348,0.0,0.0,0.0,0.06943841198297038,0.9975862429199879,3.895732074106726,-2.186625949429686,0.6817248649043757,0.0,0.0,0.0,1.0
1718107725.448555,map,True,False,2,1,0.0,0.0,2.487196207046509,-1.7630257606506348,0.0,0.0,0.0,0.06943841198297038,0.9975862429199879,3.9150080486862726,-2.081015338681421,0.6812745896218442,0.0,0.0,0.0,1.0
1718107725.4972672,map,True,False,2,1,0.0,0.0,2.487196207046509,-1.7630257606506348,0.0,0.0,0.0,0.06943841198297038,0.9975862429199879,3.9150080486862726,-2.081015338681421,0.6812745896218442,0.0,0.0,0.0,1.0
1718107725.5441587,map,True,False,2,1,0.0,0.0,2.487196207046509,-1.7630257606506348,0.0,0.0,0.0,0.06943841198297038,0.9975862429199879,3.9150080486862726,-2.081015338681421,0.6812745896218442,0.0,0.0,0.0,1.0
1718107725.5485325,map,True,False,2,1,0.0,0.0,2.487196207046509,-1.7630257606506348,0.0,0.0,0.0,0.06943841198297038,0.9975862429199879,3.9150080486862726,-2.081015338681421,0.6812745896218442,0.0,0.0,0.0,1.0
1718107725.553835,map,True,False,2,1,0.0,0.0,2.487196207046509,-1.7630257606506348,0.0,0.0,0.0,0.06943841198297038,0.9975862429199879,3.9150080486862726,-2.081015338681421,0.6812745896218442,0.0,0.0,0.0,1.0
1718107725.5966525,map,True,False,2,1,0.0,0.0,2.487196207046509,-1.7630257606506348,0.0,0.0,0.0,0.06943841198297038,0.9975862429199879,3.9150080486862726,-2.081015338681421,0.6812745896218442,0.0,0.0,0.0,1.0
1718107725.6004097,map,True,False,2,1,0.0,0.0,2.487196207046509,-1.7630257606506348,0.0,0.0,0.0,0.06943841198297038,0.9975862429199879,3.9150080486862726,-2.081015338681421,0.6812745896218442,0.0,0.0,0.0,1.0
1718107725.656078,map,True,False,2,1,0.0,0.0,2.560307502746582,-1.7801673412322998,0.0,0.0,0.0,0.07004883054669496,0.9975435663810155,3.9150080486862726,-2.081015338681421,0.6812745896218442,0.0,0.0,0.0,1.0
1718107725.7047594,map,True,False,2,1,0.0,0.0,2.560307502746582,-1.7801673412322998,0.0,0.0,0.0,0.07004883054669496,0.9975435663810155,3.9150080486862726,-2.081015338681421,0.6812745896218442,0.0,0.0,0.0,1.0
1718107725.7167947,map,True,False,2,1,0.0,0.0,2.560307502746582,-1.7801673412322998,0.0,0.0,0.0,0.07004883054669496,0.9975435663810155,3.9150080486862726,-2.081015338681421,0.6812745896218442,0.0,0.0,0.0,1.0
1718107725.719274,map,True,False,2,1,0.0,0.0,2.560307502746582,-1.7801673412322998,0.0,0.0,0.0,0.07004883054669496,0.9975435663810155,3.9150080486862726,-2.081015338681421,0.6812745896218442,0.0,0.0,0.0,1.0
1718107725.7213967,map,True,False,2,1,0.0,0.0,2.560307502746582,-1.7801673412322998,0.0,0.0,0.0,0.07004883054669496,0.9975435663810155,3.9150080486862726,-2.081015338681421,0.6812745896218442,0.0,0.0,0.0,1.0
1718107725.7500308,map,True,False,2,8,0.0,0.0,2.560307502746582,-1.7801673412322998,0.0,0.0,0.0,0.07004883054669496,0.9975435663810155,9.695154696112983,-5.781996649694437,0.6871699845954775,0.0,0.0,0.0,1.0
1718107725.764201,map,True,False,2,8,0.0,0.0,2.560307502746582,-1.7801673412322998,0.0,0.0,0.0,0.07004883054669496,0.9975435663810155,9.695154696112983,-5.781996649694437,0.6871699845954775,0.0,0.0,0.0,1.0
1718107725.7822795,map,True,False,2,8,0.0,0.0,2.560307502746582,-1.7801673412322998,0.0,0.0,0.0,0.07004883054669496,0.9975435663810155,9.695154696112983,-5.781996649694437,0.6871699845954775,0.0,0.0,0.0,1.0
1718107725.7883048,map,True,False,2,8,0.0,0.0,2.560307502746582,-1.7801673412322998,0.0,0.0,0.0,0.07004883054669496,0.9975435663810155,9.695154696112983,-5.781996649694437,0.6871699845954775,0.0,0.0,0.0,1.0
1718107725.8044658,map,True,False,2,8,0.0,0.0,2.560307502746582,-1.7801673412322998,0.0,0.0,0.0,0.07004883054669496,0.9975435663810155,9.695154696112983,-5.781996649694437,0.6871699845954775,0.0,0.0,0.0,1.0
