timestamp_sec,frame_id,game_played,yielding,player1discrete,player2discrete,player1yieldprob,player2yieldprob,player1_pose_x,player1_pose_y,player1_pose_z,player1_pose_orient_x,player1_pose_orient_y,player1_pose_orient_z,player1_pose_orient_w,player2_pose_x,player2_pose_y,player2_pose_z,player2_pose_orient_x,player2_pose_orient_y,player2_pose_orient_z,player2_pose_orient_w
1717691529.0168376,map,True,True,4,4,0.5922520728754596,0.5922520728754596,2.8329882621765137,-2.502767562866211,0.0,0.0,0.0,0.04053445717448413,0.9991781463605196,1.1551481630156024,-4.70649421637612,0.7178211137648999,0.0,0.0,0.0,1.0
1717691529.070776,map,True,True,4,4,0.5922520728754596,0.5922520728754596,2.8329882621765137,-2.502767562866211,0.0,0.0,0.0,0.04053445717448413,0.9991781463605196,1.1551481630156024,-4.70649421637612,0.7178211137648999,0.0,0.0,0.0,1.0
1717691529.1175237,map,True,True,4,4,0.5922520728754596,0.5922520728754596,2.8329882621765137,-2.502767562866211,0.0,0.0,0.0,0.04053445717448413,0.9991781463605196,1.1551481630156024,-4.70649421637612,0.7178211137648999,0.0,0.0,0.0,1.0
1717691529.2162826,map,True,True,4,4,0.5922520728754596,0.5922520728754596,2.8329882621765137,-2.502767562866211,0.0,0.0,0.0,0.04053445717448413,0.9991781463605196,1.1551481630156024,-4.70649421637612,0.7178211137648999,0.0,0.0,0.0,1.0
1717691529.3700857,map,True,True,4,4,0.5922520728754596,0.5922520728754596,2.8329882621765137,-2.502767562866211,0.0,0.0,0.0,0.04053445717448413,0.9991781463605196,1.1595031196105445,-4.366560099164432,0.9259692218013521,0.0,0.0,0.0,1.0
1717691529.4686363,map,True,False,4,4,0.5922520728754596,0.5922520728754596,2.8329882621765137,-2.502767562866211,0.0,0.0,0.0,0.04053445717448413,0.9991781463605196,1.1595031196105445,-4.366560099164432,0.9259692218013521,0.0,0.0,0.0,1.0
1717691529.5184667,map,True,False,4,4,0.5922520728754596,0.5922520728754596,2.8329882621765137,-2.502767562866211,0.0,0.0,0.0,0.04053445717448413,0.9991781463605196,1.1595031196105445,-4.366560099164432,0.9259692218013521,0.0,0.0,0.0,1.0
1717691529.5682993,map,True,True,4,4,0.5922520728754596,0.5922520728754596,2.8329882621765137,-2.502767562866211,0.0,0.0,0.0,0.04053445717448413,0.9991781463605196,1.1595031196105445,-4.366560099164432,0.9259692218013521,0.0,0.0,0.0,1.0
1717691529.6707783,map,True,False,4,4,0.5922520728754596,0.5922520728754596,2.8329882621765137,-2.502767562866211,0.0,0.0,0.0,0.04053445717448413,0.9991781463605196,1.1595031196105445,-4.366560099164432,0.9259692218013521,0.0,0.0,0.0,1.0
1717691529.7222402,map,True,False,4,4,0.5922520728754596,0.5922520728754596,2.8329882621765137,-2.502767562866211,0.0,0.0,0.0,0.04053445717448413,0.9991781463605196,1.134497592537453,-3.860987961125119,0.7734092670948834,0.0,0.0,0.0,1.0
1717691529.7713094,map,True,True,4,4,0.5922520728754596,0.5922520728754596,2.8329882621765137,-2.502767562866211,0.0,0.0,0.0,0.04053445717448413,0.9991781463605196,1.134497592537453,-3.860987961125119,0.7734092670948834,0.0,0.0,0.0,1.0
1717691529.8208196,map,True,False,3,4,0.0,0.0,3.012345790863037,-2.537370204925537,0.0,0.0,0.0,0.0411505723924964,0.9991529572802811,1.134497592537453,-3.860987961125119,0.7734092670948834,0.0,0.0,0.0,1.0
1717691529.9198978,map,True,False,3,4,0.0,0.0,3.012345790863037,-2.537370204925537,0.0,0.0,0.0,0.0411505723924964,0.9991529572802811,1.134497592537453,-3.860987961125119,0.7734092670948834,0.0,0.0,0.0,1.0
1717691529.9716206,map,True,False,3,4,0.0,0.0,3.012345790863037,-2.537370204925537,0.0,0.0,0.0,0.0411505723924964,0.9991529572802811,1.134497592537453,-3.860987961125119,0.7734092670948834,0.0,0.0,0.0,1.0
1717691530.07598,map,True,False,3,4,0.0,0.0,3.012345790863037,-2.537370204925537,0.0,0.0,0.0,0.0411505723924964,0.9991529572802811,1.1567987033615008,-3.5100089142891373,0.6927847800036141,0.0,0.0,0.0,1.0
1717691530.1256871,map,True,False,3,4,0.0,0.0,3.012345790863037,-2.537370204925537,0.0,0.0,0.0,0.0411505723924964,0.9991529572802811,1.1567987033615008,-3.5100089142891373,0.6927847800036141,0.0,0.0,0.0,1.0
1717691530.2241964,map,True,False,3,4,0.0,0.0,3.012345790863037,-2.537370204925537,0.0,0.0,0.0,0.0411505723924964,0.9991529572802811,1.1567987033615008,-3.5100089142891373,0.6927847800036141,0.0,0.0,0.0,1.0
1717691530.377288,map,True,True,3,3,0.6616527499769684,0.6616527499769684,3.012345790863037,-2.537370204925537,0.0,0.0,0.0,0.0411505723924964,0.9991529572802811,1.149545838178311,-3.131883253797593,0.7146764249784637,0.0,0.0,0.0,1.0
1717691530.4291284,map,True,True,3,3,0.6616527499769684,0.6616527499769684,3.012345790863037,-2.537370204925537,0.0,0.0,0.0,0.0411505723924964,0.9991529572802811,1.1535566404648878,-3.129543883875107,0.7100022546799133,0.0,0.0,0.0,1.0
1717691530.528261,map,True,False,3,3,0.6616527499769684,0.6616527499769684,3.1775827407836914,-2.5667877197265625,0.0,0.0,0.0,0.04445559883979002,0.9990113556878032,1.1535566404648878,-3.129543883875107,0.7100022546799133,0.0,0.0,0.0,1.0
1717691530.578577,map,True,False,3,3,0.6616527499769684,0.6616527499769684,3.1775827407836914,-2.5667877197265625,0.0,0.0,0.0,0.04445559883979002,0.9990113556878032,1.1535566404648878,-3.129543883875107,0.7100022546799133,0.0,0.0,0.0,1.0
1717691530.6814997,map,True,False,3,3,0.6616527499769684,0.6616527499769684,3.1775827407836914,-2.5667877197265625,0.0,0.0,0.0,0.04445559883979002,0.9990113556878032,1.1535566404648878,-3.129543883875107,0.7100022546799133,0.0,0.0,0.0,1.0
1717691530.7318833,map,True,True,3,3,0.6616527499769684,0.6616527499769684,3.1775827407836914,-2.5667877197265625,0.0,0.0,0.0,0.04445559883979002,0.9990113556878032,1.1335505816092577,-2.7713032374625577,0.685939845227887,0.0,0.0,0.0,1.0
1717691530.7798927,map,True,False,3,3,0.6616527499769684,0.6616527499769684,3.1775827407836914,-2.5667877197265625,0.0,0.0,0.0,0.04445559883979002,0.9990113556878032,1.1335505816092577,-2.7713032374625577,0.685939845227887,0.0,0.0,0.0,1.0
1717691530.8309557,map,True,True,3,3,0.6616527499769684,0.6616527499769684,3.1775827407836914,-2.5667877197265625,0.0,0.0,0.0,0.04445559883979002,0.9990113556878032,1.1335505816092577,-2.7713032374625577,0.685939845227887,0.0,0.0,0.0,1.0
1717691530.9303062,map,True,False,3,3,0.6616527499769684,0.6616527499769684,3.1775827407836914,-2.5667877197265625,0.0,0.0,0.0,0.04445559883979002,0.9990113556878032,1.1335505816092577,-2.7713032374625577,0.685939845227887,0.0,0.0,0.0,1.0
1717691530.9807584,map,True,True,3,3,0.6616527499769684,0.6616527499769684,3.1775827407836914,-2.5667877197265625,0.0,0.0,0.0,0.04445559883979002,0.9990113556878032,1.1335505816092577,-2.7713032374625577,0.685939845227887,0.0,0.0,0.0,1.0
1717691531.0310495,map,True,True,3,3,0.6616527499769684,0.6616527499769684,3.1775827407836914,-2.5667877197265625,0.0,0.0,0.0,0.04445559883979002,0.9990113556878032,1.1370339917604044,-2.556336128564844,0.6892723994195181,0.0,0.0,0.0,1.0
1717691531.0817268,map,True,True,3,3,0.6616527499769684,0.6616527499769684,3.1775827407836914,-2.5667877197265625,0.0,0.0,0.0,0.04445559883979002,0.9990113556878032,1.1370339917604044,-2.556336128564844,0.6892723994195181,0.0,0.0,0.0,1.0
1717691531.1324558,map,True,False,3,3,0.6616527499769684,0.6616527499769684,3.2596516609191895,-2.5851688385009766,0.0,0.0,0.0,0.04399635257269134,0.9990316858631646,1.1370339917604044,-2.556336128564844,0.6892723994195181,0.0,0.0,0.0,1.0
1717691531.2310066,map,True,False,3,3,0.6616527499769684,0.6616527499769684,3.2596516609191895,-2.5851688385009766,0.0,0.0,0.0,0.04399635257269134,0.9990316858631646,1.1370339917604044,-2.556336128564844,0.6892723994195181,0.0,0.0,0.0,1.0
1717691531.3820887,map,True,False,3,4,0.0,0.0,3.2596516609191895,-2.5851688385009766,0.0,0.0,0.0,0.04399635257269134,0.9990316858631646,1.1302563020550016,-2.1867336315095005,0.6879093144303149,0.0,0.0,0.0,1.0
1717691531.4336987,map,True,False,3,4,0.0,0.0,3.2596516609191895,-2.5851688385009766,0.0,0.0,0.0,0.04399635257269134,0.9990316858631646,1.1302563020550016,-2.1867336315095005,0.6879093144303149,0.0,0.0,0.0,1.0
1717691531.5319076,map,True,False,3,4,0.0,0.0,3.2596516609191895,-2.5851688385009766,0.0,0.0,0.0,0.04399635257269134,0.9990316858631646,1.1302563020550016,-2.1867336315095005,0.6879093144303149,0.0,0.0,0.0,1.0
1717691531.5826466,map,True,False,3,4,0.0,0.0,3.2596516609191895,-2.5851688385009766,0.0,0.0,0.0,0.04399635257269134,0.9990316858631646,1.1302563020550016,-2.1867336315095005,0.6879093144303149,0.0,0.0,0.0,1.0
1717691531.6327872,map,True,False,3,4,0.0,0.0,3.2596516609191895,-2.5851688385009766,0.0,0.0,0.0,0.04399635257269134,0.9990316858631646,1.1302563020550016,-2.1867336315095005,0.6879093144303149,0.0,0.0,0.0,1.0
1717691531.6830325,map,True,False,3,4,0.0,0.0,3.2596516609191895,-2.5851688385009766,0.0,0.0,0.0,0.04399635257269134,0.9990316858631646,1.1302563020550016,-2.1867336315095005,0.6879093144303149,0.0,0.0,0.0,1.0
1717691531.7347648,map,True,False,3,4,0.0,0.0,3.2596516609191895,-2.5851688385009766,0.0,0.0,0.0,0.04399635257269134,0.9990316858631646,1.1302563020550016,-2.1867336315095005,0.6879093144303149,0.0,0.0,0.0,1.0
1717691531.832766,map,True,False,3,4,0.0,0.0,3.3344743251800537,-2.605778217315674,0.0,0.0,0.0,0.04514990186578818,0.9989802257033716,1.113702354702509,-1.7573303258791673,0.6863437632766881,0.0,0.0,0.0,1.0
1717691531.8831878,map,True,False,3,4,0.0,0.0,3.3344743251800537,-2.605778217315674,0.0,0.0,0.0,0.04514990186578818,0.9989802257033716,1.113702354702509,-1.7573303258791673,0.6863437632766881,0.0,0.0,0.0,1.0
1717691531.9336681,map,True,False,3,4,0.0,0.0,3.3344743251800537,-2.605778217315674,0.0,0.0,0.0,0.04514990186578818,0.9989802257033716,1.113702354702509,-1.7573303258791673,0.6863437632766881,0.0,0.0,0.0,1.0
1717691532.0336692,map,True,False,3,4,0.0,0.0,3.3344743251800537,-2.605778217315674,0.0,0.0,0.0,0.04514990186578818,0.9989802257033716,1.113702354702509,-1.7573303258791673,0.6863437632766881,0.0,0.0,0.0,1.0
1717691532.1336493,map,True,False,3,4,0.0,0.0,3.3344743251800537,-2.605778217315674,0.0,0.0,0.0,0.04514990186578818,0.9989802257033716,1.167580978698701,-1.5951196653742858,0.6830990974996397,0.0,0.0,0.0,1.0
1717691532.2338274,map,True,False,3,4,0.0,0.0,3.3344743251800537,-2.605778217315674,0.0,0.0,0.0,0.04514990186578818,0.9989802257033716,1.167580978698701,-1.5951196653742858,0.6830990974996397,0.0,0.0,0.0,1.0
1717691532.4850967,map,True,False,2,4,0.0,0.0,3.443056583404541,-2.6285243034362793,0.0,0.0,0.0,0.045011386506822536,0.9989864756439096,1.1381004822507166,-1.4320385629459864,0.6850808553136593,0.0,0.0,0.0,1.0
1717691532.5347776,map,True,False,2,4,0.0,0.0,3.443056583404541,-2.6285243034362793,0.0,0.0,0.0,0.045011386506822536,0.9989864756439096,1.1381004822507166,-1.4320385629459864,0.6850808553136593,0.0,0.0,0.0,1.0
1717691532.5896103,map,True,False,2,4,0.0,0.0,3.443056583404541,-2.6285243034362793,0.0,0.0,0.0,0.045011386506822536,0.9989864756439096,1.1381004822507166,-1.4320385629459864,0.6850808553136593,0.0,0.0,0.0,1.0
1717691532.6360755,map,True,False,2,4,0.0,0.0,3.443056583404541,-2.6285243034362793,0.0,0.0,0.0,0.045011386506822536,0.9989864756439096,1.1381004822507166,-1.4320385629459864,0.6850808553136593,0.0,0.0,0.0,1.0
1717691532.735983,map,True,False,2,4,0.0,0.0,3.443056583404541,-2.6285243034362793,0.0,0.0,0.0,0.045011386506822536,0.9989864756439096,1.1381004822507166,-1.4320385629459864,0.6850808553136593,0.0,0.0,0.0,1.0
1717691532.786025,map,True,False,2,4,0.0,0.0,3.443056583404541,-2.6285243034362793,0.0,0.0,0.0,0.045011386506822536,0.9989864756439096,1.1381004822507166,-1.4320385629459864,0.6850808553136593,0.0,0.0,0.0,1.0
1717691532.8363745,map,True,False,2,4,0.0,0.0,3.443056583404541,-2.6285243034362793,0.0,0.0,0.0,0.045011386506822536,0.9989864756439096,1.090059520179195,-1.5020692561551925,0.6854418601090767,0.0,0.0,0.0,1.0
1717691532.9363763,map,True,False,2,4,0.0,0.0,3.5227761268615723,-2.6329116821289062,0.0,0.0,0.0,0.04508897885343299,0.9989829703121463,1.090059520179195,-1.5020692561551925,0.6854418601090767,0.0,0.0,0.0,1.0
1717691533.0366714,map,True,False,2,4,0.0,0.0,3.5227761268615723,-2.6329116821289062,0.0,0.0,0.0,0.04508897885343299,0.9989829703121463,1.090059520179195,-1.5020692561551925,0.6854418601090767,0.0,0.0,0.0,1.0
1717691533.0871518,map,True,False,2,4,0.0,0.0,3.5227761268615723,-2.6329116821289062,0.0,0.0,0.0,0.04508897885343299,0.9989829703121463,1.090059520179195,-1.5020692561551925,0.6854418601090767,0.0,0.0,0.0,1.0
1717691533.1850948,map,True,False,2,4,0.0,0.0,3.5227761268615723,-2.6329116821289062,0.0,0.0,0.0,0.04508897885343299,0.9989829703121463,1.0501276895200666,-1.6178094144260138,0.6834930104390654,0.0,0.0,0.0,1.0
1717691533.2367752,map,True,False,2,4,0.0,0.0,3.5227761268615723,-2.6329116821289062,0.0,0.0,0.0,0.04508897885343299,0.9989829703121463,1.0501276895200666,-1.6178094144260138,0.6834930104390654,0.0,0.0,0.0,1.0
1717691533.5371773,map,True,False,2,4,0.0,0.0,3.6519880294799805,-2.647822380065918,0.0,0.0,0.0,0.04885558309109145,0.9988058530064636,1.0075461358956799,-1.6614132610119767,0.6862074597598279,0.0,0.0,0.0,1.0
1717691533.555552,map,True,False,2,4,0.0,0.0,3.6519880294799805,-2.647822380065918,0.0,0.0,0.0,0.04885558309109145,0.9988058530064636,1.0075461358956799,-1.6614132610119767,0.6862074597598279,0.0,0.0,0.0,1.0
1717691533.5604813,map,True,False,2,4,0.0,0.0,3.6519880294799805,-2.647822380065918,0.0,0.0,0.0,0.04885558309109145,0.9988058530064636,1.0075461358956799,-1.6614132610119767,0.6862074597598279,0.0,0.0,0.0,1.0
1717691533.564221,map,True,False,2,4,0.0,0.0,3.6519880294799805,-2.647822380065918,0.0,0.0,0.0,0.04885558309109145,0.9988058530064636,1.0075461358956799,-1.6614132610119767,0.6862074597598279,0.0,0.0,0.0,1.0
1717691533.5676935,map,True,False,2,4,0.0,0.0,3.6519880294799805,-2.647822380065918,0.0,0.0,0.0,0.04885558309109145,0.9988058530064636,1.0075461358956799,-1.6614132610119767,0.6862074597598279,0.0,0.0,0.0,1.0
1717691533.5721402,map,True,False,2,4,0.0,0.0,3.6519880294799805,-2.647822380065918,0.0,0.0,0.0,0.04885558309109145,0.9988058530064636,1.0075461358956799,-1.6614132610119767,0.6862074597598279,0.0,0.0,0.0,1.0
1717691533.5767112,map,True,False,2,4,0.0,0.0,3.6519880294799805,-2.647822380065918,0.0,0.0,0.0,0.04885558309109145,0.9988058530064636,1.0075461358956799,-1.6614132610119767,0.6862074597598279,0.0,0.0,0.0,1.0
1717691533.5800018,map,True,False,2,4,0.0,0.0,3.6519880294799805,-2.647822380065918,0.0,0.0,0.0,0.04885558309109145,0.9988058530064636,1.0075461358956799,-1.6614132610119767,0.6862074597598279,0.0,0.0,0.0,1.0
1717691533.583063,map,True,False,2,4,0.0,0.0,3.6519880294799805,-2.647822380065918,0.0,0.0,0.0,0.04885558309109145,0.9988058530064636,1.0075461358956799,-1.6614132610119767,0.6862074597598279,0.0,0.0,0.0,1.0
1717691533.588538,map,True,False,2,4,0.0,0.0,3.6519880294799805,-2.647822380065918,0.0,0.0,0.0,0.04885558309109145,0.9988058530064636,1.0075461358956799,-1.6614132610119767,0.6862074597598279,0.0,0.0,0.0,1.0
1717691533.5917952,map,True,False,2,4,0.0,0.0,3.6519880294799805,-2.647822380065918,0.0,0.0,0.0,0.04885558309109145,0.9988058530064636,1.0075461358956799,-1.6614132610119767,0.6862074597598279,0.0,0.0,0.0,1.0
1717691533.5951216,map,True,False,2,4,0.0,0.0,3.6519880294799805,-2.647822380065918,0.0,0.0,0.0,0.04885558309109145,0.9988058530064636,1.0075461358956799,-1.6614132610119767,0.6862074597598279,0.0,0.0,0.0,1.0
1717691533.6455326,map,True,False,2,4,0.0,0.0,3.6519880294799805,-2.647822380065918,0.0,0.0,0.0,0.04885558309109145,0.9988058530064636,1.0075461358956799,-1.6614132610119767,0.6862074597598279,0.0,0.0,0.0,1.0
1717691533.6967936,map,True,False,2,4,0.0,0.0,3.6519880294799805,-2.647822380065918,0.0,0.0,0.0,0.04885558309109145,0.9988058530064636,1.0075461358956799,-1.6614132610119767,0.6862074597598279,0.0,0.0,0.0,1.0
1717691533.8026617,map,True,False,2,4,0.0,0.0,3.6519880294799805,-2.647822380065918,0.0,0.0,0.0,0.04885558309109145,0.9988058530064636,1.0075461358956799,-1.6614132610119767,0.6862074597598279,0.0,0.0,0.0,1.0
1717691533.8525279,map,True,False,2,4,0.0,0.0,3.6519880294799805,-2.647822380065918,0.0,0.0,0.0,0.04885558309109145,0.9988058530064636,0.9681376359023441,-1.6758959693280917,0.6863435038807325,0.0,0.0,0.0,1.0
1717691533.9031403,map,True,False,2,4,0.0,0.0,3.6519880294799805,-2.647822380065918,0.0,0.0,0.0,0.04885558309109145,0.9988058530064636,0.9681376359023441,-1.6758959693280917,0.6863435038807325,0.0,0.0,0.0,1.0
1717691534.0036275,map,True,False,2,4,0.0,0.0,3.6519880294799805,-2.647822380065918,0.0,0.0,0.0,0.04885558309109145,0.9988058530064636,0.9681376359023441,-1.6758959693280917,0.6863435038807325,0.0,0.0,0.0,1.0
1717691534.0535212,map,True,False,2,4,0.0,0.0,3.6519880294799805,-2.647822380065918,0.0,0.0,0.0,0.04885558309109145,0.9988058530064636,0.9681376359023441,-1.6758959693280917,0.6863435038807325,0.0,0.0,0.0,1.0
1717691534.1534052,map,True,False,2,4,0.0,0.0,3.6519880294799805,-2.647822380065918,0.0,0.0,0.0,0.04885558309109145,0.9988058530064636,0.9430927162064462,-1.6987624170336064,0.6839924989225642,0.0,0.0,0.0,1.0
1717691534.5548809,map,True,False,2,4,0.0,0.0,3.7466888427734375,-2.696449041366577,0.0,0.0,0.0,0.04965992041509596,0.9987661826597558,1.2518771863921363,-4.418425032482677,0.7809412802428394,0.0,0.0,0.0,1.0
1717691534.6078641,map,True,False,2,4,0.0,0.0,3.7466888427734375,-2.696449041366577,0.0,0.0,0.0,0.04965992041509596,0.9987661826597558,1.2518771863921363,-4.418425032482677,0.7809412802428394,0.0,0.0,0.0,1.0
1717691534.7078767,map,True,False,2,4,0.0,0.0,3.7466888427734375,-2.696449041366577,0.0,0.0,0.0,0.04965992041509596,0.9987661826597558,1.2518771863921363,-4.418425032482677,0.7809412802428394,0.0,0.0,0.0,1.0
1717691534.7604446,map,True,False,2,4,0.0,0.0,3.7466888427734375,-2.696449041366577,0.0,0.0,0.0,0.04965992041509596,0.9987661826597558,1.2518771863921363,-4.418425032482677,0.7809412802428394,0.0,0.0,0.0,1.0
1717691534.8570535,map,True,False,2,4,0.0,0.0,3.7466888427734375,-2.696449041366577,0.0,0.0,0.0,0.04965992041509596,0.9987661826597558,1.2518771863921363,-4.418425032482677,0.7809412802428394,0.0,0.0,0.0,1.0
1717691534.9074693,map,True,False,2,4,0.0,0.0,3.7466888427734375,-2.696449041366577,0.0,0.0,0.0,0.04965992041509596,0.9987661826597558,1.2667969455933448,-4.507794107026649,0.7563295468018753,0.0,0.0,0.0,1.0
1717691534.9571064,map,True,False,1,4,0.0,0.0,3.85568904876709,-2.7116193771362305,0.0,0.0,0.0,0.050401608117897304,0.998729032241476,1.2667969455933448,-4.507794107026649,0.7563295468018753,0.0,0.0,0.0,1.0
1717691535.0097873,map,True,False,1,4,0.0,0.0,3.85568904876709,-2.7116193771362305,0.0,0.0,0.0,0.050401608117897304,0.998729032241476,1.2667969455933448,-4.507794107026649,0.7563295468018753,0.0,0.0,0.0,1.0
1717691535.1096814,map,True,False,1,4,0.0,0.0,3.85568904876709,-2.7116193771362305,0.0,0.0,0.0,0.050401608117897304,0.998729032241476,1.2667969455933448,-4.507794107026649,0.7563295468018753,0.0,0.0,0.0,1.0
1717691535.159462,map,True,False,1,4,0.0,0.0,3.85568904876709,-2.7116193771362305,0.0,0.0,0.0,0.050401608117897304,0.998729032241476,1.2364548766400305,-4.097257871459586,0.6826573328503901,0.0,0.0,0.0,1.0
1717691535.5128384,map,True,False,1,4,0.0,0.0,3.85568904876709,-2.7116193771362305,0.0,0.0,0.0,0.050401608117897304,0.998729032241476,0.9584770712992203,-1.7482918328131656,0.6866333839076567,0.0,0.0,0.0,1.0
1717691535.5616508,map,True,False,1,4,0.0,0.0,3.85568904876709,-2.7116193771362305,0.0,0.0,0.0,0.050401608117897304,0.998729032241476,0.9584770712992203,-1.7482918328131656,0.6866333839076567,0.0,0.0,0.0,1.0
1717691535.6113193,map,True,False,1,4,0.0,0.0,3.85568904876709,-2.7116193771362305,0.0,0.0,0.0,0.050401608117897304,0.998729032241476,0.9584770712992203,-1.7482918328131656,0.6866333839076567,0.0,0.0,0.0,1.0
1717691535.6566503,map,True,False,1,4,0.0,0.0,3.85568904876709,-2.7116193771362305,0.0,0.0,0.0,0.050401608117897304,0.998729032241476,0.9584770712992203,-1.7482918328131656,0.6866333839076567,0.0,0.0,0.0,1.0
