timestamp_sec,frame_id,game_played,yielding,player1discrete,player2discrete,player1yieldprob,player2yieldprob,player1_pose_x,player1_pose_y,player1_pose_z,player1_pose_orient_x,player1_pose_orient_y,player1_pose_orient_z,player1_pose_orient_w,player2_pose_x,player2_pose_y,player2_pose_z,player2_pose_orient_x,player2_pose_orient_y,player2_pose_orient_z,player2_pose_orient_w
1718107002.788428,map,True,False,5,5,0.612995793784914,0.612995793784914,1.2786839008331299,-1.623795986175537,0.0,0.0,0.0,0.06986582446251434,0.9975563979159707,3.24741964361323,-6.957686215044636,0.8779991720223489,0.0,0.0,0.0,1.0
1718107003.091895,map,True,False,5,5,0.612995793784914,0.612995793784914,1.2790530920028687,-1.6201071739196777,0.0,0.0,0.0,0.06969812907943505,0.9975681239124278,3.238513067945867,-6.234403736876908,0.803354306507781,0.0,0.0,0.0,1.0
1718107003.1901166,map,True,False,5,5,0.612995793784914,0.612995793784914,1.2790530920028687,-1.6201071739196777,0.0,0.0,0.0,0.06969812907943505,0.9975681239124278,3.212989548141522,-6.066160004086922,0.7991428121795904,0.0,0.0,0.0,1.0
1718107003.2897584,map,True,True,5,5,0.612995793784914,0.612995793784914,1.2790530920028687,-1.6201071739196777,0.0,0.0,0.0,0.06969812907943505,0.9975681239124278,3.212989548141522,-6.066160004086922,0.7991428121795904,0.0,0.0,0.0,1.0
1718107003.3405466,map,True,False,5,5,0.612995793784914,0.612995793784914,1.2790530920028687,-1.6201071739196777,0.0,0.0,0.0,0.06969812907943505,0.9975681239124278,3.212989548141522,-6.066160004086922,0.7991428121795904,0.0,0.0,0.0,1.0
1718107003.3920407,map,True,True,5,5,0.612995793784914,0.612995793784914,1.2790530920028687,-1.6201071739196777,0.0,0.0,0.0,0.06969812907943505,0.9975681239124278,3.212989548141522,-6.066160004086922,0.7991428121795904,0.0,0.0,0.0,1.0
1718107003.4483418,map,True,False,5,4,0.0,0.0,1.2790530920028687,-1.6201071739196777,0.0,0.0,0.0,0.06969812907943505,0.9975681239124278,3.2919961653532948,-5.821336300439517,0.780343743593121,0.0,0.0,0.0,1.0
1718107003.5471241,map,True,False,5,4,0.0,0.0,1.2790530920028687,-1.6201071739196777,0.0,0.0,0.0,0.06969812907943505,0.9975681239124278,3.2919961653532948,-5.821336300439517,0.780343743593121,0.0,0.0,0.0,1.0
1718107003.646661,map,True,False,5,4,0.0,0.0,1.2790530920028687,-1.6201071739196777,0.0,0.0,0.0,0.06969812907943505,0.9975681239124278,3.2919961653532948,-5.821336300439517,0.780343743593121,0.0,0.0,0.0,1.0
1718107003.6975403,map,True,False,5,4,0.0,0.0,1.2790530920028687,-1.6201071739196777,0.0,0.0,0.0,0.06969812907943505,0.9975681239124278,3.2919961653532948,-5.821336300439517,0.780343743593121,0.0,0.0,0.0,1.0
1718107003.7502034,map,True,False,5,4,0.0,0.0,1.2790530920028687,-1.6201071739196777,0.0,0.0,0.0,0.06969812907943505,0.9975681239124278,3.328790316780653,-5.377917143880788,0.7591917176275005,0.0,0.0,0.0,1.0
1718107004.1021106,map,True,False,5,3,0.0,0.0,1.3928099870681763,-1.6403783559799194,0.0,0.0,0.0,0.07054665884139008,0.9975084767423618,3.410715183198474,-4.692008104445376,0.7421557760854688,0.0,0.0,0.0,1.0
1718107004.1505675,map,True,False,5,3,0.0,0.0,1.3928099870681763,-1.6403783559799194,0.0,0.0,0.0,0.07054665884139008,0.9975084767423618,3.410715183198474,-4.692008104445376,0.7421557760854688,0.0,0.0,0.0,1.0
1718107004.2549686,map,True,False,5,3,0.0,0.0,1.3928099870681763,-1.6403783559799194,0.0,0.0,0.0,0.07054665884139008,0.9975084767423618,3.410715183198474,-4.692008104445376,0.7421557760854688,0.0,0.0,0.0,1.0
1718107004.3552835,map,True,False,5,3,0.0,0.0,1.3928099870681763,-1.6403783559799194,0.0,0.0,0.0,0.07054665884139008,0.9975084767423618,3.410715183198474,-4.692008104445376,0.7421557760854688,0.0,0.0,0.0,1.0
1718107004.4082303,map,True,False,5,3,0.0,0.0,1.3928099870681763,-1.6403783559799194,0.0,0.0,0.0,0.07054665884139008,0.9975084767423618,3.3724392321872707,-4.296431363041979,0.7304531667127645,0.0,0.0,0.0,1.0
1718107004.4582381,map,True,False,5,3,0.0,0.0,1.3928099870681763,-1.6403783559799194,0.0,0.0,0.0,0.07054665884139008,0.9975084767423618,3.3724392321872707,-4.296431363041979,0.7304531667127645,0.0,0.0,0.0,1.0
1718107004.5080516,map,True,False,5,3,0.0,0.0,1.3928099870681763,-1.6403783559799194,0.0,0.0,0.0,0.07054665884139008,0.9975084767423618,3.3724392321872707,-4.296431363041979,0.7304531667127645,0.0,0.0,0.0,1.0
1718107004.6074796,map,True,False,5,3,0.0,0.0,1.4909210205078125,-1.653159499168396,0.0,0.0,0.0,0.07087772514759513,0.9974850082704981,3.3724392321872707,-4.296431363041979,0.7304531667127645,0.0,0.0,0.0,1.0
1718107004.6578453,map,True,False,5,3,0.0,0.0,1.4909210205078125,-1.653159499168396,0.0,0.0,0.0,0.07087772514759513,0.9974850082704981,3.3724392321872707,-4.296431363041979,0.7304531667127645,0.0,0.0,0.0,1.0
1718107004.7221246,map,True,False,5,2,0.0,0.0,1.4909210205078125,-1.653159499168396,0.0,0.0,0.0,0.07087772514759513,0.9974850082704981,3.6035014879816916,-3.685335460194625,0.7300352442926727,0.0,0.0,0.0,1.0
1718107005.0711658,map,True,False,5,2,0.0,0.0,1.4909210205078125,-1.653159499168396,0.0,0.0,0.0,0.07087772514759513,0.9974850082704981,3.6188610999504576,-3.265016488213946,0.68882871406118,0.0,0.0,0.0,1.0
1718107005.1701176,map,True,False,4,2,0.0,0.0,1.629550576210022,-1.6682533025741577,0.0,0.0,0.0,0.07141106438743355,0.9974469735337296,3.6188610999504576,-3.265016488213946,0.68882871406118,0.0,0.0,0.0,1.0
1718107005.2702725,map,True,False,4,2,0.0,0.0,1.629550576210022,-1.6682533025741577,0.0,0.0,0.0,0.07141106438743355,0.9974469735337296,3.6188610999504576,-3.265016488213946,0.68882871406118,0.0,0.0,0.0,1.0
1718107005.3714554,map,True,False,4,1,0.0,0.0,1.629550576210022,-1.6682533025741577,0.0,0.0,0.0,0.07141106438743355,0.9974469735337296,3.6698248341195505,-2.827246549386985,0.6809861620971431,0.0,0.0,0.0,1.0
1718107005.4235377,map,True,False,4,1,0.0,0.0,1.629550576210022,-1.6682533025741577,0.0,0.0,0.0,0.07141106438743355,0.9974469735337296,3.6698248341195505,-2.827246549386985,0.6809861620971431,0.0,0.0,0.0,1.0
1718107005.4764023,map,True,False,4,1,0.0,0.0,1.629550576210022,-1.6682533025741577,0.0,0.0,0.0,0.07141106438743355,0.9974469735337296,3.6698248341195505,-2.827246549386985,0.6809861620971431,0.0,0.0,0.0,1.0
1718107005.530567,map,True,False,4,1,0.0,0.0,1.629550576210022,-1.6682533025741577,0.0,0.0,0.0,0.07141106438743355,0.9974469735337296,3.6698248341195505,-2.827246549386985,0.6809861620971431,0.0,0.0,0.0,1.0
1718107005.6259346,map,True,False,4,1,0.0,0.0,1.629550576210022,-1.6682533025741577,0.0,0.0,0.0,0.07141106438743355,0.9974469735337296,3.6698248341195505,-2.827246549386985,0.6809861620971431,0.0,0.0,0.0,1.0
1718107005.6745448,map,True,False,4,1,0.0,0.0,1.629550576210022,-1.6682533025741577,0.0,0.0,0.0,0.07141106438743355,0.9974469735337296,3.7729377181740604,-2.513322380025426,0.682361259311445,0.0,0.0,0.0,1.0
1718107005.7261093,map,True,False,4,1,0.0,0.0,1.629550576210022,-1.6682533025741577,0.0,0.0,0.0,0.07141106438743355,0.9974469735337296,3.820324149277146,-2.4458045790417353,0.6820198065110645,0.0,0.0,0.0,1.0
1718107006.0430322,map,True,False,4,1,0.0,0.0,1.728213906288147,-1.6766290664672852,0.0,0.0,0.0,0.07151633728861406,0.9974394291578766,3.8264124064718628,-2.199387082484519,0.6810694475772996,0.0,0.0,0.0,1.0
1718107006.0767329,map,True,False,4,1,0.0,0.0,1.728213906288147,-1.6766290664672852,0.0,0.0,0.0,0.07151633728861406,0.9974394291578766,3.8264124064718628,-2.199387082484519,0.6810694475772996,0.0,0.0,0.0,1.0
1718107006.1754289,map,True,False,4,1,0.0,0.0,1.728213906288147,-1.6766290664672852,0.0,0.0,0.0,0.07151633728861406,0.9974394291578766,3.8264124064718628,-2.199387082484519,0.6810694475772996,0.0,0.0,0.0,1.0
1718107006.2264495,map,True,False,4,1,0.0,0.0,1.728213906288147,-1.6766290664672852,0.0,0.0,0.0,0.07151633728861406,0.9974394291578766,3.8264124064718628,-2.199387082484519,0.6810694475772996,0.0,0.0,0.0,1.0
1718107006.2760713,map,True,False,4,1,0.0,0.0,1.728213906288147,-1.6766290664672852,0.0,0.0,0.0,0.07151633728861406,0.9974394291578766,3.8264124064718628,-2.199387082484519,0.6810694475772996,0.0,0.0,0.0,1.0
1718107006.3269958,map,True,False,4,1,0.0,0.0,1.728213906288147,-1.6766290664672852,0.0,0.0,0.0,0.07151633728861406,0.9974394291578766,3.8264124064718628,-2.199387082484519,0.6810694475772996,0.0,0.0,0.0,1.0
1718107006.4263341,map,True,False,4,1,0.0,0.0,1.728213906288147,-1.6766290664672852,0.0,0.0,0.0,0.07151633728861406,0.9974394291578766,3.8264124064718628,-2.199387082484519,0.6810694475772996,0.0,0.0,0.0,1.0
1718107006.4809067,map,True,False,4,1,0.0,0.0,1.728213906288147,-1.6766290664672852,0.0,0.0,0.0,0.07151633728861406,0.9974394291578766,3.8264124064718628,-2.199387082484519,0.6810694475772996,0.0,0.0,0.0,1.0
1718107006.5287757,map,True,False,4,1,0.0,0.0,1.728213906288147,-1.6766290664672852,0.0,0.0,0.0,0.07151633728861406,0.9974394291578766,3.8264124064718628,-2.199387082484519,0.6810694475772996,0.0,0.0,0.0,1.0
1718107006.578094,map,True,False,4,1,0.0,0.0,1.8301855325698853,-1.6974899768829346,0.0,0.0,0.0,0.07282547062925478,0.9973446938308392,3.8264124064718628,-2.199387082484519,0.6810694475772996,0.0,0.0,0.0,1.0
1718107006.6280446,map,True,False,4,1,0.0,0.0,1.8301855325698853,-1.6974899768829346,0.0,0.0,0.0,0.07282547062925478,0.9973446938308392,3.8264124064718628,-2.199387082484519,0.6810694475772996,0.0,0.0,0.0,1.0
1718107006.729391,map,True,False,4,1,0.0,0.0,1.8301855325698853,-1.6974899768829346,0.0,0.0,0.0,0.07282547062925478,0.9973446938308392,3.8264124064718628,-2.199387082484519,0.6810694475772996,0.0,0.0,0.0,1.0
