car_pos_meter , car_pos_cell, car_speed, ped_pos_meter, ped_pos_cell, ped_speed
-5.125, 5, 2, 3.794199, 4, 1
-4.083755, 4, 2, 3.060995, 3, 1
-3.042509, 3, 2, 2.041298, 2, 1
-2.001264, 2, 2, 0.9355223, 1, 1
-0.9600121, 0, 2, 0.1382928, 0, 1
0.08123851, 0, 2, -0.6804476, 0, 1
1.122489, -1, 2, -1.287788, -1, 1
2.16374, -2, 2, -1.212583, -1, 1
3.204985, -3, 2, -1.08739, -1, 1
