car_pos_meter , car_pos_cell, car_speed, ped_pos_meter, ped_pos_cell, ped_speed
-3.727273, 3, 1, 4.097237, 3, 1
-3.725182, 3, 1, 4.091365, 3, 1
-3.723091, 3, 2, 4.073195, 3, 1
-3.707946, 3, 2, 4.066826, 3, 1
-3.6928, 3, 1, 4.05324, 3, 1
-3.69071, 3, 1, 4.039538, 3, 1
-3.688619, 3, 2, 4.02492, 3, 1
-3.673473, 3, 2, 4.009882, 3, 1
-3.658328, 3, 2, 4.002192, 3, 1
-3.643183, 3, 1, 3.986824, 3, 1
-3.641092, 3, 1, 3.971063, 3, 1
-3.639001, 3, 1, 3.955448, 3, 1
-3.63691, 3, 2, 3.939492, 3, 1
-3.621765, 3, 2, 3.931633, 3, 1
-3.606619, 3, 1, 3.915662, 3, 1
-3.604529, 3, 1, 3.899327, 3, 1
-3.602438, 3, 2, 3.882946, 3, 1
-3.587292, 3, 1, 3.874688, 3, 1
-3.585202, 3, 2, 3.858249, 3, 1
-3.570056, 3, 1, 3.84241, 3, 1
-3.567966, 3, 1, 3.834862, 3, 1
-3.565875, 3, 2, 3.812566, 3, 1
-3.550729, 3, 1, 3.798344, 3, 1
-3.548638, 3, 1, 3.791208, 3, 1
-3.546548, 3, 1, 3.776528, 3, 1
-3.544457, 3, 1, 3.76133, 3, 1
-3.542366, 3, 2, 3.746067, 3, 1
-3.527221, 3, 2, 3.738407, 3, 1
-3.512075, 3, 2, 3.722761, 3, 1
-3.49693, 3, 1, 3.706755, 3, 1
-3.494839, 3, 1, 3.690392, 3, 1
-3.492748, 3, 2, 3.674078, 3, 1
-3.477603, 3, 1, 3.657688, 3, 1
-3.475512, 3, 1, 3.649211, 3, 1
-3.473421, 3, 1, 3.632392, 3, 1
-3.47133, 3, 1, 3.615037, 3, 1
-3.46924, 3, 1, 3.597538, 3, 1
-3.467149, 3, 1, 3.579506, 3, 1
-3.465058, 3, 1, 3.570209, 3, 1
-3.462967, 3, 1, 3.551737, 3, 1
-3.460876, 3, 2, 3.533406, 3, 1
-3.445731, 3, 2, 3.514875, 3, 1
-3.430586, 3, 2, 3.495751, 3, 1
-3.41544, 3, 1, 3.476423, 3, 1
-3.413349, 3, 1, 3.466962, 3, 1
-3.411259, 3, 2, 3.447572, 3, 1
-3.396113, 3, 1, 3.427911, 3, 1
-3.394022, 3, 1, 3.408392, 3, 1
-3.391932, 3, 1, 3.398919, 3, 1
-3.389841, 3, 1, 3.380332, 3, 1
-3.38775, 3, 2, 3.361421, 3, 1
-3.372605, 3, 2, 3.342939, 3, 1
-3.357459, 3, 2, 3.324578, 2, 1
-3.342314, 3, 2, 3.315716, 2, 1
-3.327168, 3, 2, 3.298129, 2, 1
-3.312023, 3, 2, 3.280608, 2, 1
-3.296878, 3, 2, 3.263441, 2, 1
-3.281732, 3, 2, 3.246279, 2, 1
-3.266587, 3, 2, 3.237843, 2, 1
-3.251442, 3, 2, 3.221187, 2, 1
-3.236296, 3, 2, 3.205091, 2, 1
-3.221151, 3, 2, 3.189133, 2, 1
-3.206005, 3, 2, 3.173257, 2, 1
-3.19086, 3, 2, 3.157343, 2, 1
-3.175715, 3, 2, 3.149284, 2, 1
-3.160569, 3, 2, 3.133531, 2, 1
-3.145424, 3, 2, 3.117932, 2, 1
-3.130279, 3, 2, 3.102012, 2, 1
-3.115133, 3, 2, 3.093914, 2, 1
-3.099988, 3, 2, 3.077446, 2, 1
-3.084842, 3, 2, 3.060277, 2, 1
-3.069697, 3, 2, 3.042319, 2, 1
-3.054552, 3, 2, 3.023785, 2, 1
-3.039406, 3, 2, 3.004755, 2, 1
-3.024261, 3, 2, 2.995198, 2, 1
-3.009115, 3, 2, 2.975687, 2, 1
-2.99397, 2, 1, 2.95613, 2, 1
-2.991879, 2, 2, 2.936432, 2, 1
-2.976734, 2, 1, 2.926384, 2, 1
-2.974643, 2, 2, 2.906146, 2, 1
-2.959498, 2, 2, 2.885888, 2, 1
-2.944352, 2, 1, 2.865232, 2, 1
-2.942261, 2, 1, 2.854615, 2, 1
-2.940171, 2, 2, 2.82378, 2, 1
-2.925025, 2, 2, 2.813577, 2, 1
-2.90988, 2, 1, 2.792864, 2, 1
-2.907789, 2, 2, 2.773322, 2, 1
-2.892643, 2, 2, 2.753496, 2, 1
-2.877498, 2, 1, 2.743742, 2, 1
-2.875407, 2, 2, 2.723629, 2, 1
-2.860262, 2, 1, 2.702631, 2, 1
-2.858171, 2, 1, 2.682221, 2, 1
-2.85608, 2, 1, 2.661211, 2, 1
-2.853989, 2, 2, 2.640206, 2, 1
-2.838843, 2, 2, 2.629563, 2, 1
-2.823698, 2, 1, 2.608024, 2, 1
-2.821607, 2, 1, 2.586719, 2, 1
-2.819516, 2, 2, 2.565673, 2, 1
-2.804371, 2, 2, 2.555255, 2, 1
-2.789225, 2, 2, 2.534253, 2, 1
-2.77408, 2, 1, 2.512984, 2, 1
-2.771989, 2, 1, 2.49217, 2, 1
-2.769898, 2, 2, 2.471115, 2, 1
-2.754753, 2, 2, 2.460928, 2, 1
-2.739607, 2, 2, 2.440536, 2, 1
-2.724462, 2, 2, 2.420568, 2, 1
-2.709316, 2, 2, 2.400569, 2, 1
-2.694171, 2, 1, 2.380767, 2, 1
-2.69208, 2, 2, 2.370914, 2, 1
-2.676935, 2, 2, 2.350616, 2, 1
-2.661789, 2, 1, 2.329573, 2, 1
-2.659698, 2, 1, 2.308691, 2, 1
-2.657607, 2, 2, 2.288218, 2, 1
-2.642462, 2, 2, 2.267405, 2, 1
-2.627316, 2, 1, 2.257336, 2, 1
-2.625226, 2, 1, 2.237637, 2, 1
-2.623135, 2, 2, 2.218782, 1, 1
-2.607989, 2, 2, 2.199869, 1, 1
-2.592844, 2, 2, 2.181388, 1, 1
-2.577698, 2, 2, 2.172417, 1, 1
-2.562553, 2, 2, 2.154927, 1, 1
-2.547408, 2, 2, 2.138186, 1, 1
-2.532262, 2, 2, 2.120798, 1, 1
-2.517117, 2, 2, 2.112499, 1, 1
-2.501971, 2, 2, 2.095233, 1, 1
-2.486826, 2, 2, 2.078665, 1, 1
-2.471681, 2, 2, 2.07017, 1, 1
-2.456535, 2, 2, 2.044188, 1, 1
-2.44139, 2, 2, 2.026416, 1, 1
-2.426244, 2, 2, 2.017587, 1, 1
-2.411099, 2, 2, 1.99906, 1, 1
-2.395954, 2, 2, 1.980515, 1, 1
-2.380808, 2, 2, 1.961428, 1, 1
-2.365663, 2, 2, 1.942429, 1, 1
-2.350518, 2, 2, 1.932431, 1, 1
-2.335372, 2, 2, 1.912469, 1, 1
-2.320227, 2, 2, 1.891544, 1, 1
-2.305081, 2, 2, 1.869898, 1, 1
-2.289936, 2, 2, 1.848255, 1, 1
-2.274791, 2, 2, 1.837636, 1, 1
-2.259645, 2, 2, 1.815939, 1, 1
-2.2445, 2, 2, 1.79479, 1, 1
-2.229355, 2, 2, 1.773161, 1, 1
-2.214209, 2, 2, 1.751803, 1, 1
-2.199064, 2, 2, 1.741492, 1, 1
-2.183918, 2, 2, 1.720402, 1, 1
-2.168773, 2, 2, 1.700423, 1, 1
-2.153628, 2, 2, 1.681192, 1, 1
-2.138482, 2, 2, 1.662177, 1, 1
-2.123337, 2, 2, 1.652452, 1, 1
-2.108191, 2, 2, 1.632575, 1, 1
-2.093046, 2, 2, 1.622717, 1, 1
-2.077901, 2, 2, 1.593061, 1, 1
-2.062755, 2, 2, 1.573244, 1, 1
-2.04761, 2, 2, 1.563344, 1, 1
-2.032465, 2, 2, 1.543221, 1, 1
-2.017319, 2, 2, 1.523764, 1, 1
-2.002174, 2, 2, 1.504459, 1, 1
-1.987028, 1, 2, 1.485247, 1, 1
-1.971883, 1, 2, 1.475674, 1, 1
-1.956738, 1, 2, 1.456162, 1, 1
-1.941592, 1, 2, 1.436646, 1, 1
-1.926447, 1, 2, 1.426786, 1, 1
-1.911301, 1, 2, 1.396987, 1, 1
-1.896156, 1, 2, 1.386966, 1, 1
-1.881011, 1, 2, 1.367133, 1, 1
-1.865865, 1, 2, 1.346914, 1, 1
-1.85072, 1, 2, 1.326516, 1, 1
-1.835574, 1, 2, 1.316365, 1, 1
-1.820429, 1, 2, 1.296313, 1, 1
-1.805284, 1, 2, 1.275818, 1, 1
-1.790138, 1, 2, 1.255368, 1, 1
-1.774993, 1, 2, 1.235351, 1, 1
-1.759848, 1, 2, 1.216312, 1, 1
-1.744702, 1, 2, 1.206762, 1, 1
-1.729557, 1, 2, 1.187944, 1, 1
-1.714411, 1, 2, 1.16982, 1, 1
-1.699266, 1, 2, 1.151561, 1, 1
-1.684121, 1, 2, 1.13374, 1, 1
-1.668975, 1, 2, 1.124855, 1, 1
-1.65383, 1, 2, 1.107034, 0, 1
-1.638684, 1, 2, 1.089774, 0, 1
-1.623539, 1, 2, 1.081054, 0, 1
-1.608394, 1, 2, 1.055617, 0, 1
-1.593248, 1, 2, 1.047333, 0, 1
-1.578103, 1, 2, 1.031501, 0, 1
-1.562957, 1, 2, 1.015214, 0, 1
-1.547812, 1, 2, 0.9986675, 0, 1
-1.532667, 1, 2, 0.9825873, 0, 1
-1.517521, 1, 2, 0.9744987, 0, 1
-1.502376, 1, 2, 0.9585626, 0, 1
-1.48723, 1, 2, 0.9416623, 0, 1
-1.472085, 1, 2, 0.9251983, 0, 1
-1.45694, 1, 2, 0.9082274, 0, 1
-1.441794, 1, 2, 0.8995786, 0, 1
-1.426649, 1, 2, 0.8830669, 0, 1
-1.411503, 1, 2, 0.8651974, 0, 1
-1.396358, 1, 2, 0.8469219, 0, 1
-1.381212, 1, 2, 0.8282146, 0, 1
-1.366067, 1, 2, 0.8184731, 0, 1
-1.350921, 1, 2, 0.7993052, 0, 1
-1.335776, 1, 2, 0.779325, 0, 1
-1.32063, 1, 2, 0.7594051, 0, 1
-1.305485, 1, 2, 0.7486639, 0, 1
-1.290339, 1, 2, 0.7276869, 0, 1
-1.275194, 1, 2, 0.7068384, 0, 1
-1.260048, 1, 2, 0.6857829, 0, 1
-1.244903, 1, 2, 0.665062, 0, 1
-1.229757, 1, 2, 0.6447408, 0, 1
-1.214612, 1, 2, 0.6348395, 0, 1
-1.199467, 1, 2, 0.6149507, 0, 1
-1.184321, 1, 2, 0.5948479, 0, 1
-1.169176, 1, 2, 0.5745101, 0, 1
-1.15403, 1, 2, 0.5536623, 0, 1
-1.138885, 1, 2, 0.5432425, 0, 1
-1.123739, 1, 2, 0.5231986, 0, 1
-1.108594, 1, 2, 0.50283, 0, 1
-1.093448, 1, 2, 0.4830685, 0, 1
-1.078303, 1, 2, 0.4631405, 0, 1
-1.063157, 1, 2, 0.4533253, 0, 1
-1.048012, 1, 2, 0.4336493, 0, 1
-1.032866, 1, 2, 0.4135661, 0, 1
-1.017721, 1, 2, 0.3935673, 0, 1
-1.002575, 1, 2, 0.3835168, 0, 1
-0.9874299, 0, 2, 0.3635201, 0, 1
-0.9722844, 0, 2, 0.3427713, 0, 1
-0.957139, 0, 2, 0.3211904, 0, 1
-0.9419935, 0, 2, 0.2994342, 0, 1
-0.926848, 0, 2, 0.2775769, 0, 1
-0.9117025, 0, 2, 0.2667623, 0, 1
-0.896557, 0, 2, 0.2448821, 0, 1
-0.8814116, 0, 2, 0.2233071, 0, 1
-0.8662661, 0, 2, 0.2011859, 0, 1
-0.8511206, 0, 2, 0.1790502, 0, 1
-0.8359751, 0, 2, 0.1683869, 0, 1
-0.8208296, 0, 2, 0.1471634, 0, 1
-0.8056841, 0, 2, 0.1260099, 0, 1
-0.7905387, 0, 2, 0.1053464, 0, 1
-0.7753932, 0, 2, 0.08379126, 0, 1
-0.7602478, 0, 2, 0.07301855, 0, 1
-0.7451023, 0, 2, 0.05070591, 0, 1
-0.7299568, 0, 2, 0.02742434, 0, 1
-0.7148113, 0, 2, 0.003782272, 0, 1
-0.6996658, 0, 2, -0.02012444, 0, 1
-0.6845204, 0, 2, -0.03216076, 0, 1
-0.6693749, 0, 2, -0.05653811, 0, 1
-0.6542294, 0, 2, -0.08091021, 0, 1
-0.6390839, 0, 2, -0.1046827, 0, 1
-0.6239385, 0, 2, -0.12817, 0, 1
-0.608793, 0, 2, -0.1393542, 0, 1
-0.5936475, 0, 2, -0.1616206, 0, 1
-0.5785021, 0, 2, -0.1827164, 0, 1
-0.5633566, 0, 2, -0.2040582, 0, 1
-0.5482111, 0, 2, -0.2246919, 0, 1
-0.5330656, 0, 2, -0.2347546, 0, 1
-0.5179201, 0, 2, -0.2552905, 0, 1
-0.5027747, 0, 2, -0.2756574, 0, 1
-0.4876292, 0, 2, -0.2953711, 0, 1
-0.4724837, 0, 2, -0.3153274, 0, 1
-0.4573382, 0, 2, -0.3255186, 0, 1
-0.4421928, 0, 2, -0.3462672, 0, 1
-0.4270473, 0, 2, -0.3672943, 0, 1
-0.4119018, 0, 2, -0.3880897, 0, 1
-0.3967564, 0, 2, -0.4092898, 0, 1
-0.3816109, 0, 2, -0.4204421, 0, 1
-0.3664654, 0, 2, -0.4411755, 0, 1
-0.35132, 0, 2, -0.4617426, 0, 1
-0.3361745, 0, 2, -0.4825521, 0, 1
-0.3210291, 0, 2, -0.5017638, 0, 1
-0.3058836, 0, 2, -0.5109811, 0, 1
-0.2907381, 0, 2, -0.5291204, 0, 1
-0.2755927, 0, 2, -0.5473218, 0, 1
-0.2604472, 0, 2, -0.5662584, 0, 1
-0.2453018, 0, 2, -0.5857875, 0, 1
-0.2301563, 0, 2, -0.5952821, 0, 1
-0.2150109, 0, 2, -0.61428, 0, 1
-0.1998654, 0, 2, -0.6329322, 0, 1
-0.18472, 0, 2, -0.652338, 0, 1
-0.1695745, 0, 2, -0.6621232, 0, 1
-0.1544291, 0, 2, -0.681304, 0, 1
-0.1392836, 0, 2, -0.6999145, 0, 1
-0.1241382, 0, 2, -0.7179642, 0, 1
-0.1089927, 0, 2, -0.7357028, 0, 1
-0.09384725, 0, 2, -0.7448282, 0, 1
-0.0787018, 0, 2, -0.7636683, 0, 1
-0.06355634, 0, 2, -0.7826962, 0, 1
-0.04841089, 0, 2, -0.8016639, 0, 1
-0.03326544, 0, 2, -0.8202782, 0, 1
-0.01811999, 0, 2, -0.8293996, 0, 1
-0.002974533, 0, 2, -0.8480892, 0, 1
0.01217092, 0, 2, -0.8669615, 0, 1
0.02731637, 0, 2, -0.8857851, 0, 1
0.04246183, 0, 2, -0.905695, 0, 1
0.05760728, 0, 2, -0.9153438, 0, 1
0.07275274, 0, 2, -0.9344358, 0, 1
0.08789819, 0, 2, -0.9549508, 0, 1
0.1030436, 0, 2, -0.9727941, 0, 1
0.1181891, 0, 2, -0.9898396, 0, 1
0.1333345, 0, 2, -0.9985123, 0, 1
0.14848, 0, 2, -1.014761, 0, 1
0.1636255, 0, 2, -1.03012, 0, 1
0.1787709, 0, 2, -1.045759, 0, 1
0.1939164, 0, 2, -1.060983, 0, 1
0.2090618, 0, 2, -1.068235, 0, 1
0.2242073, 0, 2, -1.082029, 0, 1
0.2393527, 0, 2, -1.095485, 0, 1
0.2544982, 0, 2, -1.108288, 0, 1
0.2696436, 0, 2, -1.120756, -1, 1
0.2847891, 0, 2, -1.126988, -1, 1
0.2999345, 0, 2, -1.138895, -1, 1
0.31508, 0, 2, -1.150517, -1, 1
0.3302254, 0, 2, -1.161378, -1, 1
0.3453709, 0, 2, -1.172159, -1, 1
0.3605164, 0, 2, -1.177411, -1, 1
0.3756618, 0, 2, -1.187658, -1, 1
0.3908073, 0, 2, -1.197255, -1, 1
0.4059528, 0, 2, -1.205914, -1, 1
0.4210983, 0, 2, -1.214356, -1, 1
0.4362437, 0, 2, -1.221272, -1, 1
0.4513892, 0, 2, -1.224325, -1, 1
0.4665347, 0, 2, -1.231281, -1, 1
0.4816802, 0, 2, -1.239439, -1, 1
0.4968257, 0, 2, -1.244133, -1, 1
0.5119711, 0, 2, -1.255994, -1, 1
0.5271166, 0, 2, -1.263101, -1, 1
0.5422621, 0, 2, -1.266816, -1, 1
0.5574076, 0, 2, -1.273298, -1, 1
0.572553, 0, 2, -1.279361, -1, 1
0.5876985, 0, 2, -1.28553, -1, 1
0.602844, 0, 2, -1.291806, -1, 1
0.6179895, 0, 2, -1.295043, -1, 1
0.6331349, 0, 2, -1.300753, -1, 1
0.6482804, 0, 2, -1.305936, -1, 1
0.6634259, 0, 2, -1.310853, -1, 1
0.6785713, 0, 2, -1.313082, -1, 1
0.6937168, 0, 2, -1.317449, -1, 1
0.7088623, 0, 2, -1.321531, -1, 1
0.7240078, 0, 2, -1.325588, -1, 1
0.7391533, 0, 2, -1.328944, -1, 1
0.7542987, 0, 2, -1.331313, -1, 1
0.7694442, 0, 2, -1.332376, -1, 1
0.7845897, 0, 2, -1.334825, -1, 1
0.7997351, 0, 2, -1.337074, -1, 1
0.8148806, 0, 2, -1.339245, -1, 1
0.8300261, 0, 2, -1.34047, -1, 1
0.8451716, 0, 2, -1.343507, -1, 1
0.8603171, 0, 2, -1.344851, -1, 1
0.8754625, 0, 2, -1.350039, -1, 1
0.890608, 0, 2, -1.35335, -1, 1
0.9057535, 0, 2, -1.356047, -1, 1
0.920899, 0, 2, -1.357502, -1, 1
0.9360445, 0, 2, -1.359567, -1, 1
0.9511899, 0, 2, -1.36136, -1, 1
0.9663354, 0, 2, -1.362115, -1, 1
0.9814808, 0, 2, -1.362145, -1, 1
0.9966263, 0, 2, -1.362164, -1, 1
1.011772, -1, 2, -1.362036, -1, 1
1.026917, -1, 2, -1.362443, -1, 1
1.042063, -1, 2, -1.363007, -1, 1
1.057208, -1, 2, -1.362803, -1, 1
1.072354, -1, 2, -1.362644, -1, 1
1.087499, -1, 2, -1.361436, -1, 1
1.102645, -1, 2, -1.359705, -1, 1
1.11779, -1, 2, -1.357913, -1, 1
1.132936, -1, 2, -1.356699, -1, 1
1.148081, -1, 2, -1.354403, -1, 1
1.163227, -1, 2, -1.351755, -1, 1
1.178372, -1, 2, -1.348227, -1, 1
1.193518, -1, 2, -1.344035, -1, 1
1.208663, -1, 2, -1.341427, -1, 1
1.223808, -1, 2, -1.336152, -1, 1
1.238954, -1, 2, -1.330171, -1, 1
1.254099, -1, 2, -1.324004, -1, 1
1.269245, -1, 2, -1.316501, -1, 1
1.28439, -1, 2, -1.312619, -1, 1
1.299536, -1, 2, -1.304492, -1, 1
1.314681, -1, 2, -1.29703, -1, 1
1.329827, -1, 2, -1.289241, -1, 1
1.344972, -1, 2, -1.281025, -1, 1
1.360118, -1, 2, -1.276356, -1, 1
1.375263, -1, 2, -1.266995, -1, 1
1.390409, -1, 2, -1.257572, -1, 1
1.405554, -1, 2, -1.247288, -1, 1
1.4207, -1, 2, -1.236441, -1, 1
1.435845, -1, 2, -1.225348, -1, 1
1.450991, -1, 2, -1.219901, -1, 1
1.466136, -1, 2, -1.208371, -1, 1
1.481281, -1, 2, -1.197465, -1, 1
1.496427, -1, 2, -1.185887, -1, 1
1.511572, -1, 2, -1.175965, -1, 1
1.526717, -1, 2, -1.170158, -1, 1
1.541863, -1, 2, -1.159363, -1, 1
1.557008, -1, 2, -1.147452, -1, 1
1.572154, -1, 2, -1.14135, -1, 1
1.587299, -1, 2, -1.122239, -1, 1
1.602444, -1, 2, -1.115828, -1, 1
