timestamp_sec,frame_id,game_played,yielding,player1discrete,player2discrete,player1yieldprob,player2yieldprob,player1_pose_x,player1_pose_y,player1_pose_z,player1_pose_orient_x,player1_pose_orient_y,player1_pose_orient_z,player1_pose_orient_w,player2_pose_x,player2_pose_y,player2_pose_z,player2_pose_orient_x,player2_pose_orient_y,player2_pose_orient_z,player2_pose_orient_w
1718019395.9087865,map,True,True,3,3,0.6616527499769684,0.6616527499769684,2.2623555660247803,-1.7796505689620972,0.0,0.0,0.0,0.05722764821212453,0.9983611535864633,3.815187173084822,-4.645436134805333,0.818901234424041,0.0,0.0,0.0,1.0
1718019395.9600363,map,True,False,3,3,0.6616527499769684,0.6616527499769684,2.2623555660247803,-1.7796505689620972,0.0,0.0,0.0,0.05722764821212453,0.9983611535864633,3.815187173084822,-4.645436134805333,0.818901234424041,0.0,0.0,0.0,1.0
1718019396.0574093,map,True,False,3,3,0.6616527499769684,0.6616527499769684,2.2623555660247803,-1.7796505689620972,0.0,0.0,0.0,0.05722764821212453,0.9983611535864633,3.815187173084822,-4.645436134805333,0.818901234424041,0.0,0.0,0.0,1.0
1718019396.1574106,map,True,True,3,3,0.6616527499769684,0.6616527499769684,2.2623555660247803,-1.7796505689620972,0.0,0.0,0.0,0.05722764821212453,0.9983611535864633,3.815187173084822,-4.645436134805333,0.818901234424041,0.0,0.0,0.0,1.0
1718019396.2170682,map,True,False,3,3,0.6616527499769684,0.6616527499769684,2.2623555660247803,-1.7796505689620972,0.0,0.0,0.0,0.05722764821212453,0.9983611535864633,3.8461146417655145,-4.513002891909753,0.7537923951095041,0.0,0.0,0.0,1.0
1718019396.2584906,map,True,True,3,3,0.6616527499769684,0.6616527499769684,2.2623555660247803,-1.7796505689620972,0.0,0.0,0.0,0.05722764821212453,0.9983611535864633,3.846379091261169,-4.289751172300564,0.7052092501171144,0.0,0.0,0.0,1.0
1718019396.358241,map,True,True,3,3,0.6616527499769684,0.6616527499769684,2.3695812225341797,-1.8026843070983887,0.0,0.0,0.0,0.0582331492617986,0.9983030165960602,3.846379091261169,-4.289751172300564,0.7052092501171144,0.0,0.0,0.0,1.0
1718019396.408163,map,True,True,3,3,0.6616527499769684,0.6616527499769684,2.3695812225341797,-1.8026843070983887,0.0,0.0,0.0,0.0582331492617986,0.9983030165960602,3.846379091261169,-4.289751172300564,0.7052092501171144,0.0,0.0,0.0,1.0
1718019396.5589602,map,True,True,3,3,0.6616527499769684,0.6616527499769684,2.3695812225341797,-1.8026843070983887,0.0,0.0,0.0,0.0582331492617986,0.9983030165960602,3.84340820465677,-3.910693022969772,0.6881009350346523,0.0,0.0,0.0,1.0
1718019396.609952,map,True,True,3,3,0.6616527499769684,0.6616527499769684,2.3695812225341797,-1.8026843070983887,0.0,0.0,0.0,0.0582331492617986,0.9983030165960602,3.847735793675652,-3.8904699724209904,0.6846396217846382,0.0,0.0,0.0,1.0
1718019396.713808,map,True,False,3,3,0.6616527499769684,0.6616527499769684,2.3695812225341797,-1.8026843070983887,0.0,0.0,0.0,0.0582331492617986,0.9983030165960602,3.847735793675652,-3.8904699724209904,0.6846396217846382,0.0,0.0,0.0,1.0
1718019396.7604856,map,True,True,3,3,0.6616527499769684,0.6616527499769684,2.3695812225341797,-1.8026843070983887,0.0,0.0,0.0,0.0582331492617986,0.9983030165960602,3.847735793675652,-3.8904699724209904,0.6846396217846382,0.0,0.0,0.0,1.0
1718019396.8102827,map,True,False,3,3,0.6616527499769684,0.6616527499769684,2.3695812225341797,-1.8026843070983887,0.0,0.0,0.0,0.0582331492617986,0.9983030165960602,3.847735793675652,-3.8904699724209904,0.6846396217846382,0.0,0.0,0.0,1.0
1718019396.8602302,map,True,False,3,3,0.6616527499769684,0.6616527499769684,2.3695812225341797,-1.8026843070983887,0.0,0.0,0.0,0.0582331492617986,0.9983030165960602,3.847735793675652,-3.8904699724209904,0.6846396217846382,0.0,0.0,0.0,1.0
1718019396.9604652,map,True,False,3,2,0.0,0.0,2.3695812225341797,-1.8026843070983887,0.0,0.0,0.0,0.0582331492617986,0.9983030165960602,3.8786650425072073,-3.6226278737511617,0.683989581018343,0.0,0.0,0.0,1.0
1718019397.0608082,map,True,True,2,2,0.49874686716791977,0.49874686716791977,2.465247631072998,-1.8221389055252075,0.0,0.0,0.0,0.05885876587635327,0.9982663266064646,3.8786650425072073,-3.6226278737511617,0.683989581018343,0.0,0.0,0.0,1.0
1718019397.1595638,map,True,True,2,2,0.49874686716791977,0.49874686716791977,2.465247631072998,-1.8221389055252075,0.0,0.0,0.0,0.05885876587635327,0.9982663266064646,3.8786650425072073,-3.6226278737511617,0.683989581018343,0.0,0.0,0.0,1.0
1718019397.210905,map,True,True,2,2,0.49874686716791977,0.49874686716791977,2.465247631072998,-1.8221389055252075,0.0,0.0,0.0,0.05885876587635327,0.9982663266064646,3.8600270164694037,-3.2745281288487647,0.683187919742105,0.0,0.0,0.0,1.0
1718019397.30918,map,True,False,2,2,0.49874686716791977,0.49874686716791977,2.465247631072998,-1.8221389055252075,0.0,0.0,0.0,0.05885876587635327,0.9982663266064646,3.878340807881081,-3.2059110031418556,0.6829577141547097,0.0,0.0,0.0,1.0
1718019397.3597283,map,True,True,2,2,0.49874686716791977,0.49874686716791977,2.465247631072998,-1.8221389055252075,0.0,0.0,0.0,0.05885876587635327,0.9982663266064646,3.878340807881081,-3.2059110031418556,0.6829577141547097,0.0,0.0,0.0,1.0
1718019397.4601452,map,True,False,2,2,0.49874686716791977,0.49874686716791977,2.495561122894287,-1.825701355934143,0.0,0.0,0.0,0.059027534706252285,0.9982563552940746,3.878340807881081,-3.2059110031418556,0.6829577141547097,0.0,0.0,0.0,1.0
1718019397.5618713,map,True,False,2,2,0.49874686716791977,0.49874686716791977,2.495561122894287,-1.825701355934143,0.0,0.0,0.0,0.059027534706252285,0.9982563552940746,3.945891737059071,-2.881170021870548,0.6820037278670575,0.0,0.0,0.0,1.0
1718019397.6124,map,True,False,2,2,0.49874686716791977,0.49874686716791977,2.495561122894287,-1.825701355934143,0.0,0.0,0.0,0.059027534706252285,0.9982563552940746,3.9444295408671484,-2.838294053896758,0.6818935209825762,0.0,0.0,0.0,1.0
1718019397.6615903,map,True,True,2,2,0.49874686716791977,0.49874686716791977,2.495561122894287,-1.825701355934143,0.0,0.0,0.0,0.059027534706252285,0.9982563552940746,3.9444295408671484,-2.838294053896758,0.6818935209825762,0.0,0.0,0.0,1.0
1718019397.7118642,map,True,True,2,2,0.49874686716791977,0.49874686716791977,2.495561122894287,-1.825701355934143,0.0,0.0,0.0,0.059027534706252285,0.9982563552940746,3.9444295408671484,-2.838294053896758,0.6818935209825762,0.0,0.0,0.0,1.0
1718019397.8114944,map,True,True,2,2,0.49874686716791977,0.49874686716791977,2.495561122894287,-1.825701355934143,0.0,0.0,0.0,0.059027534706252285,0.9982563552940746,3.9444295408671484,-2.838294053896758,0.6818935209825762,0.0,0.0,0.0,1.0
1718019397.8623176,map,True,True,2,2,0.49874686716791977,0.49874686716791977,2.597592830657959,-1.8469154834747314,0.0,0.0,0.0,0.05885279721044865,0.9982666699283211,3.9444295408671484,-2.838294053896758,0.6818935209825762,0.0,0.0,0.0,1.0
1718019397.9612718,map,True,False,2,1,0.0,0.0,2.597592830657959,-1.8469154834747314,0.0,0.0,0.0,0.05885279721044865,0.9982666699283211,3.9055535931016028,-2.4587143993588425,0.682446283103165,0.0,0.0,0.0,1.0
1718019398.0605416,map,True,False,2,1,0.0,0.0,2.597592830657959,-1.8469154834747314,0.0,0.0,0.0,0.05885279721044865,0.9982666699283211,3.9055535931016028,-2.4587143993588425,0.682446283103165,0.0,0.0,0.0,1.0
1718019398.1103191,map,True,False,2,1,0.0,0.0,2.597592830657959,-1.8469154834747314,0.0,0.0,0.0,0.05885279721044865,0.9982666699283211,3.9055535931016028,-2.4587143993588425,0.682446283103165,0.0,0.0,0.0,1.0
1718019398.2123518,map,True,False,2,1,0.0,0.0,2.605414628982544,-1.845384955406189,0.0,0.0,0.0,0.05874219587206053,0.9982731930211605,3.9701641316500687,-2.241165676782069,0.6805508381442689,0.0,0.0,0.0,1.0
1718019398.2614849,map,True,False,2,1,0.0,0.0,2.605414628982544,-1.845384955406189,0.0,0.0,0.0,0.05874219587206053,0.9982731930211605,3.97069509334346,-2.1151762114782695,0.6811418573250099,0.0,0.0,0.0,1.0
1718019398.360727,map,True,False,2,1,0.0,0.0,2.605414628982544,-1.845384955406189,0.0,0.0,0.0,0.05874219587206053,0.9982731930211605,3.97069509334346,-2.1151762114782695,0.6811418573250099,0.0,0.0,0.0,1.0
1718019398.41247,map,True,False,2,1,0.0,0.0,2.6737773418426514,-1.8472703695297241,0.0,0.0,0.0,0.058347994451113126,0.9982962996524225,3.97069509334346,-2.1151762114782695,0.6811418573250099,0.0,0.0,0.0,1.0
1718019398.461842,map,True,False,2,1,0.0,0.0,2.6737773418426514,-1.8472703695297241,0.0,0.0,0.0,0.058347994451113126,0.9982962996524225,3.97069509334346,-2.1151762114782695,0.6811418573250099,0.0,0.0,0.0,1.0
