timestamp_sec,frame_id,game_played,yielding,player1discrete,player2discrete,player1yieldprob,player2yieldprob,player1_pose_x,player1_pose_y,player1_pose_z,player1_pose_orient_x,player1_pose_orient_y,player1_pose_orient_z,player1_pose_orient_w,player2_pose_x,player2_pose_y,player2_pose_z,player2_pose_orient_x,player2_pose_orient_y,player2_pose_orient_z,player2_pose_orient_w
1717777386.7267497,map,True,False,5,6,0.0,0.0,2.569157600402832,-2.514145851135254,0.0,0.0,0.0,0.046926376237334894,0.9988983463790363,4.454105147606548,-7.890109630157504,0.899003862514713,0.0,0.0,0.0,1.0
1717777386.777545,map,True,False,5,6,0.0,0.0,2.569157600402832,-2.514145851135254,0.0,0.0,0.0,0.046926376237334894,0.9988983463790363,4.46022107527695,-7.821917944608062,0.833224226533757,0.0,0.0,0.0,1.0
1717777386.8279352,map,True,False,5,6,0.0,0.0,2.569157600402832,-2.514145851135254,0.0,0.0,0.0,0.046926376237334894,0.9988983463790363,4.46022107527695,-7.821917944608062,0.833224226533757,0.0,0.0,0.0,1.0
1717777386.8790894,map,True,False,4,6,0.0,0.0,2.680551528930664,-2.541454553604126,0.0,0.0,0.0,0.047950073018774464,0.9988497287530851,4.46022107527695,-7.821917944608062,0.833224226533757,0.0,0.0,0.0,1.0
1717777386.9285293,map,True,False,4,6,0.0,0.0,2.680551528930664,-2.541454553604126,0.0,0.0,0.0,0.047950073018774464,0.9988497287530851,4.46022107527695,-7.821917944608062,0.833224226533757,0.0,0.0,0.0,1.0
1717777387.0282166,map,True,False,4,6,0.0,0.0,2.680551528930664,-2.541454553604126,0.0,0.0,0.0,0.047950073018774464,0.9988497287530851,4.46022107527695,-7.821917944608062,0.833224226533757,0.0,0.0,0.0,1.0
1717777387.12926,map,True,False,4,5,0.0,0.0,2.680551528930664,-2.541454553604126,0.0,0.0,0.0,0.047950073018774464,0.9988497287530851,4.4651056388918455,-7.230549529754464,0.8236675856791866,0.0,0.0,0.0,1.0
1717777387.1793063,map,True,False,4,5,0.0,0.0,2.680551528930664,-2.541454553604126,0.0,0.0,0.0,0.047950073018774464,0.9988497287530851,4.4651056388918455,-7.230549529754464,0.8236675856791866,0.0,0.0,0.0,1.0
1717777387.3816068,map,True,False,4,4,0.5922520728754596,0.5922520728754596,2.680551528930664,-2.541454553604126,0.0,0.0,0.0,0.047950073018774464,0.9988497287530851,4.44632297380207,-6.717125898110261,0.8023287234867102,0.0,0.0,0.0,1.0
1717777387.4798026,map,True,False,4,5,0.0,0.0,2.680551528930664,-2.541454553604126,0.0,0.0,0.0,0.047950073018774464,0.9988497287530851,4.542767335760287,-7.170623845949979,0.7946961093357827,0.0,0.0,0.0,1.0
1717777387.579564,map,True,False,4,5,0.0,0.0,2.8011860847473145,-2.563870906829834,0.0,0.0,0.0,0.047588983688755436,0.9988670040197727,4.542767335760287,-7.170623845949979,0.7946961093357827,0.0,0.0,0.0,1.0
1717777387.6799736,map,True,False,4,5,0.0,0.0,2.8011860847473145,-2.563870906829834,0.0,0.0,0.0,0.047588983688755436,0.9988670040197727,4.542767335760287,-7.170623845949979,0.7946961093357827,0.0,0.0,0.0,1.0
1717777387.78086,map,True,True,4,4,0.5922520728754596,0.5922520728754596,2.8011860847473145,-2.563870906829834,0.0,0.0,0.0,0.047588983688755436,0.9988670040197727,4.543049866812173,-6.664101611643792,0.7883935561247146,0.0,0.0,0.0,1.0
1717777387.8302505,map,True,True,4,4,0.5922520728754596,0.5922520728754596,2.8011860847473145,-2.563870906829834,0.0,0.0,0.0,0.047588983688755436,0.9988670040197727,4.543049866812173,-6.664101611643792,0.7883935561247146,0.0,0.0,0.0,1.0
1717777387.9287984,map,True,True,4,4,0.5922520728754596,0.5922520728754596,2.8011860847473145,-2.563870906829834,0.0,0.0,0.0,0.047588983688755436,0.9988670040197727,4.543049866812173,-6.664101611643792,0.7883935561247146,0.0,0.0,0.0,1.0
1717777387.9796448,map,True,True,4,4,0.5922520728754596,0.5922520728754596,2.8011860847473145,-2.563870906829834,0.0,0.0,0.0,0.047588983688755436,0.9988670040197727,4.543049866812173,-6.664101611643792,0.7883935561247146,0.0,0.0,0.0,1.0
1717777388.0805745,map,True,True,4,4,0.5922520728754596,0.5922520728754596,2.8011860847473145,-2.563870906829834,0.0,0.0,0.0,0.047588983688755436,0.9988670040197727,4.547265062580209,-5.964746304635358,0.7499827969539454,0.0,0.0,0.0,1.0
1717777388.1308136,map,True,True,4,4,0.5922520728754596,0.5922520728754596,2.8011860847473145,-2.563870906829834,0.0,0.0,0.0,0.047588983688755436,0.9988670040197727,4.547265062580209,-5.964746304635358,0.7499827969539454,0.0,0.0,0.0,1.0
1717777388.4330738,map,True,True,4,4,0.5922520728754596,0.5922520728754596,2.9475502967834473,-2.600615978240967,0.0,0.0,0.0,0.04924728539195324,0.9987866222604365,4.601500547714055,-5.9289714841659835,0.7852505270506173,0.0,0.0,0.0,1.0
1717777388.4829361,map,True,False,4,3,0.0,0.0,2.9475502967834473,-2.600615978240967,0.0,0.0,0.0,0.04924728539195324,0.9987866222604365,4.53729693339569,-5.652958433531197,0.7861457299488509,0.0,0.0,0.0,1.0
1717777388.5335627,map,True,False,4,3,0.0,0.0,2.9475502967834473,-2.600615978240967,0.0,0.0,0.0,0.04924728539195324,0.9987866222604365,4.53729693339569,-5.652958433531197,0.7861457299488509,0.0,0.0,0.0,1.0
1717777388.634379,map,True,False,4,3,0.0,0.0,2.9475502967834473,-2.600615978240967,0.0,0.0,0.0,0.04924728539195324,0.9987866222604365,4.53729693339569,-5.652958433531197,0.7861457299488509,0.0,0.0,0.0,1.0
1717777388.7326756,map,True,False,4,3,0.0,0.0,2.9475502967834473,-2.600615978240967,0.0,0.0,0.0,0.04924728539195324,0.9987866222604365,4.53729693339569,-5.652958433531197,0.7861457299488509,0.0,0.0,0.0,1.0
1717777388.7824163,map,True,False,4,3,0.0,0.0,2.9475502967834473,-2.600615978240967,0.0,0.0,0.0,0.04924728539195324,0.9987866222604365,4.492532288552195,-5.13107933774152,0.7603275894188029,0.0,0.0,0.0,1.0
1717777388.8822405,map,True,True,3,3,0.6616527499769684,0.6616527499769684,3.054943084716797,-2.634162187576294,0.0,0.0,0.0,0.04842086961367923,0.9988270228099746,4.492532288552195,-5.13107933774152,0.7603275894188029,0.0,0.0,0.0,1.0
1717777388.932668,map,True,True,3,3,0.6616527499769684,0.6616527499769684,3.054943084716797,-2.634162187576294,0.0,0.0,0.0,0.04842086961367923,0.9988270228099746,4.492532288552195,-5.13107933774152,0.7603275894188029,0.0,0.0,0.0,1.0
1717777388.9822488,map,True,True,3,3,0.6616527499769684,0.6616527499769684,3.054943084716797,-2.634162187576294,0.0,0.0,0.0,0.04842086961367923,0.9988270228099746,4.492532288552195,-5.13107933774152,0.7603275894188029,0.0,0.0,0.0,1.0
1717777389.03268,map,True,True,3,3,0.6616527499769684,0.6616527499769684,3.054943084716797,-2.634162187576294,0.0,0.0,0.0,0.04842086961367923,0.9988270228099746,4.492532288552195,-5.13107933774152,0.7603275894188029,0.0,0.0,0.0,1.0
1717777389.1350386,map,True,False,3,3,0.6616527499769684,0.6616527499769684,3.054943084716797,-2.634162187576294,0.0,0.0,0.0,0.04842086961367923,0.9988270228099746,4.571795246765913,-4.832151173291721,0.6846998004316958,0.0,0.0,0.0,1.0
1717777389.184457,map,True,False,3,3,0.6616527499769684,0.6616527499769684,3.054943084716797,-2.634162187576294,0.0,0.0,0.0,0.04842086961367923,0.9988270228099746,4.571795246765913,-4.832151173291721,0.6846998004316958,0.0,0.0,0.0,1.0
1717777389.433045,map,True,False,3,2,0.0,0.0,3.054943084716797,-2.634162187576294,0.0,0.0,0.0,0.04842086961367923,0.9988270228099746,4.4985072091691025,-4.528051055819532,0.6841085651731621,0.0,0.0,0.0,1.0
1717777389.4836686,map,True,False,3,2,0.0,0.0,3.054943084716797,-2.634162187576294,0.0,0.0,0.0,0.04842086961367923,0.9988270228099746,4.4985072091691025,-4.528051055819532,0.6841085651731621,0.0,0.0,0.0,1.0
1717777389.583114,map,True,False,3,2,0.0,0.0,3.135030508041382,-2.6409428119659424,0.0,0.0,0.0,0.04827473150304899,0.9988340942299925,4.4985072091691025,-4.528051055819532,0.6841085651731621,0.0,0.0,0.0,1.0
1717777389.6335459,map,True,False,3,2,0.0,0.0,3.135030508041382,-2.6409428119659424,0.0,0.0,0.0,0.04827473150304899,0.9988340942299925,4.4985072091691025,-4.528051055819532,0.6841085651731621,0.0,0.0,0.0,1.0
1717777389.734375,map,True,False,3,2,0.0,0.0,3.135030508041382,-2.6409428119659424,0.0,0.0,0.0,0.04827473150304899,0.9988340942299925,4.5327020007997145,-4.311993206577725,0.6863227886938963,0.0,0.0,0.0,1.0
1717777389.8320477,map,True,False,3,2,0.0,0.0,3.135030508041382,-2.6409428119659424,0.0,0.0,0.0,0.04827473150304899,0.9988340942299925,4.5668982657924015,-4.2711902081346516,0.6861518374086144,0.0,0.0,0.0,1.0
1717777389.8821528,map,True,False,3,2,0.0,0.0,3.135030508041382,-2.6409428119659424,0.0,0.0,0.0,0.04827473150304899,0.9988340942299925,4.5668982657924015,-4.2711902081346516,0.6861518374086144,0.0,0.0,0.0,1.0
1717777389.9325466,map,True,False,3,2,0.0,0.0,3.135030508041382,-2.6409428119659424,0.0,0.0,0.0,0.04827473150304899,0.9988340942299925,4.5668982657924015,-4.2711902081346516,0.6861518374086144,0.0,0.0,0.0,1.0
1717777390.0324786,map,True,False,3,2,0.0,0.0,3.135030508041382,-2.6409428119659424,0.0,0.0,0.0,0.04827473150304899,0.9988340942299925,4.5668982657924015,-4.2711902081346516,0.6861518374086144,0.0,0.0,0.0,1.0
1717777390.082678,map,True,False,3,2,0.0,0.0,3.2358806133270264,-2.6579740047454834,0.0,0.0,0.0,0.04934412422647764,0.998781833165244,4.593834023708385,-4.146925757837201,0.6856634519331505,0.0,0.0,0.0,1.0
1717777390.1334066,map,True,False,3,2,0.0,0.0,3.2358806133270264,-2.6579740047454834,0.0,0.0,0.0,0.04934412422647764,0.998781833165244,4.593834023708385,-4.146925757837201,0.6856634519331505,0.0,0.0,0.0,1.0
1717777390.183654,map,True,False,3,2,0.0,0.0,3.2358806133270264,-2.6579740047454834,0.0,0.0,0.0,0.04934412422647764,0.998781833165244,4.593834023708385,-4.146925757837201,0.6856634519331505,0.0,0.0,0.0,1.0
1717777390.384952,map,True,False,3,2,0.0,0.0,3.2358806133270264,-2.6579740047454834,0.0,0.0,0.0,0.04934412422647764,0.998781833165244,4.587756189990097,-4.043979406508813,0.6853488310279554,0.0,0.0,0.0,1.0
1717777390.438948,map,True,False,3,2,0.0,0.0,3.2358806133270264,-2.6579740047454834,0.0,0.0,0.0,0.04934412422647764,0.998781833165244,4.581816817207127,-3.9994136583511732,0.6829458527563508,0.0,0.0,0.0,1.0
1717777390.5344138,map,True,False,3,2,0.0,0.0,3.2358806133270264,-2.6579740047454834,0.0,0.0,0.0,0.04934412422647764,0.998781833165244,4.588131382050662,-3.9767862661734847,0.6850921061469657,0.0,0.0,0.0,1.0
1717777390.583926,map,True,False,3,2,0.0,0.0,3.3276426792144775,-2.6715891361236572,0.0,0.0,0.0,0.05018247353721747,0.9987400730723496,4.588131382050662,-3.9767862661734847,0.6850921061469657,0.0,0.0,0.0,1.0
1717777390.684277,map,True,False,3,2,0.0,0.0,3.3276426792144775,-2.6715891361236572,0.0,0.0,0.0,0.05018247353721747,0.9987400730723496,4.588131382050662,-3.9767862661734847,0.6850921061469657,0.0,0.0,0.0,1.0
1717777390.7835345,map,True,False,3,2,0.0,0.0,3.3276426792144775,-2.6715891361236572,0.0,0.0,0.0,0.05018247353721747,0.9987400730723496,4.629203870375004,-3.9960039988657416,0.6851524473307491,0.0,0.0,0.0,1.0
1717777390.8832536,map,True,False,3,2,0.0,0.0,3.3276426792144775,-2.6715891361236572,0.0,0.0,0.0,0.05018247353721747,0.9987400730723496,4.629203870375004,-3.9960039988657416,0.6851524473307491,0.0,0.0,0.0,1.0
1717777390.9346097,map,True,False,3,2,0.0,0.0,3.3276426792144775,-2.6715891361236572,0.0,0.0,0.0,0.05018247353721747,0.9987400730723496,4.629203870375004,-3.9960039988657416,0.6851524473307491,0.0,0.0,0.0,1.0
1717777390.9839878,map,True,False,3,2,0.0,0.0,3.3276426792144775,-2.6715891361236572,0.0,0.0,0.0,0.05018247353721747,0.9987400730723496,4.629203870375004,-3.9960039988657416,0.6851524473307491,0.0,0.0,0.0,1.0
1717777391.0350618,map,True,False,3,2,0.0,0.0,3.3276426792144775,-2.6715891361236572,0.0,0.0,0.0,0.05018247353721747,0.9987400730723496,4.629203870375004,-3.9960039988657416,0.6851524473307491,0.0,0.0,0.0,1.0
1717777391.0867085,map,True,False,3,2,0.0,0.0,3.3276426792144775,-2.6715891361236572,0.0,0.0,0.0,0.05018247353721747,0.9987400730723496,4.677348496285755,-4.036581644851546,0.6830511923079181,0.0,0.0,0.0,1.0
1717777391.1360264,map,True,False,3,2,0.0,0.0,3.3276426792144775,-2.6715891361236572,0.0,0.0,0.0,0.05018247353721747,0.9987400730723496,4.712886520964281,-4.072240737393648,0.6854022969352499,0.0,0.0,0.0,1.0
1717777391.4854646,map,True,True,2,2,0.49874686716791977,0.49874686716791977,3.4101271629333496,-2.7067971229553223,0.0,0.0,0.0,0.04936234394798436,0.9987809380047168,4.7409753091000635,-4.061991654876703,0.6853100056463691,0.0,0.0,0.0,1.0
1717777391.535885,map,True,True,2,2,0.49874686716791977,0.49874686716791977,3.4101271629333496,-2.7067971229553223,0.0,0.0,0.0,0.04936234394798436,0.9987809380047168,4.7409753091000635,-4.061991654876703,0.6853100056463691,0.0,0.0,0.0,1.0
1717777391.5858576,map,True,True,2,2,0.49874686716791977,0.49874686716791977,3.4101271629333496,-2.7067971229553223,0.0,0.0,0.0,0.04936234394798436,0.9987809380047168,4.7409753091000635,-4.061991654876703,0.6853100056463691,0.0,0.0,0.0,1.0
1717777391.6360269,map,True,False,2,2,0.49874686716791977,0.49874686716791977,3.53818416595459,-2.7342946529388428,0.0,0.0,0.0,0.04988568573085597,0.9987549332412132,4.7409753091000635,-4.061991654876703,0.6853100056463691,0.0,0.0,0.0,1.0
1717777391.6867156,map,True,False,2,2,0.49874686716791977,0.49874686716791977,3.53818416595459,-2.7342946529388428,0.0,0.0,0.0,0.04988568573085597,0.9987549332412132,4.7409753091000635,-4.061991654876703,0.6853100056463691,0.0,0.0,0.0,1.0
1717777391.784808,map,True,False,2,2,0.49874686716791977,0.49874686716791977,3.53818416595459,-2.7342946529388428,0.0,0.0,0.0,0.04988568573085597,0.9987549332412132,4.753888617090739,-4.111783691524208,0.6854969202007393,0.0,0.0,0.0,1.0
1717777391.8871932,map,True,False,2,2,0.49874686716791977,0.49874686716791977,3.53818416595459,-2.7342946529388428,0.0,0.0,0.0,0.04988568573085597,0.9987549332412132,4.753888617090739,-4.111783691524208,0.6854969202007393,0.0,0.0,0.0,1.0
1717777391.93778,map,True,True,2,2,0.49874686716791977,0.49874686716791977,3.53818416595459,-2.7342946529388428,0.0,0.0,0.0,0.04988568573085597,0.9987549332412132,4.753888617090739,-4.111783691524208,0.6854969202007393,0.0,0.0,0.0,1.0
1717777391.9886332,map,True,True,2,2,0.49874686716791977,0.49874686716791977,3.53818416595459,-2.7342946529388428,0.0,0.0,0.0,0.04988568573085597,0.9987549332412132,4.753888617090739,-4.111783691524208,0.6854969202007393,0.0,0.0,0.0,1.0
1717777392.089354,map,True,False,2,2,0.49874686716791977,0.49874686716791977,3.53818416595459,-2.7342946529388428,0.0,0.0,0.0,0.04988568573085597,0.9987549332412132,4.753888617090739,-4.111783691524208,0.6854969202007393,0.0,0.0,0.0,1.0
1717777392.1397443,map,True,True,2,2,0.49874686716791977,0.49874686716791977,3.6157445907592773,-2.756042718887329,0.0,0.0,0.0,0.050339505566766245,0.9987321654626413,4.812605298705005,-4.169773356897308,0.6833943875737426,0.0,0.0,0.0,1.0
1717777392.4898043,map,True,True,2,2,0.49874686716791977,0.49874686716791977,3.6157445907592773,-2.756042718887329,0.0,0.0,0.0,0.050339505566766245,0.9987321654626413,4.8126671667960155,-4.098598357723947,0.760280499966894,0.0,0.0,0.0,1.0
1717777392.540615,map,True,False,2,2,0.49874686716791977,0.49874686716791977,3.6157445907592773,-2.756042718887329,0.0,0.0,0.0,0.050339505566766245,0.9987321654626413,4.8126671667960155,-4.098598357723947,0.760280499966894,0.0,0.0,0.0,1.0
1717777392.5904353,map,True,True,2,2,0.49874686716791977,0.49874686716791977,3.6157445907592773,-2.756042718887329,0.0,0.0,0.0,0.050339505566766245,0.9987321654626413,4.8126671667960155,-4.098598357723947,0.760280499966894,0.0,0.0,0.0,1.0
1717777392.6408525,map,True,False,2,2,0.49874686716791977,0.49874686716791977,3.6157445907592773,-2.756042718887329,0.0,0.0,0.0,0.050339505566766245,0.9987321654626413,4.8126671667960155,-4.098598357723947,0.760280499966894,0.0,0.0,0.0,1.0
1717777392.7394507,map,True,True,2,2,0.49874686716791977,0.49874686716791977,3.708188533782959,-2.796995162963867,0.0,0.0,0.0,0.05187284798209089,0.9986536976931792,4.8126671667960155,-4.098598357723947,0.760280499966894,0.0,0.0,0.0,1.0
1717777392.7900276,map,True,True,2,2,0.49874686716791977,0.49874686716791977,3.708188533782959,-2.796995162963867,0.0,0.0,0.0,0.05187284798209089,0.9986536976931792,4.8126671667960155,-4.098598357723947,0.760280499966894,0.0,0.0,0.0,1.0
1717777392.8405244,map,True,False,2,2,0.49874686716791977,0.49874686716791977,3.708188533782959,-2.796995162963867,0.0,0.0,0.0,0.05187284798209089,0.9986536976931792,4.8126671667960155,-4.098598357723947,0.760280499966894,0.0,0.0,0.0,1.0
1717777392.8921592,map,True,False,2,2,0.49874686716791977,0.49874686716791977,3.708188533782959,-2.796995162963867,0.0,0.0,0.0,0.05187284798209089,0.9986536976931792,4.8126671667960155,-4.098598357723947,0.760280499966894,0.0,0.0,0.0,1.0
1717777392.9907827,map,True,True,2,2,0.49874686716791977,0.49874686716791977,3.708188533782959,-2.796995162963867,0.0,0.0,0.0,0.05187284798209089,0.9986536976931792,4.8126671667960155,-4.098598357723947,0.760280499966894,0.0,0.0,0.0,1.0
1717777393.0408735,map,True,False,2,2,0.49874686716791977,0.49874686716791977,3.708188533782959,-2.796995162963867,0.0,0.0,0.0,0.05187284798209089,0.9986536976931792,4.8126671667960155,-4.098598357723947,0.760280499966894,0.0,0.0,0.0,1.0
1717777393.0915377,map,True,True,2,2,0.49874686716791977,0.49874686716791977,3.708188533782959,-2.796995162963867,0.0,0.0,0.0,0.05187284798209089,0.9986536976931792,4.8126671667960155,-4.098598357723947,0.760280499966894,0.0,0.0,0.0,1.0
1717777393.1439295,map,True,True,2,2,0.49874686716791977,0.49874686716791977,3.708188533782959,-2.796995162963867,0.0,0.0,0.0,0.05187284798209089,0.9986536976931792,4.8126671667960155,-4.098598357723947,0.760280499966894,0.0,0.0,0.0,1.0
