timestamp_sec,frame_id,game_played,yielding,player1discrete,player2discrete,player1yieldprob,player2yieldprob,player1_pose_x,player1_pose_y,player1_pose_z,player1_pose_orient_x,player1_pose_orient_y,player1_pose_orient_z,player1_pose_orient_w,player2_pose_x,player2_pose_y,player2_pose_z,player2_pose_orient_x,player2_pose_orient_y,player2_pose_orient_z,player2_pose_orient_w
1718119145.393623,map,True,False,5,7,0.0,0.0,1.4474079608917236,-1.5693283081054688,0.0,0.0,0.0,0.0406680450899005,0.9991727178616793,3.26778796531141,-8.352414873293055,0.6952066297479367,0.0,0.0,0.0,1.0
1718119145.4948611,map,True,False,5,7,0.0,0.0,1.4474079608917236,-1.5693283081054688,0.0,0.0,0.0,0.0406680450899005,0.9991727178616793,3.26778796531141,-8.352414873293055,0.6952066297479367,0.0,0.0,0.0,1.0
1718119145.5935802,map,True,False,5,7,0.0,0.0,1.4474079608917236,-1.5693283081054688,0.0,0.0,0.0,0.0406680450899005,0.9991727178616793,3.26778796531141,-8.352414873293055,0.6952066297479367,0.0,0.0,0.0,1.0
1718119145.6446874,map,True,False,5,7,0.0,0.0,1.4474079608917236,-1.5693283081054688,0.0,0.0,0.0,0.0406680450899005,0.9991727178616793,3.26778796531141,-8.352414873293055,0.6952066297479367,0.0,0.0,0.0,1.0
1718119145.6949332,map,True,False,5,7,0.0,0.0,1.4474079608917236,-1.5693283081054688,0.0,0.0,0.0,0.0406680450899005,0.9991727178616793,3.26778796531141,-8.352414873293055,0.6952066297479367,0.0,0.0,0.0,1.0
1718119145.7461815,map,True,True,5,5,0.612995793784914,0.612995793784914,1.4445092678070068,-1.5699267387390137,0.0,0.0,0.0,0.040868463208455136,0.9991645303172566,3.1686174523456754,-6.969485227453115,0.8283640652327544,0.0,0.0,0.0,1.0
1718119145.844695,map,True,True,5,5,0.612995793784914,0.612995793784914,1.4445092678070068,-1.5699267387390137,0.0,0.0,0.0,0.040868463208455136,0.9991645303172566,3.1686174523456754,-6.969485227453115,0.8283640652327544,0.0,0.0,0.0,1.0
1718119145.9483802,map,True,False,5,5,0.612995793784914,0.612995793784914,1.4445092678070068,-1.5699267387390137,0.0,0.0,0.0,0.040868463208455136,0.9991645303172566,3.1686174523456754,-6.969485227453115,0.8283640652327544,0.0,0.0,0.0,1.0
1718119145.998058,map,True,False,5,5,0.612995793784914,0.612995793784914,1.4445092678070068,-1.5699267387390137,0.0,0.0,0.0,0.040868463208455136,0.9991645303172566,3.1686174523456754,-6.969485227453115,0.8283640652327544,0.0,0.0,0.0,1.0
1718119146.0481749,map,True,False,5,5,0.612995793784914,0.612995793784914,1.4445092678070068,-1.5699267387390137,0.0,0.0,0.0,0.040868463208455136,0.9991645303172566,3.1686174523456754,-6.969485227453115,0.8283640652327544,0.0,0.0,0.0,1.0
1718119146.0986166,map,True,False,5,5,0.612995793784914,0.612995793784914,1.4445092678070068,-1.5699267387390137,0.0,0.0,0.0,0.040868463208455136,0.9991645303172566,3.1909094082275673,-6.77224157939173,0.908311289012373,0.0,0.0,0.0,1.0
1718119146.147072,map,True,True,5,5,0.612995793784914,0.612995793784914,1.4445092678070068,-1.5699267387390137,0.0,0.0,0.0,0.040868463208455136,0.9991645303172566,3.1968432973736056,-6.809897280395807,0.8553658291618587,0.0,0.0,0.0,1.0
1718119146.1972046,map,True,True,5,5,0.612995793784914,0.612995793784914,1.4445092678070068,-1.5699267387390137,0.0,0.0,0.0,0.040868463208455136,0.9991645303172566,3.1968432973736056,-6.809897280395807,0.8553658291618587,0.0,0.0,0.0,1.0
1718119146.4951625,map,True,False,5,5,0.612995793784914,0.612995793784914,1.4445092678070068,-1.5699267387390137,0.0,0.0,0.0,0.040868463208455136,0.9991645303172566,3.2040977496439433,-6.525354068436199,0.7869379075843859,0.0,0.0,0.0,1.0
1718119146.5462737,map,True,True,5,5,0.612995793784914,0.612995793784914,1.527259349822998,-1.5845627784729004,0.0,0.0,0.0,0.041186266036069154,0.9991514808136025,3.2040977496439433,-6.525354068436199,0.7869379075843859,0.0,0.0,0.0,1.0
1718119146.5952969,map,True,False,5,5,0.612995793784914,0.612995793784914,1.527259349822998,-1.5845627784729004,0.0,0.0,0.0,0.041186266036069154,0.9991514808136025,3.2040977496439433,-6.525354068436199,0.7869379075843859,0.0,0.0,0.0,1.0
1718119146.6458304,map,True,True,5,5,0.612995793784914,0.612995793784914,1.527259349822998,-1.5845627784729004,0.0,0.0,0.0,0.041186266036069154,0.9991514808136025,3.2040977496439433,-6.525354068436199,0.7869379075843859,0.0,0.0,0.0,1.0
1718119146.696658,map,True,True,5,5,0.612995793784914,0.612995793784914,1.527259349822998,-1.5845627784729004,0.0,0.0,0.0,0.041186266036069154,0.9991514808136025,3.2040977496439433,-6.525354068436199,0.7869379075843859,0.0,0.0,0.0,1.0
1718119146.7465997,map,True,True,5,5,0.612995793784914,0.612995793784914,1.527259349822998,-1.5845627784729004,0.0,0.0,0.0,0.041186266036069154,0.9991514808136025,3.2040977496439433,-6.525354068436199,0.7869379075843859,0.0,0.0,0.0,1.0
1718119146.7977865,map,True,True,5,5,0.612995793784914,0.612995793784914,1.527259349822998,-1.5845627784729004,0.0,0.0,0.0,0.041186266036069154,0.9991514808136025,3.251765308536301,-6.104892002026775,0.785286332600204,0.0,0.0,0.0,1.0
1718119146.8479986,map,True,False,5,5,0.612995793784914,0.612995793784914,1.527259349822998,-1.5845627784729004,0.0,0.0,0.0,0.041186266036069154,0.9991514808136025,3.251765308536301,-6.104892002026775,0.785286332600204,0.0,0.0,0.0,1.0
1718119146.9061239,map,True,True,5,5,0.612995793784914,0.612995793784914,1.527259349822998,-1.5845627784729004,0.0,0.0,0.0,0.041186266036069154,0.9991514808136025,3.251765308536301,-6.104892002026775,0.785286332600204,0.0,0.0,0.0,1.0
1718119146.9561532,map,True,True,5,5,0.612995793784914,0.612995793784914,1.527259349822998,-1.5845627784729004,0.0,0.0,0.0,0.041186266036069154,0.9991514808136025,3.251765308536301,-6.104892002026775,0.785286332600204,0.0,0.0,0.0,1.0
1718119147.0060549,map,True,False,5,5,0.612995793784914,0.612995793784914,1.527259349822998,-1.5845627784729004,0.0,0.0,0.0,0.041186266036069154,0.9991514808136025,3.251765308536301,-6.104892002026775,0.785286332600204,0.0,0.0,0.0,1.0
1718119147.104911,map,True,False,5,4,0.0,0.0,1.527259349822998,-1.5845627784729004,0.0,0.0,0.0,0.041186266036069154,0.9991514808136025,3.2694711648305512,-5.848840737618158,0.7472713069106103,0.0,0.0,0.0,1.0
1718119147.1557438,map,True,False,5,4,0.0,0.0,1.527259349822998,-1.5845627784729004,0.0,0.0,0.0,0.041186266036069154,0.9991514808136025,3.25427620425988,-5.7353166395516935,0.7518216815183512,0.0,0.0,0.0,1.0
1718119147.5059857,map,True,False,5,4,0.0,0.0,1.6102585792541504,-1.606933355331421,0.0,0.0,0.0,0.04147004485396112,0.9991397435715865,3.319679957466183,-5.667963421780564,0.7756811234133417,0.0,0.0,0.0,1.0
1718119147.5560348,map,True,False,5,4,0.0,0.0,1.6102585792541504,-1.606933355331421,0.0,0.0,0.0,0.04147004485396112,0.9991397435715865,3.319679957466183,-5.667963421780564,0.7756811234133417,0.0,0.0,0.0,1.0
1718119147.658366,map,True,False,5,4,0.0,0.0,1.6102585792541504,-1.606933355331421,0.0,0.0,0.0,0.04147004485396112,0.9991397435715865,3.319679957466183,-5.667963421780564,0.7756811234133417,0.0,0.0,0.0,1.0
1718119147.7564447,map,True,False,5,4,0.0,0.0,1.6102585792541504,-1.606933355331421,0.0,0.0,0.0,0.04147004485396112,0.9991397435715865,3.352646941421881,-5.387615502610138,0.7519403741379039,0.0,0.0,0.0,1.0
1718119147.85612,map,True,False,5,4,0.0,0.0,1.6102585792541504,-1.606933355331421,0.0,0.0,0.0,0.04147004485396112,0.9991397435715865,3.3558037307184594,-5.275677447412265,0.761375373647898,0.0,0.0,0.0,1.0
1718119147.9573333,map,True,False,5,4,0.0,0.0,1.6102585792541504,-1.606933355331421,0.0,0.0,0.0,0.04147004485396112,0.9991397435715865,3.3558037307184594,-5.275677447412265,0.761375373647898,0.0,0.0,0.0,1.0
1718119148.00803,map,True,False,5,4,0.0,0.0,1.6102585792541504,-1.606933355331421,0.0,0.0,0.0,0.04147004485396112,0.9991397435715865,3.3558037307184594,-5.275677447412265,0.761375373647898,0.0,0.0,0.0,1.0
1718119148.1080222,map,True,False,5,3,0.0,0.0,1.6102585792541504,-1.606933355331421,0.0,0.0,0.0,0.04147004485396112,0.9991397435715865,3.301922764437129,-4.808062259322512,0.7315490781706542,0.0,0.0,0.0,1.0
1718119148.1583338,map,True,False,4,3,0.0,0.0,1.7034387588500977,-1.6242456436157227,0.0,0.0,0.0,0.04184473426357737,0.9991241285009365,3.333454904538521,-4.873589092248263,0.7373460895561599,0.0,0.0,0.0,1.0
1718119148.2091033,map,True,False,4,3,0.0,0.0,1.7034387588500977,-1.6242456436157227,0.0,0.0,0.0,0.04184473426357737,0.9991241285009365,3.333454904538521,-4.873589092248263,0.7373460895561599,0.0,0.0,0.0,1.0
1718119148.4657788,map,True,False,4,3,0.0,0.0,1.7034387588500977,-1.6242456436157227,0.0,0.0,0.0,0.04184473426357737,0.9991241285009365,3.362766705473569,-4.756538543397593,0.7452386629011905,0.0,0.0,0.0,1.0
1718119148.5178847,map,True,False,4,3,0.0,0.0,1.7034387588500977,-1.6242456436157227,0.0,0.0,0.0,0.04184473426357737,0.9991241285009365,3.41267873185806,-4.751291044390701,0.7549582358210198,0.0,0.0,0.0,1.0
1718119148.5649593,map,True,False,4,3,0.0,0.0,1.7034387588500977,-1.6242456436157227,0.0,0.0,0.0,0.04184473426357737,0.9991241285009365,3.41267873185806,-4.751291044390701,0.7549582358210198,0.0,0.0,0.0,1.0
1718119148.6188457,map,True,False,4,3,0.0,0.0,1.7034387588500977,-1.6242456436157227,0.0,0.0,0.0,0.04184473426357737,0.9991241285009365,3.41267873185806,-4.751291044390701,0.7549582358210198,0.0,0.0,0.0,1.0
1718119148.718075,map,True,False,4,3,0.0,0.0,1.7034387588500977,-1.6242456436157227,0.0,0.0,0.0,0.04184473426357737,0.9991241285009365,3.41267873185806,-4.751291044390701,0.7549582358210198,0.0,0.0,0.0,1.0
1718119148.7680173,map,True,False,4,3,0.0,0.0,1.7034387588500977,-1.6242456436157227,0.0,0.0,0.0,0.04184473426357737,0.9991241285009365,3.41267873185806,-4.751291044390701,0.7549582358210198,0.0,0.0,0.0,1.0
1718119148.867189,map,True,False,4,3,0.0,0.0,1.7143070697784424,-1.6292753219604492,0.0,0.0,0.0,0.0419016873627492,0.9991217422222247,3.4574791658190955,-4.343052743411617,0.7330922926586098,0.0,0.0,0.0,1.0
1718119148.917762,map,True,False,4,3,0.0,0.0,1.7143070697784424,-1.6292753219604492,0.0,0.0,0.0,0.0419016873627492,0.9991217422222247,3.4574791658190955,-4.343052743411617,0.7330922926586098,0.0,0.0,0.0,1.0
1718119148.9682894,map,True,False,4,3,0.0,0.0,1.7143070697784424,-1.6292753219604492,0.0,0.0,0.0,0.0419016873627492,0.9991217422222247,3.4574791658190955,-4.343052743411617,0.7330922926586098,0.0,0.0,0.0,1.0
1718119149.033534,map,True,False,4,3,0.0,0.0,1.7143070697784424,-1.6292753219604492,0.0,0.0,0.0,0.0419016873627492,0.9991217422222247,3.4574791658190955,-4.343052743411617,0.7330922926586098,0.0,0.0,0.0,1.0
1718119149.1180482,map,True,False,4,3,0.0,0.0,1.7143070697784424,-1.6292753219604492,0.0,0.0,0.0,0.0419016873627492,0.9991217422222247,3.4559493418163463,-4.072667031845313,0.7198644929604165,0.0,0.0,0.0,1.0
1718119149.168459,map,True,False,4,3,0.0,0.0,1.7143070697784424,-1.6292753219604492,0.0,0.0,0.0,0.0419016873627492,0.9991217422222247,3.468748741393546,-4.050751105940526,0.7041580988002558,0.0,0.0,0.0,1.0
1718119149.2184834,map,True,False,4,3,0.0,0.0,1.7143070697784424,-1.6292753219604492,0.0,0.0,0.0,0.0419016873627492,0.9991217422222247,3.468748741393546,-4.050751105940526,0.7041580988002558,0.0,0.0,0.0,1.0
1718119149.4694228,map,True,False,4,3,0.0,0.0,1.9302263259887695,-1.6814494132995605,0.0,0.0,0.0,0.04306026220740886,0.9990724792077535,3.52789288605005,-3.9882256327039403,0.7147102612106047,0.0,0.0,0.0,1.0
1718119149.5198798,map,True,False,4,2,0.0,0.0,1.9302263259887695,-1.6814494132995605,0.0,0.0,0.0,0.04306026220740886,0.9990724792077535,3.5199973560362805,-3.924410918994411,0.7211766861298987,0.0,0.0,0.0,1.0
1718119149.5713253,map,True,False,4,2,0.0,0.0,1.9302263259887695,-1.6814494132995605,0.0,0.0,0.0,0.04306026220740886,0.9990724792077535,3.5199973560362805,-3.924410918994411,0.7211766861298987,0.0,0.0,0.0,1.0
1718119149.6739511,map,True,False,4,2,0.0,0.0,1.9302263259887695,-1.6814494132995605,0.0,0.0,0.0,0.04306026220740886,0.9990724792077535,3.5199973560362805,-3.924410918994411,0.7211766861298987,0.0,0.0,0.0,1.0
1718119149.7709298,map,True,False,4,2,0.0,0.0,1.9302263259887695,-1.6814494132995605,0.0,0.0,0.0,0.04306026220740886,0.9990724792077535,3.5199973560362805,-3.924410918994411,0.7211766861298987,0.0,0.0,0.0,1.0
1718119149.8220477,map,True,False,4,2,0.0,0.0,1.9302263259887695,-1.6814494132995605,0.0,0.0,0.0,0.04306026220740886,0.9990724792077535,3.502688185263299,-3.570581153710404,0.7056320712282362,0.0,0.0,0.0,1.0
1718119149.9219139,map,True,False,4,2,0.0,0.0,1.9302263259887695,-1.6814494132995605,0.0,0.0,0.0,0.04306026220740886,0.9990724792077535,3.601279351879075,-3.69808738793756,0.6905583856133559,0.0,0.0,0.0,1.0
1718119149.971532,map,True,False,4,2,0.0,0.0,1.9302263259887695,-1.6814494132995605,0.0,0.0,0.0,0.04306026220740886,0.9990724792077535,3.601279351879075,-3.69808738793756,0.6905583856133559,0.0,0.0,0.0,1.0
1718119150.0216355,map,True,False,4,2,0.0,0.0,1.9302263259887695,-1.6814494132995605,0.0,0.0,0.0,0.04306026220740886,0.9990724792077535,3.601279351879075,-3.69808738793756,0.6905583856133559,0.0,0.0,0.0,1.0
1718119150.07303,map,True,False,4,2,0.0,0.0,1.9302263259887695,-1.6814494132995605,0.0,0.0,0.0,0.04306026220740886,0.9990724792077535,3.601279351879075,-3.69808738793756,0.6905583856133559,0.0,0.0,0.0,1.0
1718119150.1731288,map,True,False,3,2,0.0,0.0,2.046855926513672,-1.712540864944458,0.0,0.0,0.0,0.04345419345278681,0.9990554163075818,3.6270312644198683,-3.3656607105490886,0.6829463332498517,0.0,0.0,0.0,1.0
1718119150.2231858,map,True,False,3,2,0.0,0.0,2.046855926513672,-1.712540864944458,0.0,0.0,0.0,0.04345419345278681,0.9990554163075818,3.6270312644198683,-3.3656607105490886,0.6829463332498517,0.0,0.0,0.0,1.0
1718119150.4763205,map,True,False,3,2,0.0,0.0,2.046855926513672,-1.712540864944458,0.0,0.0,0.0,0.04345419345278681,0.9990554163075818,3.727206847246897,-3.2059719373402027,0.6851499355549988,0.0,0.0,0.0,1.0
1718119150.525326,map,True,False,3,2,0.0,0.0,2.046855926513672,-1.712540864944458,0.0,0.0,0.0,0.04345419345278681,0.9990554163075818,3.709924322701278,-3.121281961040881,0.6848504230791581,0.0,0.0,0.0,1.0
1718119150.5766642,map,True,False,3,2,0.0,0.0,2.046855926513672,-1.712540864944458,0.0,0.0,0.0,0.04345419345278681,0.9990554163075818,3.709924322701278,-3.121281961040881,0.6848504230791581,0.0,0.0,0.0,1.0
1718119150.628753,map,True,False,3,2,0.0,0.0,2.046855926513672,-1.712540864944458,0.0,0.0,0.0,0.04345419345278681,0.9990554163075818,3.709924322701278,-3.121281961040881,0.6848504230791581,0.0,0.0,0.0,1.0
1718119150.6768253,map,True,False,3,2,0.0,0.0,2.046855926513672,-1.712540864944458,0.0,0.0,0.0,0.04345419345278681,0.9990554163075818,3.709924322701278,-3.121281961040881,0.6848504230791581,0.0,0.0,0.0,1.0
1718119150.7270923,map,True,False,3,2,0.0,0.0,2.046855926513672,-1.712540864944458,0.0,0.0,0.0,0.04345419345278681,0.9990554163075818,3.709924322701278,-3.121281961040881,0.6848504230791581,0.0,0.0,0.0,1.0
1718119150.7776916,map,True,False,3,2,0.0,0.0,2.046855926513672,-1.712540864944458,0.0,0.0,0.0,0.04345419345278681,0.9990554163075818,3.709924322701278,-3.121281961040881,0.6848504230791581,0.0,0.0,0.0,1.0
1718119150.8779778,map,True,False,3,1,0.0,0.0,2.1613407135009766,-1.731212854385376,0.0,0.0,0.0,0.043876983594586354,0.9990369361420414,3.713127097724065,-2.702325362691524,0.6832543661859762,0.0,0.0,0.0,1.0
1718119150.9288113,map,True,False,3,1,0.0,0.0,2.1613407135009766,-1.731212854385376,0.0,0.0,0.0,0.043876983594586354,0.9990369361420414,3.713127097724065,-2.702325362691524,0.6832543661859762,0.0,0.0,0.0,1.0
1718119151.029678,map,True,False,3,1,0.0,0.0,2.1613407135009766,-1.731212854385376,0.0,0.0,0.0,0.043876983594586354,0.9990369361420414,3.713127097724065,-2.702325362691524,0.6832543661859762,0.0,0.0,0.0,1.0
1718119151.0802097,map,True,False,3,1,0.0,0.0,2.1613407135009766,-1.731212854385376,0.0,0.0,0.0,0.043876983594586354,0.9990369361420414,3.713127097724065,-2.702325362691524,0.6832543661859762,0.0,0.0,0.0,1.0
1718119151.129301,map,True,False,3,1,0.0,0.0,2.1613407135009766,-1.731212854385376,0.0,0.0,0.0,0.043876983594586354,0.9990369361420414,3.713127097724065,-2.702325362691524,0.6832543661859762,0.0,0.0,0.0,1.0
1718119151.1800594,map,True,False,3,1,0.0,0.0,2.1613407135009766,-1.731212854385376,0.0,0.0,0.0,0.043876983594586354,0.9990369361420414,3.87265188328539,-2.5548519956008455,0.6824798293138136,0.0,0.0,0.0,1.0
1718119151.5821242,map,True,False,3,5,0.0,0.0,2.308687686920166,-1.7602699995040894,0.0,0.0,0.0,0.04402910695450436,0.9990302539641368,6.367505403491416,-4.978934978157418,0.7168154292765698,0.0,0.0,0.0,1.0
1718119151.6811113,map,True,False,3,5,0.0,0.0,2.308687686920166,-1.7602699995040894,0.0,0.0,0.0,0.04402910695450436,0.9990302539641368,6.367505403491416,-4.978934978157418,0.7168154292765698,0.0,0.0,0.0,1.0
1718119151.7816741,map,True,False,3,5,0.0,0.0,2.308687686920166,-1.7602699995040894,0.0,0.0,0.0,0.04402910695450436,0.9990302539641368,6.367505403491416,-4.978934978157418,0.7168154292765698,0.0,0.0,0.0,1.0
1718119151.8312173,map,True,False,3,5,0.0,0.0,2.308687686920166,-1.7602699995040894,0.0,0.0,0.0,0.04402910695450436,0.9990302539641368,6.367505403491416,-4.978934978157418,0.7168154292765698,0.0,0.0,0.0,1.0
1718119151.8818886,map,True,False,3,8,0.0,0.0,2.308687686920166,-1.7602699995040894,0.0,0.0,0.0,0.04402910695450436,0.9990302539641368,9.644945700738209,-5.709737390101238,0.6735805864443318,0.0,0.0,0.0,1.0
1718119151.9329586,map,True,False,3,8,0.0,0.0,2.308687686920166,-1.7602699995040894,0.0,0.0,0.0,0.04402910695450436,0.9990302539641368,9.644945700738209,-5.709737390101238,0.6735805864443318,0.0,0.0,0.0,1.0
1718119151.9833221,map,True,False,2,8,0.0,0.0,2.404916763305664,-1.786700963973999,0.0,0.0,0.0,0.04511423119102711,0.9989818366703056,9.644945700738209,-5.709737390101238,0.6735805864443318,0.0,0.0,0.0,1.0
1718119152.0328937,map,True,False,2,8,0.0,0.0,2.404916763305664,-1.786700963973999,0.0,0.0,0.0,0.04511423119102711,0.9989818366703056,9.644945700738209,-5.709737390101238,0.6735805864443318,0.0,0.0,0.0,1.0
1718119152.0850906,map,True,False,2,8,0.0,0.0,2.404916763305664,-1.786700963973999,0.0,0.0,0.0,0.04511423119102711,0.9989818366703056,9.644945700738209,-5.709737390101238,0.6735805864443318,0.0,0.0,0.0,1.0
1718119152.133811,map,True,False,2,8,0.0,0.0,2.404916763305664,-1.786700963973999,0.0,0.0,0.0,0.04511423119102711,0.9989818366703056,9.644945700738209,-5.709737390101238,0.6735805864443318,0.0,0.0,0.0,1.0
1718119152.2338057,map,True,False,2,8,0.0,0.0,2.404916763305664,-1.786700963973999,0.0,0.0,0.0,0.04511423119102711,0.9989818366703056,9.644945700738209,-5.709737390101238,0.6735805864443318,0.0,0.0,0.0,1.0
