car_pos_meter , car_pos_cell, car_speed, ped_pos_meter, ped_pos_cell, ped_speed
-5.125, 5, 1, 3.995821, 5, 1
-4.896749, 4, 2, 3.809742, 4, 1
-3.855504, 3, 2, 3.323764, 4, 1
-2.814259, 2, 2, 3.102246, 4, 1
-1.773012, 1, 2, 2.925338, 3, 1
-0.7317604, 0, 2, 2.888156, 3, 1
0.3094899, 0, 2, 2.877778, 3, 1
1.350741, -1, 2, 2.831503, 3, 1
2.39199, -2, 2, 2.842256, 3, 1
3.433236, -3, 2, 2.438213, 3, 1
4.474481, -4, 2, 1.552267, 2, 1
5.515727, -5, 2, 0.5805614, 0, 1
6.556972, -6, 2, -0.3231306, 0, 1
7.598217, -7, 2, -1.078489, -1, 1
8.639477, -8, 2, -1.100618, -1, 1
9.680746, -9, 2, -1.101671, -1, 1
