car_pos_meter , car_pos_cell, car_speed, ped_pos_meter, ped_pos_cell, ped_speed
-41, 40, 2, 4.06811, 40, 1

-40.8334, 39, 2, 4.06811, 40, 1

-40.6668, 39, 2, 4.068002, 40, 1

-40.5002, 39, 2, 4.068002, 40, 1

-40.3336, 39, 2, 4.068002, 40, 1

-40.167, 39, 2, 4.068002, 40, 1

-40.0004, 39, 2, 4.068002, 40, 1

-39.83381, 38, 2, 4.054102, 40, 1

-39.66721, 38, 2, 4.054102, 40, 1

-39.50061, 38, 2, 4.050084, 40, 1

-39.33401, 38, 2, 4.048995, 40, 1

-39.16741, 38, 2, 4.048305, 40, 1

-39.00081, 38, 2, 4.047584, 40, 1

-38.83421, 37, 2, 4.046694, 40, 1

-38.66761, 37, 2, 4.045547, 40, 1

-38.50101, 37, 2, 4.044766, 40, 1

-38.33441, 37, 2, 4.042922, 40, 1

-38.16781, 37, 2, 4.041035, 40, 1

-38.00121, 37, 2, 4.038703, 40, 1

-37.83461, 36, 2, 4.035933, 40, 1

-37.66801, 36, 2, 4.034102, 40, 1

-37.50142, 36, 2, 4.029859, 40, 1

-37.33482, 36, 2, 4.025012, 40, 1

-37.16822, 36, 2, 4.019876, 40, 1

-37.00162, 36, 2, 4.017166, 40, 1

-36.83502, 35, 2, 4.011859, 40, 1

-36.66842, 35, 2, 4.00635, 40, 1

-36.50182, 35, 2, 4.000276, 40, 1

-36.33522, 35, 2, 3.993728, 39, 1

-36.16862, 35, 2, 3.990288, 39, 1

-36.00202, 35, 2, 3.983108, 39, 1

-35.83542, 34, 2, 3.976435, 39, 1

-35.66882, 34, 2, 3.969478, 39, 1

-35.50222, 34, 2, 3.962213, 39, 1

-35.33562, 34, 2, 3.958596, 39, 1

-35.16903, 34, 2, 3.9513, 39, 1

-35.00243, 34, 2, 3.944054, 39, 1

-34.83583, 33, 2, 3.937088, 39, 1

-34.66923, 33, 2, 3.930605, 39, 1

-34.50263, 33, 2, 3.927355, 39, 1

-34.33603, 33, 2, 3.921096, 39, 1

-34.16943, 33, 2, 3.91478, 39, 1

-34.00283, 33, 2, 3.908158, 39, 1

-33.83623, 32, 2, 3.901655, 39, 1

-33.66963, 32, 2, 3.898681, 38, 1

-33.50303, 32, 2, 3.892352, 38, 1

-33.33643, 32, 2, 3.885307, 38, 1

-33.16983, 32, 2, 3.881831, 38, 1

-33.00323, 32, 2, 3.875194, 38, 1

-32.83664, 31, 2, 3.869363, 38, 1

-32.67004, 31, 2, 3.863481, 38, 1

-32.50344, 31, 2, 3.857828, 38, 1

-32.33684, 31, 2, 3.854669, 38, 1

-32.17024, 31, 2, 3.848512, 38, 1

-32.00364, 31, 2, 3.842299, 38, 1

-31.83704, 30, 2, 3.835895, 38, 1

-31.67044, 30, 2, 3.829287, 38, 1

-31.50384, 30, 2, 3.825624, 38, 1

-31.33724, 30, 2, 3.818802, 38, 1

-31.17064, 30, 2, 3.811673, 38, 1

-31.00404, 30, 2, 3.804084, 38, 1

-30.83744, 29, 2, 3.796456, 37, 1

-30.67085, 29, 2, 3.792343, 37, 1

-30.50425, 29, 2, 3.784272, 37, 1

-30.33765, 29, 2, 3.775955, 37, 1

-30.17105, 29, 2, 3.767336, 37, 1

-30.00445, 29, 2, 3.758155, 37, 1

-29.83785, 28, 2, 3.75329, 37, 1

-29.67125, 28, 2, 3.743508, 37, 1

-29.50465, 28, 2, 3.733621, 37, 1

-29.33805, 28, 2, 3.723136, 37, 1

-29.17145, 28, 2, 3.712632, 37, 1

-29.00485, 28, 2, 3.70712, 37, 1

-28.83825, 27, 2, 3.695697, 36, 1

-28.67165, 27, 2, 3.684466, 36, 1

-28.50505, 27, 2, 3.672783, 36, 1

-28.33846, 27, 2, 3.660617, 36, 1

-28.17186, 27, 2, 3.654294, 36, 1

-28.00526, 27, 2, 3.641569, 36, 1

-27.83866, 26, 2, 3.628444, 36, 1

-27.67206, 26, 2, 3.615014, 36, 1

-27.50546, 26, 2, 3.601797, 36, 1

-27.33886, 26, 2, 3.58865, 35, 1

-27.17226, 26, 2, 3.58226, 35, 1

-27.00566, 26, 2, 3.569195, 35, 1

-26.83906, 25, 2, 3.556099, 35, 1

-26.67246, 25, 2, 3.543308, 35, 1

-26.50586, 25, 2, 3.530726, 35, 1

-26.33926, 25, 2, 3.524638, 35, 1

-26.17266, 25, 2, 3.512474, 35, 1

-26.00607, 25, 2, 3.500047, 35, 1

-25.83947, 24, 2, 3.486422, 34, 1

-25.67287, 24, 2, 3.479777, 34, 1

-25.50627, 24, 2, 3.466149, 34, 1

-25.33967, 24, 2, 3.452432, 34, 1

-25.17307, 24, 2, 3.438487, 34, 1

-25.00647, 24, 2, 3.424905, 34, 1

-24.83987, 23, 2, 3.41129, 34, 1

-24.67327, 23, 2, 3.404405, 34, 1

-24.50667, 23, 2, 3.390671, 33, 1

-24.34007, 23, 2, 3.376654, 33, 1

-24.17347, 23, 2, 3.363362, 33, 1

-24.00687, 23, 2, 3.350554, 33, 1

-23.84027, 22, 2, 3.34436, 33, 1

-23.67368, 22, 2, 3.332026, 33, 1

-23.50708, 22, 2, 3.319556, 33, 1

-23.34048, 22, 2, 3.306918, 33, 1

-23.17388, 22, 2, 3.294282, 32, 1

-23.00728, 22, 2, 3.287996, 32, 1

-22.84068, 21, 2, 3.274832, 32, 1

-22.67408, 21, 2, 3.261287, 32, 1

-22.50748, 21, 2, 3.247508, 32, 1

-22.34088, 21, 2, 3.233463, 32, 1

-22.17428, 21, 2, 3.226397, 32, 1

-22.00768, 21, 2, 3.211909, 32, 1

-21.84108, 20, 2, 3.196972, 31, 1

-21.67448, 20, 2, 3.181969, 31, 1

-21.50788, 20, 2, 3.167056, 31, 1

-21.34129, 20, 2, 3.159449, 31, 1

-21.17469, 20, 2, 3.14472, 31, 1

-21.00809, 20, 2, 3.130642, 31, 1

-20.84149, 19, 2, 3.116765, 31, 1

-20.67489, 19, 2, 3.109779, 31, 1

-20.50829, 19, 2, 3.095541, 30, 1

-20.34169, 19, 2, 3.081621, 30, 1

-20.17509, 19, 2, 3.067624, 30, 1

-20.00849, 19, 2, 3.053246, 30, 1

-19.84189, 18, 2, 3.046309, 30, 1

-19.67529, 18, 2, 3.032325, 30, 1

-19.50869, 18, 2, 3.018295, 30, 1

-19.34209, 18, 2, 3.004299, 30, 1

-19.1755, 18, 2, 2.990822, 29, 1

-19.0089, 18, 2, 2.984009, 29, 1

-18.8423, 17, 2, 2.970866, 29, 1

-18.6757, 17, 2, 2.958549, 29, 1

-18.5091, 17, 2, 2.947286, 29, 1

-18.3425, 17, 2, 2.937457, 29, 1

-18.1759, 17, 2, 2.927487, 29, 1

-18.0093, 17, 2, 2.922316, 29, 1

-17.8427, 16, 2, 2.912289, 29, 1

-17.6761, 16, 2, 2.902744, 29, 1

-17.5095, 16, 2, 2.894247, 28, 1

-17.3429, 16, 2, 2.886863, 28, 1

-17.1763, 16, 2, 2.882913, 28, 1

-17.0097, 16, 2, 2.876686, 28, 1

-16.84311, 15, 2, 2.87067, 28, 1

-16.67651, 15, 2, 2.864267, 28, 1

-16.50991, 15, 2, 2.86114, 28, 1

-16.34331, 15, 2, 2.85443, 28, 1

-16.17671, 15, 2, 2.847597, 28, 1

-16.01011, 15, 2, 2.839988, 28, 1

-15.84351, 14, 2, 2.832105, 28, 1

-15.67691, 14, 2, 2.827927, 28, 1

-15.51031, 14, 2, 2.819313, 28, 1

-15.34371, 14, 2, 2.810327, 28, 1

-15.17711, 14, 2, 2.800745, 28, 1

-15.01051, 14, 2, 2.790788, 27, 1

-14.84391, 13, 2, 2.785674, 27, 1

-14.67731, 13, 2, 2.775727, 27, 1

-14.51071, 13, 2, 2.765765, 27, 1

-14.34411, 13, 2, 2.756375, 27, 1

-14.17751, 13, 2, 2.746813, 27, 1

-14.01091, 13, 2, 2.74213, 27, 1

-13.84431, 12, 2, 2.73305, 27, 1

-13.6777, 12, 2, 2.724175, 27, 1

-13.5111, 12, 2, 2.71521, 27, 1

-13.3445, 12, 2, 2.705917, 27, 1

-13.1779, 12, 2, 2.69677, 26, 1

-13.0113, 12, 2, 2.692414, 26, 1

-12.8447, 11, 2, 2.683352, 26, 1

-12.6781, 11, 2, 2.674271, 26, 1

-12.5115, 11, 2, 2.665254, 26, 1

-12.3449, 11, 2, 2.656062, 26, 1

-12.1783, 11, 2, 2.651274, 26, 1

-12.0117, 11, 2, 2.641937, 26, 1

-11.8451, 10, 2, 2.63286, 26, 1

-11.6785, 10, 2, 2.624243, 26, 1

-11.5119, 10, 2, 2.615829, 26, 1

-11.3453, 10, 2, 2.611851, 26, 1

-11.1787, 10, 2, 2.60434, 26, 1

-11.0121, 10, 2, 2.597081, 25, 1

-10.8455, 9, 2, 2.590272, 25, 1

-10.6789, 9, 2, 2.583622, 25, 1

-10.5123, 9, 2, 2.580087, 25, 1

-10.3457, 9, 2, 2.57399, 25, 1

-10.1791, 9, 2, 2.567907, 25, 1

-10.0125, 9, 2, 2.562971, 25, 1

-9.8459, 8, 2, 2.558098, 25, 1

-9.679299, 8, 2, 2.555729, 25, 1

-9.512699, 8, 2, 2.551099, 25, 1

-9.346099, 8, 2, 2.54592, 25, 1

-9.179499, 8, 2, 2.541763, 25, 1

-9.012898, 8, 2, 2.537701, 25, 1

-8.846298, 7, 2, 2.535936, 25, 1

-8.679698, 7, 2, 2.532282, 25, 1

-8.513098, 7, 2, 2.528474, 25, 1

-8.346498, 7, 2, 2.525158, 25, 1

-8.179897, 7, 2, 2.521652, 25, 1

-8.013297, 7, 2, 2.519808, 25, 1

-7.846697, 6, 2, 2.51649, 25, 1

-7.680097, 6, 2, 2.513262, 25, 1

-7.513496, 6, 2, 2.510176, 25, 1

-7.346896, 6, 2, 2.50743, 25, 1

-7.180296, 6, 2, 2.506279, 25, 1

-7.013696, 6, 2, 2.503682, 25, 1

-6.847095, 5, 2, 2.501058, 25, 1

-6.680495, 5, 2, 2.498845, 24, 1

-6.513895, 5, 2, 2.496429, 24, 1

-6.347295, 5, 2, 2.495163, 24, 1

-6.180695, 5, 2, 2.492877, 24, 1

-6.014094, 5, 2, 2.490828, 24, 1

-5.847494, 4, 2, 2.489133, 24, 1

-5.680894, 4, 2, 2.487315, 24, 1

-5.514294, 4, 2, 2.486695, 24, 1

-5.347693, 4, 2, 2.485374, 24, 1

-5.181093, 4, 2, 2.48381, 24, 1

-5.014493, 4, 2, 2.482005, 24, 1

-4.847893, 3, 2, 2.480147, 24, 1

-4.681293, 3, 2, 2.479513, 24, 1

-4.514692, 3, 2, 2.477902, 24, 1

-4.348092, 3, 2, 2.476147, 24, 1

-4.181492, 3, 2, 2.474586, 24, 1

-4.014892, 3, 2, 2.473161, 24, 1

-3.848292, 2, 2, 2.472687, 24, 1

-3.681692, 2, 2, 2.471283, 24, 1

-3.515092, 2, 2, 2.469829, 24, 1

-3.348492, 2, 2, 2.468971, 24, 1

-3.181892, 2, 2, 2.468029, 24, 1

-3.015292, 2, 2, 2.467611, 24, 1

-2.848692, 1, 2, 2.46713, 24, 1

-2.682092, 1, 2, 2.46527, 24, 1

-2.515492, 1, 2, 2.463734, 24, 1

-2.348892, 1, 2, 2.46176, 24, 1

-2.182292, 1, 2, 2.459379, 24, 1

-2.015692, 1, 2, 2.457211, 24, 1

-1.849092, 0, 2, 2.455985, 24, 1

-1.682492, 0, 2, 2.453321, 24, 1

-1.515892, 0, 2, 2.449996, 24, 1

-1.349292, 0, 2, 2.446771, 24, 1

-1.182692, 0, 2, 2.443692, 24, 1

-1.016092, 0, 2, 2.442013, 24, 1

-0.8494918, -1, 2, 2.43892, 24, 1

-0.6828918, -1, 2, 2.43576, 24, 1

-0.5162919, -1, 2, 2.432876, 24, 1

-0.3496919, -1, 2, 2.430452, 24, 1

-0.1830919, -1, 2, 2.429589, 24, 1

-0.01649189, -1, 2, 2.427632, 24, 1

0.1501081, -1, 2, 2.426634, 24, 1

0.3167081, -1, 2, 2.42634, 24, 1

0.4833081, -1, 2, 2.426109, 24, 1

0.6499081, -1, 2, 2.425927, 24, 1

0.8165081, -1, 2, 2.427396, 24, 1

0.983108, -1, 2, 2.429312, 24, 1

1.149708, -2, 2, 2.431462, 24, 1

1.316308, -2, 2, 2.433059, 24, 1

1.482908, -2, 2, 2.436611, 24, 1

1.649508, -2, 2, 2.440217, 24, 1

1.816108, -2, 2, 2.443878, 24, 1

1.982708, -2, 2, 2.445461, 24, 1

2.149308, -3, 2, 2.449121, 24, 1

2.315908, -3, 2, 2.452379, 24, 1

2.482508, -3, 2, 2.455433, 24, 1

2.649108, -3, 2, 2.45859, 24, 1

2.815708, -3, 2, 2.459972, 24, 1

2.982308, -3, 2, 2.462867, 24, 1

3.148908, -4, 2, 2.465598, 24, 1

3.315508, -4, 2, 2.468112, 24, 1

3.482108, -4, 2, 2.470288, 24, 1

3.648708, -4, 2, 2.471111, 24, 1

3.815308, -4, 2, 2.47272, 24, 1

3.981908, -4, 2, 2.474704, 24, 1

4.148508, -5, 2, 2.475047, 24, 1

4.315108, -5, 2, 2.475434, 24, 1

4.481709, -5, 2, 2.475385, 24, 1

4.648309, -5, 2, 2.475285, 24, 1

4.814909, -5, 2, 2.474978, 24, 1

4.981509, -5, 2, 2.473943, 24, 1

5.148109, -6, 2, 2.472344, 24, 1

5.31471, -6, 2, 2.471488, 24, 1

5.48131, -6, 2, 2.469352, 24, 1

5.64791, -6, 2, 2.4667, 24, 1

5.81451, -6, 2, 2.463301, 24, 1

5.981111, -6, 2, 2.459814, 24, 1

6.147711, -7, 2, 2.457478, 24, 1

6.314311, -7, 2, 2.452938, 24, 1

6.480911, -7, 2, 2.447106, 24, 1

6.647511, -7, 2, 2.44057, 24, 1

6.814112, -7, 2, 2.433266, 24, 1

6.980712, -7, 2, 2.429329, 24, 1

7.147312, -8, 2, 2.42039, 24, 1

7.313912, -8, 2, 2.412004, 24, 1

7.480513, -8, 2, 2.403315, 24, 1

7.647113, -8, 2, 2.395804, 23, 1

7.813713, -8, 2, 2.392133, 23, 1

7.980313, -8, 2, 2.38511, 23, 1

8.146914, -9, 2, 2.377766, 23, 1

8.313514, -9, 2, 2.369969, 23, 1

8.480114, -9, 2, 2.36173, 23, 1

8.646714, -9, 2, 2.358005, 23, 1

8.813314, -9, 2, 2.350237, 23, 1

8.979915, -9, 2, 2.342963, 23, 1

9.146515, -10, 2, 2.335362, 23, 1

9.313115, -10, 2, 2.328445, 23, 1

9.479715, -10, 2, 2.325427, 23, 1

9.646316, -10, 2, 2.318609, 23, 1

9.812916, -10, 2, 2.311663, 23, 1

9.979516, -10, 2, 2.303983, 23, 1

10.14612, -11, 2, 2.296509, 22, 1

10.31272, -11, 2, 2.292255, 22, 1

10.47932, -11, 2, 2.284144, 22, 1

10.64592, -11, 2, 2.275187, 22, 1

10.81252, -11, 2, 2.265867, 22, 1

10.97912, -11, 2, 2.256492, 22, 1

11.14572, -12, 2, 2.251102, 22, 1

11.31232, -12, 2, 2.241204, 22, 1

11.47892, -12, 2, 2.230692, 22, 1

11.64552, -12, 2, 2.219573, 22, 1

11.81212, -12, 2, 2.208321, 22, 1

11.97872, -12, 2, 2.202437, 22, 1

12.14532, -13, 2, 2.190774, 21, 1

12.31192, -13, 2, 2.178794, 21, 1

12.47852, -13, 2, 2.166048, 21, 1

12.64512, -13, 2, 2.152513, 21, 1

12.81172, -13, 2, 2.145918, 21, 1

12.97832, -13, 2, 2.131741, 21, 1

13.14492, -14, 2, 2.115653, 21, 1

13.31152, -14, 2, 2.099496, 20, 1

13.47812, -14, 2, 2.084359, 20, 1

13.64472, -14, 2, 2.076892, 20, 1

13.81132, -14, 2, 2.062179, 20, 1

13.97792, -14, 2, 2.047956, 20, 1

14.14452, -15, 2, 2.033515, 20, 1

14.31112, -15, 2, 2.019403, 20, 1

14.47772, -15, 2, 2.012, 20, 1

14.64432, -15, 2, 1.998083, 19, 1

14.81092, -15, 2, 1.984069, 19, 1

14.97752, -15, 2, 1.969812, 19, 1

15.14412, -16, 2, 1.955621, 19, 1

15.31072, -16, 2, 1.94909, 19, 1

15.47732, -16, 2, 1.935202, 19, 1

15.64392, -16, 2, 1.920098, 19, 1

15.81052, -16, 2, 1.903991, 19, 1

15.97712, -16, 2, 1.887427, 18, 1

16.14372, -17, 2, 1.879239, 18, 1

16.31032, -17, 2, 1.862282, 18, 1

16.47692, -17, 2, 1.845939, 18, 1

16.64352, -17, 2, 1.828771, 18, 1

16.81012, -17, 2, 1.811514, 18, 1

16.97672, -17, 2, 1.802963, 18, 1

17.14332, -18, 2, 1.785455, 17, 1

17.30992, -18, 2, 1.767775, 17, 1

17.47652, -18, 2, 1.749549, 17, 1

17.64312, -18, 2, 1.731302, 17, 1

17.80972, -18, 2, 1.721617, 17, 1

17.97632, -18, 2, 1.703675, 17, 1

18.14292, -19, 2, 1.685118, 16, 1

18.30951, -19, 2, 1.666275, 16, 1

18.47611, -19, 2, 1.646929, 16, 1

18.64271, -19, 2, 1.637497, 16, 1

18.80931, -19, 2, 1.615624, 16, 1

18.97591, -19, 2, 1.594548, 15, 1

19.14251, -20, 2, 1.574309, 15, 1

19.30911, -20, 2, 1.554389, 15, 1

19.47571, -20, 2, 1.545102, 15, 1

19.64231, -20, 2, 1.526767, 15, 1

19.80891, -20, 2, 1.509274, 15, 1

19.97551, -20, 2, 1.49184, 14, 1

20.14211, -21, 2, 1.473808, 14, 1

20.30871, -21, 2, 1.464769, 14, 1

20.47531, -21, 2, 1.446672, 14, 1

20.6419, -21, 2, 1.429166, 14, 1

20.8085, -21, 2, 1.411457, 14, 1

20.9751, -21, 2, 1.393481, 13, 1

21.1417, -22, 2, 1.375091, 13, 1

21.3083, -22, 2, 1.36588, 13, 1

21.4749, -22, 2, 1.34662, 13, 1

21.6415, -22, 2, 1.326996, 13, 1

21.8081, -22, 2, 1.306977, 13, 1

21.9747, -22, 2, 1.296498, 12, 1

22.1413, -23, 2, 1.2767, 12, 1

22.3079, -23, 2, 1.256124, 12, 1

22.4745, -23, 2, 1.234746, 12, 1

22.6411, -23, 2, 1.213867, 12, 1

22.8077, -23, 2, 1.192476, 11, 1

22.97429, -23, 2, 1.182227, 11, 1

23.14089, -24, 2, 1.160299, 11, 1

23.30749, -24, 2, 1.13928, 11, 1

23.47409, -24, 2, 1.118018, 11, 1

23.64069, -24, 2, 1.097448, 10, 1

23.80729, -24, 2, 1.087302, 10, 1

23.97389, -24, 2, 1.067116, 10, 1

24.14049, -25, 2, 1.043915, 10, 2

24.30709, -25, 2, 1.01787, 10, 2

24.47369, -25, 2, 1.006844, 10, 1

24.64029, -25, 2, 0.9861922, 9, 1

24.80689, -25, 2, 0.9689884, 9, 1

24.97349, -25, 2, 0.9550171, 9, 1

25.14009, -26, 2, 0.940443, 9, 1

25.30668, -26, 2, 0.9300954, 9, 1

25.47328, -26, 2, 0.9094272, 9, 1

25.63988, -26, 2, 0.8917108, 8, 1

25.80648, -26, 2, 0.8749347, 8, 1

25.97308, -26, 2, 0.8580046, 8, 1

26.13968, -27, 2, 0.8496428, 8, 1

26.30628, -27, 2, 0.8331633, 8, 1

26.47288, -27, 2, 0.8172035, 8, 1

26.63948, -27, 2, 0.8002596, 8, 1

26.80608, -27, 2, 0.782618, 7, 1

26.97268, -27, 2, 0.7648375, 7, 1

27.13928, -28, 2, 0.7558112, 7, 1

27.30588, -28, 2, 0.7382996, 7, 1

27.47248, -28, 2, 0.7195473, 7, 1

27.63907, -28, 2, 0.7005558, 7, 1

27.80567, -28, 2, 0.6912007, 6, 1

27.97227, -28, 2, 0.6707318, 6, 1

28.13887, -29, 2, 0.6504383, 6, 1

28.30547, -29, 2, 0.6300302, 6, 1

28.47207, -29, 2, 0.6095667, 6, 1

28.63867, -29, 2, 0.5991507, 5, 1

28.80527, -29, 2, 0.5787263, 5, 1

28.97187, -29, 2, 0.5587101, 5, 1

29.13847, -30, 2, 0.538676, 5, 1

29.30507, -30, 2, 0.5177546, 5, 1

29.47167, -30, 2, 0.4980752, 4, 1

29.63827, -30, 2, 0.4884431, 4, 1

29.80486, -30, 2, 0.4666395, 4, 1

29.97146, -30, 2, 0.4458015, 4, 1

30.13806, -31, 2, 0.4255302, 4, 1

30.30466, -31, 2, 0.4157133, 4, 1

30.47126, -31, 2, 0.3964663, 3, 1

30.63786, -31, 2, 0.3782523, 3, 1

30.80446, -31, 2, 0.3592882, 3, 1

30.97106, -31, 2, 0.340095, 3, 1

31.13766, -32, 2, 0.330194, 3, 1

31.30426, -32, 2, 0.310648, 3, 1

31.47086, -32, 2, 0.2914338, 2, 1

31.63746, -32, 2, 0.2727351, 2, 1

31.80406, -32, 2, 0.2539597, 2, 1

31.97066, -32, 2, 0.2445848, 2, 1

32.13726, -33, 2, 0.2255433, 2, 1

32.30386, -33, 2, 0.2063332, 2, 1

32.47046, -33, 2, 0.1865211, 1, 1

32.63705, -33, 2, 0.1666195, 1, 1

32.80365, -33, 2, 0.1465955, 1, 1

32.97025, -33, 2, 0.1365144, 1, 1

33.13685, -34, 2, 0.1166146, 1, 1

33.30345, -34, 2, 0.09620929, 0, 1

33.47005, -34, 2, 0.07587481, 0, 1

33.63665, -34, 2, 0.06529737, 0, 1

33.80325, -34, 2, 0.04439783, 0, 1

33.96985, -34, 2, 0.02371097, 0, 1

34.13645, -35, 2, 0.003052235, 0, 1

34.30305, -35, 2, -0.01733398, 0, 1

34.46965, -35, 2, -0.03769398, 0, 1

34.63625, -35, 2, -0.04783607, 0, 1

34.80285, -35, 2, -0.06804729, 0, 1

34.96944, -35, 2, -0.08774948, 0, 1

35.13604, -36, 2, -0.1083395, -1, 1

35.30264, -36, 2, -0.1190362, -1, 1

35.46924, -36, 2, -0.13942, -1, 1

35.63584, -36, 2, -0.1592062, -1, 1

35.80244, -36, 2, -0.1775339, -1, 1

35.96904, -36, 2, -0.1958759, -1, 1

36.13564, -37, 2, -0.2155688, -2, 1

36.30224, -37, 2, -0.2256804, -2, 1

36.46884, -37, 2, -0.246109, -2, 1

36.63544, -37, 2, -0.2655354, -2, 1

36.80204, -37, 2, -0.2839415, -2, 1

36.96864, -37, 2, -0.3024342, -3, 1

37.13523, -38, 2, -0.311563, -3, 1

37.30183, -38, 2, -0.3300102, -3, 1

37.46843, -38, 2, -0.348912, -3, 1

37.63503, -38, 2, -0.3681359, -3, 1

37.80163, -38, 2, -0.3876662, -3, 1

37.96823, -38, 2, -0.39747, -3, 1

38.13483, -39, 2, -0.4166164, -4, 1

38.30143, -39, 2, -0.4360769, -4, 1

38.46803, -39, 2, -0.4555945, -4, 1

38.63463, -39, 2, -0.475301, -4, 1

38.80123, -39, 2, -0.4852724, -4, 1

38.96783, -39, 2, -0.5055532, -5, 1

39.13443, -40, 2, -0.5256264, -5, 1

39.30103, -40, 2, -0.5462394, -5, 1

39.46762, -40, 2, -0.5666623, -5, 1

39.63422, -40, 2, -0.5766425, -5, 1

39.80082, -40, 2, -0.5962944, -5, 1

39.96742, -40, 2, -0.6151829, -6, 1

40.13402, -41, 2, -0.634479, -6, 1

40.30062, -41, 2, -0.6533942, -6, 1

40.46722, -41, 2, -0.6636648, -6, 1

40.63382, -41, 2, -0.6845517, -6, 1

40.80042, -41, 2, -0.7047734, -7, 1

40.96702, -41, 2, -0.7243476, -7, 1

41.13362, -42, 2, -0.7339983, -7, 1

41.30022, -42, 2, -0.7525606, -7, 1

41.46682, -42, 2, -0.7709394, -7, 1

41.63342, -42, 2, -0.7895885, -7, 1

41.80001, -42, 2, -0.8081584, -8, 1

41.96661, -42, 2, -0.8263059, -8, 1

42.13321, -43, 2, -0.8434782, -8, 1

42.29981, -43, 2, -0.852037, -8, 1

42.46641, -43, 2, -0.8689733, -8, 1

42.63301, -43, 2, -0.8858609, -8, 1

42.79961, -43, 2, -0.9026728, -9, 1

42.96621, -43, 2, -0.9197245, -9, 1

43.13281, -44, 2, -0.9370408, -9, 1

43.29941, -44, 2, -0.9456716, -9, 1

43.46601, -44, 2, -0.9626522, -9, 1

43.63261, -44, 2, -0.979773, -9, 1

43.79921, -44, 2, -0.9972253, -9, 1

43.96581, -44, 2, -1.014538, -10, 1

44.1324, -45, 2, -1.023636, -10, 1

44.299, -45, 2, -1.041208, -10, 1

44.4656, -45, 2, -1.058784, -10, 1

44.6322, -45, 2, -1.076291, -10, 1

44.7988, -45, 2, -1.084961, -10, 1

44.9654, -45, 2, -1.102225, -11, 1

45.132, -46, 2, -1.118975, -11, 1

45.2986, -46, 2, -1.135993, -11, 1

45.4652, -46, 2, -1.144164, -11, 1

45.6318, -46, 2, -1.16008, -11, 1

45.7984, -46, 2, -1.175859, -11, 1

45.965, -46, 2, -1.192958, -11, 1

46.1316, -47, 2, -1.209286, -12, 1

46.29819, -47, 2, -1.225945, -12, 1

46.46479, -47, 2, -1.233737, -12, 1

46.63139, -47, 2, -1.249779, -12, 1

46.79799, -47, 2, -1.264774, -12, 1

46.96459, -47, 2, -1.280697, -12, 1

47.13119, -48, 2, -1.288742, -12, 1

47.29779, -48, 2, -1.304782, -13, 1

47.46439, -48, 2, -1.319754, -13, 1

47.63099, -48, 2, -1.33331, -13, 1

47.79759, -48, 2, -1.345823, -13, 1

47.96419, -48, 2, -1.35174, -13, 1

48.13079, -49, 2, -1.36318, -13, 1

48.29739, -49, 2, -1.374294, -13, 1

48.46399, -49, 2, -1.385235, -13, 1

48.63058, -49, 2, -1.39654, -13, 1

48.79718, -49, 2, -1.402039, -14, 1

48.96378, -49, 2, -1.412974, -14, 1

49.13038, -50, 2, -1.42366, -14, 1

49.29698, -50, 2, -1.433632, -14, 1

49.46358, -50, 2, -1.444229, -14, 1

49.63018, -50, 2, -1.449157, -14, 1

49.79678, -50, 2, -1.459282, -14, 1

49.96338, -50, 2, -1.469447, -14, 1

50.12998, -51, 2, -1.479519, -14, 1

50.29658, -51, 2, -1.489296, -14, 1

50.46318, -51, 2, -1.494011, -14, 1

50.62978, -51, 2, -1.503617, -15, 1

50.79638, -51, 2, -1.513161, -15, 1

50.96297, -51, 2, -1.52193, -15, 1

51.12957, -52, 2, -1.531189, -15, 1

51.29617, -52, 2, -1.535723, -15, 1

51.46277, -52, 2, -1.544814, -15, 1

51.62937, -52, 2, -1.553482, -15, 1

51.79597, -52, 2, -1.562061, -15, 1

51.96257, -52, 2, -1.570865, -15, 1

52.12917, -53, 2, -1.575093, -15, 1

52.29577, -53, 2, -1.583724, -15, 1

52.46237, -53, 2, -1.591521, -15, 1

52.62897, -53, 2, -1.598432, -15, 1

52.79557, -53, 2, -1.60526, -16, 1

52.96217, -53, 2, -1.608326, -16, 1

53.12877, -54, 2, -1.613763, -16, 1

53.29536, -54, 2, -1.619011, -16, 1

53.46196, -54, 2, -1.623358, -16, 1

53.62856, -54, 2, -1.626411, -16, 1

53.79516, -54, 2, -1.627981, -16, 1

53.96176, -54, 2, -1.630013, -16, 1

54.12836, -55, 2, -1.631621, -16, 1

54.29496, -55, 2, -1.632583, -16, 1

54.46156, -55, 2, -1.633169, -16, 1

54.62816, -55, 2, -1.633444, -16, 1

54.79476, -55, 2, -1.634408, -16, 1

54.96136, -55, 2, -1.63471, -16, 1

55.12796, -56, 2, -1.635441, -16, 1

55.29456, -56, 2, -1.635722, -16, 1

55.46115, -56, 2, -1.635873, -16, 1

55.62775, -56, 2, -1.635304, -16, 1

55.79435, -56, 2, -1.634789, -16, 1

55.96095, -56, 2, -1.633115, -16, 1

56.12755, -57, 2, -1.632641, -16, 1

56.29415, -57, 2, -1.629951, -16, 1

56.46075, -57, 2, -1.628168, -16, 1

56.62735, -57, 2, -1.62775, -16, 1

56.79395, -57, 2, -1.626039, -16, 1

56.96055, -57, 2, -1.624113, -16, 1

57.12715, -58, 2, -1.623093, -16, 1

57.29375, -58, 2, -1.621995, -16, 1

57.46035, -58, 2, -1.620705, -16, 1

57.62695, -58, 2, -1.618711, -16, 1

57.79354, -58, 2, -1.61681, -16, 1

57.96014, -58, 2, -1.61529, -16, 1

58.12674, -59, 2, -1.613122, -16, 1

58.29334, -59, 2, -1.612201, -16, 1

58.45994, -59, 2, -1.609932, -16, 1

58.62654, -59, 2, -1.607597, -16, 1

58.79314, -59, 2, -1.605228, -16, 1

58.95974, -59, 2, -1.602079, -16, 1

59.12634, -60, 2, -1.600643, -16, 1

59.29294, -60, 2, -1.59746, -15, 1

59.45954, -60, 2, -1.594512, -15, 1

59.62614, -60, 2, -1.592215, -15, 1

59.79274, -60, 2, -1.590803, -15, 1

59.95934, -60, 2, -1.588595, -15, 1

60.12593, -61, 2, -1.586164, -15, 1

60.29253, -61, 2, -1.583951, -15, 1

60.45913, -61, 2, -1.582596, -15, 1

60.62573, -61, 2, -1.581815, -15, 1

60.79233, -61, 2, -1.581371, -15, 1

60.95893, -61, 2, -1.580641, -15, 1

61.12553, -62, 2, -1.580549, -15, 1

61.29213, -62, 2, -1.581018, -15, 1

61.45873, -62, 2, -1.581647, -15, 1

61.62533, -62, 2, -1.583322, -15, 1

61.79193, -62, 2, -1.584842, -15, 1

61.95853, -62, 2, -1.586962, -15, 1

62.12513, -63, 2, -1.588176, -15, 1

62.29173, -63, 2, -1.590212, -15, 1

62.45832, -63, 2, -1.592329, -15, 1

62.62492, -63, 2, -1.594532, -15, 1

62.79152, -63, 2, -1.596744, -15, 1

62.95812, -63, 2, -1.597651, -15, 1

63.12472, -64, 2, -1.599045, -15, 1

63.29132, -64, 2, -1.600342, -16, 1

63.45792, -64, 2, -1.601737, -16, 1

63.62452, -64, 2, -1.602357, -16, 1

63.79112, -64, 2, -1.60287, -16, 1

63.95772, -64, 2, -1.603605, -16, 1

64.12431, -65, 2, -1.604117, -16, 1

64.29092, -65, 2, -1.604822, -16, 1

64.45752, -65, 2, -1.60512, -16, 1

64.62413, -65, 2, -1.60509, -16, 1

64.79073, -65, 2, -1.604882, -16, 1

64.95734, -65, 2, -1.60457, -16, 1

65.12393, -66, 2, -1.60434, -16, 1

65.29054, -66, 2, -1.604074, -16, 1

65.45714, -66, 2, -1.603802, -16, 1

65.62375, -66, 2, -1.603092, -16, 1

65.79034, -66, 2, -1.602319, -16, 1

65.95695, -66, 2, -1.602082, -16, 1

66.12355, -67, 2, -1.602219, -16, 1

66.29016, -67, 2, -1.602254, -16, 1

66.45676, -67, 2, -1.602442, -16, 1

66.62337, -67, 2, -1.602702, -16, 1

66.78996, -67, 2, -1.603309, -16, 1

66.95657, -67, 2, -1.603903, -16, 1

67.12317, -68, 2, -1.604107, -16, 1

67.28978, -68, 2, -1.604574, -16, 1

67.45638, -68, 2, -1.604961, -16, 1

67.62299, -68, 2, -1.605261, -16, 1

67.78958, -68, 2, -1.605356, -16, 1

67.95619, -68, 2, -1.605247, -16, 1

68.12279, -69, 2, -1.604922, -16, 1

68.2894, -69, 2, -1.604472, -16, 1

68.45599, -69, 2, -1.604062, -16, 1

68.6226, -69, 2, -1.603467, -16, 1

68.7892, -69, 2, -1.602552, -16, 1

68.95581, -69, 2, -1.602258, -16, 1

69.12241, -70, 2, -1.601401, -16, 1

69.28902, -70, 2, -1.600916, -16, 1

69.45561, -70, 2, -1.600294, -16, 1

69.62222, -70, 2, -1.599751, -15, 1

69.78882, -70, 2, -1.599189, -15, 1

69.95543, -70, 2, -1.598634, -15, 1

70.12202, -71, 2, -1.598244, -15, 1

70.28864, -71, 2, -1.597185, -15, 1

70.45523, -71, 2, -1.596519, -15, 1

70.62184, -71, 2, -1.596219, -15, 1

70.78844, -71, 2, -1.59553, -15, 1

70.95505, -71, 2, -1.595407, -15, 1

71.12164, -72, 2, -1.594822, -15, 1

71.28825, -72, 2, -1.594761, -15, 1

71.45485, -72, 2, -1.59502, -15, 1

71.62146, -72, 2, -1.594938, -15, 1

71.78806, -72, 2, -1.594954, -15, 1

71.95467, -72, 2, -1.594936, -15, 1

72.12126, -73, 2, -1.594974, -15, 1

72.28787, -73, 2, -1.594999, -15, 1

72.45447, -73, 2, -1.595105, -15, 1

72.62108, -73, 2, -1.595285, -15, 1

72.78767, -73, 2, -1.595605, -15, 1

72.95428, -73, 2, -1.595764, -15, 1

73.12088, -74, 2, -1.596056, -15, 1

73.28749, -74, 2, -1.596347, -15, 1

73.45409, -74, 2, -1.596575, -15, 1

73.6207, -74, 2, -1.596956, -15, 1

73.78729, -74, 2, -1.597629, -15, 1

73.9539, -74, 2, -1.598117, -15, 1

74.1205, -75, 2, -1.598576, -15, 1

74.28711, -75, 2, -1.59932, -15, 1

74.4537, -75, 2, -1.600095, -16, 1

74.62032, -75, 2, -1.600723, -16, 1

74.78691, -75, 2, -1.601606, -16, 1

74.95352, -75, 2, -1.601995, -16, 1

75.12012, -76, 2, -1.602667, -16, 1

75.28673, -76, 2, -1.603127, -16, 1

75.45332, -76, 2, -1.60377, -16, 1

75.61993, -76, 2, -1.603994, -16, 1

75.78653, -76, 2, -1.604291, -16, 1

75.95314, -76, 2, -1.60479, -16, 1

76.11974, -77, 2, -1.605303, -16, 1

76.28635, -77, 2, -1.605663, -16, 1

76.45294, -77, 2, -1.605952, -16, 1

76.61955, -77, 2, -1.606517, -16, 1

76.78615, -77, 2, -1.607138, -16, 1

76.95276, -77, 2, -1.607686, -16, 1

77.11935, -78, 2, -1.608115, -16, 1

77.28596, -78, 2, -1.608324, -16, 1

77.45256, -78, 2, -1.608773, -16, 1

