timestamp_sec,frame_id,game_played,yielding,player1discrete,player2discrete,player1yieldprob,player2yieldprob,player1_pose_x,player1_pose_y,player1_pose_z,player1_pose_orient_x,player1_pose_orient_y,player1_pose_orient_z,player1_pose_orient_w,player2_pose_x,player2_pose_y,player2_pose_z,player2_pose_orient_x,player2_pose_orient_y,player2_pose_orient_z,player2_pose_orient_w
1717765969.2933562,map,True,False,7,5,0.0,0.0,1.5066018104553223,-2.491210460662842,0.0,0.0,0.0,0.025481800177969922,0.9996752807786221,3.834670706484469,-7.669483555691102,0.705946002133397,0.0,0.0,0.0,1.0
1717765969.342466,map,True,False,7,5,0.0,0.0,1.5066018104553223,-2.491210460662842,0.0,0.0,0.0,0.025481800177969922,0.9996752807786221,3.834670706484469,-7.669483555691102,0.705946002133397,0.0,0.0,0.0,1.0
1717765969.396302,map,True,False,7,5,0.0,0.0,1.5066018104553223,-2.491210460662842,0.0,0.0,0.0,0.025481800177969922,0.9996752807786221,3.834670706484469,-7.669483555691102,0.705946002133397,0.0,0.0,0.0,1.0
1717765969.4951186,map,True,False,7,5,0.0,0.0,1.5066018104553223,-2.491210460662842,0.0,0.0,0.0,0.025481800177969922,0.9996752807786221,3.834670706484469,-7.669483555691102,0.705946002133397,0.0,0.0,0.0,1.0
1717765969.5455654,map,True,False,7,5,0.0,0.0,1.5066018104553223,-2.491210460662842,0.0,0.0,0.0,0.025481800177969922,0.9996752807786221,3.834670706484469,-7.669483555691102,0.705946002133397,0.0,0.0,0.0,1.0
1717765969.5936496,map,True,False,7,5,0.0,0.0,1.5066018104553223,-2.491210460662842,0.0,0.0,0.0,0.025481800177969922,0.9996752807786221,3.851138915853511,-7.728353962391612,0.7062335530895071,0.0,0.0,0.0,1.0
1717765969.6433403,map,True,False,7,5,0.0,0.0,1.5066018104553223,-2.491210460662842,0.0,0.0,0.0,0.025481800177969922,0.9996752807786221,3.851138915853511,-7.728353962391612,0.7062335530895071,0.0,0.0,0.0,1.0
1717765969.6934938,map,True,False,7,5,0.0,0.0,1.5066018104553223,-2.491210460662842,0.0,0.0,0.0,0.025481800177969922,0.9996752807786221,3.851138915853511,-7.728353962391612,0.7062335530895071,0.0,0.0,0.0,1.0
1717765969.7929878,map,True,False,7,5,0.0,0.0,1.5066018104553223,-2.491210460662842,0.0,0.0,0.0,0.025481800177969922,0.9996752807786221,3.851138915853511,-7.728353962391612,0.7062335530895071,0.0,0.0,0.0,1.0
1717765969.8947003,map,True,False,7,5,0.0,0.0,1.5066018104553223,-2.491210460662842,0.0,0.0,0.0,0.025481800177969922,0.9996752807786221,3.8631795658896406,-7.770057118374188,0.7064350845288323,0.0,0.0,0.0,1.0
1717765969.9427884,map,True,False,7,5,0.0,0.0,1.5066018104553223,-2.491210460662842,0.0,0.0,0.0,0.025481800177969922,0.9996752807786221,3.851211909269521,-7.728837213238798,0.706233553089509,0.0,0.0,0.0,1.0
1717765969.9934492,map,True,False,7,5,0.0,0.0,1.5049993991851807,-2.492845296859741,0.0,0.0,0.0,0.025672188898236064,0.9996704214103359,3.851211909269521,-7.728837213238798,0.706233553089509,0.0,0.0,0.0,1.0
1717765970.043905,map,True,False,7,5,0.0,0.0,1.5049993991851807,-2.492845296859741,0.0,0.0,0.0,0.025672188898236064,0.9996704214103359,3.851211909269521,-7.728837213238798,0.706233553089509,0.0,0.0,0.0,1.0
1717765970.0947483,map,True,False,7,5,0.0,0.0,1.5049993991851807,-2.492845296859741,0.0,0.0,0.0,0.025672188898236064,0.9996704214103359,3.851211909269521,-7.728837213238798,0.706233553089509,0.0,0.0,0.0,1.0
1717765970.1448307,map,True,False,7,5,0.0,0.0,1.5049993991851807,-2.492845296859741,0.0,0.0,0.0,0.025672188898236064,0.9996704214103359,3.851211909269521,-7.728837213238798,0.706233553089509,0.0,0.0,0.0,1.0
1717765970.248814,map,True,False,7,5,0.0,0.0,1.5049993991851807,-2.492845296859741,0.0,0.0,0.0,0.025672188898236064,0.9996704214103359,3.847565436099244,-7.711089694220065,0.7061450758722425,0.0,0.0,0.0,1.0
1717765970.2978039,map,True,False,7,5,0.0,0.0,1.5049993991851807,-2.492845296859741,0.0,0.0,0.0,0.025672188898236064,0.9996704214103359,3.847565436099244,-7.711089694220065,0.7061450758722425,0.0,0.0,0.0,1.0
1717765970.3959472,map,True,False,7,5,0.0,0.0,1.5049993991851807,-2.492845296859741,0.0,0.0,0.0,0.025672188898236064,0.9996704214103359,3.847565436099244,-7.711089694220065,0.7061450758722425,0.0,0.0,0.0,1.0
1717765970.4950824,map,True,False,7,5,0.0,0.0,1.5049993991851807,-2.492845296859741,0.0,0.0,0.0,0.025672188898236064,0.9996704214103359,3.847565436099244,-7.711089694220065,0.7061450758722425,0.0,0.0,0.0,1.0
1717765970.5455985,map,True,False,7,5,0.0,0.0,1.5049993991851807,-2.492845296859741,0.0,0.0,0.0,0.025672188898236064,0.9996704214103359,3.8493287906537947,-7.7265832762763935,0.7062335530895071,0.0,0.0,0.0,1.0
1717765970.646112,map,True,False,7,5,0.0,0.0,1.5049993991851807,-2.492845296859741,0.0,0.0,0.0,0.025672188898236064,0.9996704214103359,3.826999481949755,-7.649672794996075,0.7058575249161331,0.0,0.0,0.0,1.0
1717765970.745267,map,True,False,7,5,0.0,0.0,1.5057868957519531,-2.4924726486206055,0.0,0.0,0.0,0.02546386580414924,0.9996757428645605,3.826999481949755,-7.649672794996075,0.7058575249161331,0.0,0.0,0.0,1.0
1717765970.7960432,map,True,False,7,5,0.0,0.0,1.5057868957519531,-2.4924726486206055,0.0,0.0,0.0,0.02546386580414924,0.9996757428645605,3.826999481949755,-7.649672794996075,0.7058575249161331,0.0,0.0,0.0,1.0
1717765970.8468869,map,True,False,7,5,0.0,0.0,1.5057868957519531,-2.4924726486206055,0.0,0.0,0.0,0.02546386580414924,0.9996757428645605,3.826999481949755,-7.649672794996075,0.7058575249161331,0.0,0.0,0.0,1.0
1717765970.9466677,map,True,False,7,5,0.0,0.0,1.5057868957519531,-2.4924726486206055,0.0,0.0,0.0,0.02546386580414924,0.9996757428645605,3.844060539869701,-7.70836386791543,0.7061450758722424,0.0,0.0,0.0,1.0
1717765970.998761,map,True,False,7,5,0.0,0.0,1.5057868957519531,-2.4924726486206055,0.0,0.0,0.0,0.02546386580414924,0.9996757428645605,3.844060539869701,-7.70836386791543,0.7061450758722424,0.0,0.0,0.0,1.0
1717765971.0489464,map,True,False,7,5,0.0,0.0,1.5057868957519531,-2.4924726486206055,0.0,0.0,0.0,0.02546386580414924,0.9996757428645605,3.844060539869701,-7.70836386791543,0.7061450758722424,0.0,0.0,0.0,1.0
1717765971.1492693,map,True,False,7,5,0.0,0.0,1.5057868957519531,-2.4924726486206055,0.0,0.0,0.0,0.02546386580414924,0.9996757428645605,3.844060539869701,-7.70836386791543,0.7061450758722424,0.0,0.0,0.0,1.0
1717765971.249499,map,True,False,7,5,0.0,0.0,1.5057868957519531,-2.4924726486206055,0.0,0.0,0.0,0.02546386580414924,0.9996757428645605,3.8457529143378126,-7.709732820769918,0.7061450758722416,0.0,0.0,0.0,1.0
1717765971.3001597,map,True,False,7,5,0.0,0.0,1.5057868957519531,-2.4924726486206055,0.0,0.0,0.0,0.02546386580414924,0.9996757428645605,3.801597716699143,-7.52979780604837,0.70525711636042,0.0,0.0,0.0,1.0
1717765971.350843,map,True,False,7,5,0.0,0.0,1.5057868957519531,-2.4924726486206055,0.0,0.0,0.0,0.02546386580414924,0.9996757428645605,3.8048931118724276,-7.566823796048815,0.7054372581341267,0.0,0.0,0.0,1.0
1717765971.4502633,map,True,False,7,5,0.0,0.0,1.5057868957519531,-2.4924726486206055,0.0,0.0,0.0,0.02546386580414924,0.9996757428645605,3.8048931118724276,-7.566823796048815,0.7054372581341267,0.0,0.0,0.0,1.0
1717765971.500687,map,True,False,7,5,0.0,0.0,1.5057868957519531,-2.4924726486206055,0.0,0.0,0.0,0.02546386580414924,0.9996757428645605,3.8048931118724276,-7.566823796048815,0.7054372581341267,0.0,0.0,0.0,1.0
1717765971.600545,map,True,False,7,5,0.0,0.0,1.5050017833709717,-2.4909074306488037,0.0,0.0,0.0,0.025537832991627214,0.9996738498014578,3.8048931118724276,-7.566823796048815,0.7054372581341267,0.0,0.0,0.0,1.0
1717765971.7022545,map,True,False,7,5,0.0,0.0,1.5050017833709717,-2.4909074306488037,0.0,0.0,0.0,0.025537832991627214,0.9996738498014578,3.839188264467291,-7.660064861819067,0.7058953427193314,0.0,0.0,0.0,1.0
1717765971.7998078,map,True,False,7,5,0.0,0.0,1.5050017833709717,-2.4909074306488037,0.0,0.0,0.0,0.025537832991627214,0.9996738498014578,3.839188264467291,-7.660064861819067,0.7058953427193314,0.0,0.0,0.0,1.0
1717765971.8566897,map,True,False,7,5,0.0,0.0,1.5050017833709717,-2.4909074306488037,0.0,0.0,0.0,0.025537832991627214,0.9996738498014578,3.839188264467291,-7.660064861819067,0.7058953427193314,0.0,0.0,0.0,1.0
1717765971.8610222,map,True,False,7,5,0.0,0.0,1.5050017833709717,-2.4909074306488037,0.0,0.0,0.0,0.025537832991627214,0.9996738498014578,3.839188264467291,-7.660064861819067,0.7058953427193314,0.0,0.0,0.0,1.0
1717765971.8640468,map,True,False,7,5,0.0,0.0,1.5050017833709717,-2.4909074306488037,0.0,0.0,0.0,0.025537832991627214,0.9996738498014578,3.839188264467291,-7.660064861819067,0.7058953427193314,0.0,0.0,0.0,1.0
1717765971.9883265,map,True,False,7,5,0.0,0.0,1.5050017833709717,-2.4909074306488037,0.0,0.0,0.0,0.025537832991627214,0.9996738498014578,3.8449713246661537,-7.6436361858676865,0.7057956963836873,0.0,0.0,0.0,1.0
1717765972.0393548,map,True,False,7,5,0.0,0.0,1.5050017833709717,-2.4909074306488037,0.0,0.0,0.0,0.025537832991627214,0.9996738498014578,3.8729945505794916,-7.7389656242284826,0.7062615256632854,0.0,0.0,0.0,1.0
1717765972.0873306,map,True,False,7,5,0.0,0.0,1.5050017833709717,-2.4909074306488037,0.0,0.0,0.0,0.025537832991627214,0.9996738498014578,3.8729945505794916,-7.7389656242284826,0.7062615256632854,0.0,0.0,0.0,1.0
1717765972.187726,map,True,False,7,5,0.0,0.0,1.5051062107086182,-2.491450548171997,0.0,0.0,0.0,0.02556781726713977,0.9996730895940061,3.8729945505794916,-7.7389656242284826,0.7062615256632854,0.0,0.0,0.0,1.0
1717765972.239097,map,True,False,7,5,0.0,0.0,1.5051062107086182,-2.491450548171997,0.0,0.0,0.0,0.02556781726713977,0.9996730895940061,3.8729945505794916,-7.7389656242284826,0.7062615256632854,0.0,0.0,0.0,1.0
1717765972.3373966,map,True,False,7,5,0.0,0.0,1.5051062107086182,-2.491450548171997,0.0,0.0,0.0,0.02556781726713977,0.9996730895940061,3.873474556608693,-7.627890616650503,0.6973187369279947,0.0,0.0,0.0,1.0
1717765972.3809416,map,True,False,7,5,0.0,0.0,1.5051062107086182,-2.491450548171997,0.0,0.0,0.0,0.02556781726713977,0.9996730895940061,3.866923397735018,-7.605824314344213,0.7055954711811121,0.0,0.0,0.0,1.0
1717765972.386621,map,True,False,7,5,0.0,0.0,1.5051062107086182,-2.491450548171997,0.0,0.0,0.0,0.02556781726713977,0.9996730895940061,3.866923397735018,-7.605824314344213,0.7055954711811121,0.0,0.0,0.0,1.0
1717765972.4330974,map,True,False,7,5,0.0,0.0,1.5051062107086182,-2.491450548171997,0.0,0.0,0.0,0.02556781726713977,0.9996730895940061,3.866923397735018,-7.605824314344213,0.7055954711811121,0.0,0.0,0.0,1.0
1717765972.4848838,map,True,False,7,5,0.0,0.0,1.5051062107086182,-2.491450548171997,0.0,0.0,0.0,0.02556781726713977,0.9996730895940061,3.866923397735018,-7.605824314344213,0.7055954711811121,0.0,0.0,0.0,1.0
1717765972.583005,map,True,False,7,5,0.0,0.0,1.5051062107086182,-2.491450548171997,0.0,0.0,0.0,0.02556781726713977,0.9996730895940061,3.866923397735018,-7.605824314344213,0.7055954711811121,0.0,0.0,0.0,1.0
1717765972.6333833,map,True,False,7,5,0.0,0.0,1.5051062107086182,-2.491450548171997,0.0,0.0,0.0,0.02556781726713977,0.9996730895940061,3.866923397735018,-7.605824314344213,0.7055954711811121,0.0,0.0,0.0,1.0
1717765972.6863163,map,True,False,7,5,0.0,0.0,1.5051062107086182,-2.491450548171997,0.0,0.0,0.0,0.02556781726713977,0.9996730895940061,3.9029555359529726,-7.60070110231454,0.6888617156366759,0.0,0.0,0.0,1.0
1717765972.784881,map,True,False,7,5,0.0,0.0,1.5051062107086182,-2.491450548171997,0.0,0.0,0.0,0.02556781726713977,0.9996730895940061,3.907166315039424,-7.505090235938478,0.688613203288797,0.0,0.0,0.0,1.0
1717765972.835363,map,True,False,7,5,0.0,0.0,1.5051062107086182,-2.491450548171997,0.0,0.0,0.0,0.02556781726713977,0.9996730895940061,3.907166315039424,-7.505090235938478,0.688613203288797,0.0,0.0,0.0,1.0
1717765973.0358424,map,True,False,7,5,0.0,0.0,1.5177628993988037,-2.4930834770202637,0.0,0.0,0.0,0.025462447112083463,0.9996757726765492,3.9187902390398435,-7.321573455074005,0.6724952817896637,0.0,0.0,0.0,1.0
1717765973.0856946,map,True,False,7,5,0.0,0.0,1.5177628993988037,-2.4930834770202637,0.0,0.0,0.0,0.025462447112083463,0.9996757726765492,3.9387177148785426,-7.386321380706946,0.672390115232306,0.0,0.0,0.0,1.0
1717765973.1362464,map,True,False,7,5,0.0,0.0,1.5177628993988037,-2.4930834770202637,0.0,0.0,0.0,0.025462447112083463,0.9996757726765492,3.9387177148785426,-7.386321380706946,0.672390115232306,0.0,0.0,0.0,1.0
1717765973.1865873,map,True,False,7,5,0.0,0.0,1.5177628993988037,-2.4930834770202637,0.0,0.0,0.0,0.025462447112083463,0.9996757726765492,3.9387177148785426,-7.386321380706946,0.672390115232306,0.0,0.0,0.0,1.0
1717765973.239335,map,True,False,7,5,0.0,0.0,1.5177628993988037,-2.4930834770202637,0.0,0.0,0.0,0.025462447112083463,0.9996757726765492,3.9387177148785426,-7.386321380706946,0.672390115232306,0.0,0.0,0.0,1.0
1717765973.287551,map,True,False,7,5,0.0,0.0,1.5177628993988037,-2.4930834770202637,0.0,0.0,0.0,0.025462447112083463,0.9996757726765492,3.9387177148785426,-7.386321380706946,0.672390115232306,0.0,0.0,0.0,1.0
1717765973.3412743,map,True,False,7,5,0.0,0.0,1.5177628993988037,-2.4930834770202637,0.0,0.0,0.0,0.025462447112083463,0.9996757726765492,3.9387177148785426,-7.386321380706946,0.672390115232306,0.0,0.0,0.0,1.0
1717765973.388064,map,True,False,7,5,0.0,0.0,1.5177628993988037,-2.4930834770202637,0.0,0.0,0.0,0.025462447112083463,0.9996757726765492,3.910155770366386,-7.178685141261855,0.6727734626439168,0.0,0.0,0.0,1.0
1717765973.438034,map,True,False,7,5,0.0,0.0,1.5177628993988037,-2.4930834770202637,0.0,0.0,0.0,0.025462447112083463,0.9996757726765492,3.910155770366386,-7.178685141261855,0.6727734626439168,0.0,0.0,0.0,1.0
1717765973.4889092,map,True,False,7,5,0.0,0.0,1.5177628993988037,-2.4930834770202637,0.0,0.0,0.0,0.025462447112083463,0.9996757726765492,3.910155770366386,-7.178685141261855,0.6727734626439168,0.0,0.0,0.0,1.0
1717765973.5393414,map,True,False,7,5,0.0,0.0,1.5177628993988037,-2.4930834770202637,0.0,0.0,0.0,0.025462447112083463,0.9996757726765492,3.910155770366386,-7.178685141261855,0.6727734626439168,0.0,0.0,0.0,1.0
1717765973.5897896,map,True,False,7,5,0.0,0.0,1.5177628993988037,-2.4930834770202637,0.0,0.0,0.0,0.025462447112083463,0.9996757726765492,3.910155770366386,-7.178685141261855,0.6727734626439168,0.0,0.0,0.0,1.0
1717765973.6403854,map,True,False,7,5,0.0,0.0,1.5177628993988037,-2.4930834770202637,0.0,0.0,0.0,0.025462447112083463,0.9996757726765492,3.910155770366386,-7.178685141261855,0.6727734626439168,0.0,0.0,0.0,1.0
1717765973.7404637,map,True,False,7,5,0.0,0.0,1.5177628993988037,-2.4930834770202637,0.0,0.0,0.0,0.025462447112083463,0.9996757726765492,3.9669757066483093,-7.319467595746632,0.6962361664546753,0.0,0.0,0.0,1.0
1717765973.8391097,map,True,False,7,5,0.0,0.0,1.6213663816452026,-2.5119388103485107,0.0,0.0,0.0,0.02629650217679165,0.9996541885640445,3.9669757066483093,-7.319467595746632,0.6962361664546753,0.0,0.0,0.0,1.0
1717765974.0513704,map,True,False,7,5,0.0,0.0,1.6213663816452026,-2.5119388103485107,0.0,0.0,0.0,0.02629650217679165,0.9996541885640445,4.153704772620493,-7.314904527772114,0.6801331817332108,0.0,0.0,0.0,1.0
1717765974.09396,map,True,False,7,5,0.0,0.0,1.6213663816452026,-2.5119388103485107,0.0,0.0,0.0,0.02629650217679165,0.9996541885640445,3.9476006766116365,-6.810815620299449,0.6873607879734291,0.0,0.0,0.0,1.0
1717765974.1435227,map,True,False,7,5,0.0,0.0,1.6213663816452026,-2.5119388103485107,0.0,0.0,0.0,0.02629650217679165,0.9996541885640445,3.9476006766116365,-6.810815620299449,0.6873607879734291,0.0,0.0,0.0,1.0
1717765974.193954,map,True,False,7,5,0.0,0.0,1.6213663816452026,-2.5119388103485107,0.0,0.0,0.0,0.02629650217679165,0.9996541885640445,3.9476006766116365,-6.810815620299449,0.6873607879734291,0.0,0.0,0.0,1.0
1717765974.29357,map,True,False,7,5,0.0,0.0,1.6213663816452026,-2.5119388103485107,0.0,0.0,0.0,0.02629650217679165,0.9996541885640445,3.9476006766116365,-6.810815620299449,0.6873607879734291,0.0,0.0,0.0,1.0
1717765974.3435457,map,True,False,7,5,0.0,0.0,1.6213663816452026,-2.5119388103485107,0.0,0.0,0.0,0.02629650217679165,0.9996541885640445,3.9476006766116365,-6.810815620299449,0.6873607879734291,0.0,0.0,0.0,1.0
1717765974.3942208,map,True,False,7,5,0.0,0.0,1.6213663816452026,-2.5119388103485107,0.0,0.0,0.0,0.02629650217679165,0.9996541885640445,4.077764360778486,-6.847564903877839,0.6801059868489038,0.0,0.0,0.0,1.0
1717765974.4450855,map,True,False,7,5,0.0,0.0,1.6213663816452026,-2.5119388103485107,0.0,0.0,0.0,0.02629650217679165,0.9996541885640445,4.1081162478743085,-6.851497516753476,0.6656646444030049,0.0,0.0,0.0,1.0
1717765974.495511,map,True,False,7,5,0.0,0.0,1.6213663816452026,-2.5119388103485107,0.0,0.0,0.0,0.02629650217679165,0.9996541885640445,4.1081162478743085,-6.851497516753476,0.6656646444030049,0.0,0.0,0.0,1.0
1717765974.5460267,map,True,False,7,5,0.0,0.0,1.6213663816452026,-2.5119388103485107,0.0,0.0,0.0,0.02629650217679165,0.9996541885640445,4.1081162478743085,-6.851497516753476,0.6656646444030049,0.0,0.0,0.0,1.0
1717765974.5971234,map,True,False,7,5,0.0,0.0,1.6213663816452026,-2.5119388103485107,0.0,0.0,0.0,0.02629650217679165,0.9996541885640445,4.1081162478743085,-6.851497516753476,0.6656646444030049,0.0,0.0,0.0,1.0
1717765974.6467268,map,True,False,7,5,0.0,0.0,1.760934829711914,-2.5368666648864746,0.0,0.0,0.0,0.02665257310264024,0.9996447528215046,4.1081162478743085,-6.851497516753476,0.6656646444030049,0.0,0.0,0.0,1.0
1717765974.7457397,map,True,False,7,4,0.0,0.0,1.760934829711914,-2.5368666648864746,0.0,0.0,0.0,0.02665257310264024,0.9996447528215046,4.079835181832703,-6.519634193174952,0.6469571754561945,0.0,0.0,0.0,1.0
1717765974.8455956,map,True,False,7,4,0.0,0.0,1.760934829711914,-2.5368666648864746,0.0,0.0,0.0,0.02665257310264024,0.9996447528215046,4.079835181832703,-6.519634193174952,0.6469571754561945,0.0,0.0,0.0,1.0
1717765975.048118,map,True,False,7,4,0.0,0.0,1.760934829711914,-2.5368666648864746,0.0,0.0,0.0,0.02665257310264024,0.9996447528215046,4.114065210878753,-6.519258307547649,0.6404552217639111,0.0,0.0,0.0,1.0
1717765975.0982873,map,True,False,7,4,0.0,0.0,1.760934829711914,-2.5368666648864746,0.0,0.0,0.0,0.02665257310264024,0.9996447528215046,4.064159386540835,-6.410029055239917,0.6544718581690284,0.0,0.0,0.0,1.0
1717765975.1482542,map,True,False,7,4,0.0,0.0,1.760934829711914,-2.5368666648864746,0.0,0.0,0.0,0.02665257310264024,0.9996447528215046,4.064159386540835,-6.410029055239917,0.6544718581690284,0.0,0.0,0.0,1.0
1717765975.1987123,map,True,False,7,4,0.0,0.0,1.760934829711914,-2.5368666648864746,0.0,0.0,0.0,0.02665257310264024,0.9996447528215046,4.064159386540835,-6.410029055239917,0.6544718581690284,0.0,0.0,0.0,1.0
1717765975.2488947,map,True,False,7,4,0.0,0.0,1.760934829711914,-2.5368666648864746,0.0,0.0,0.0,0.02665257310264024,0.9996447528215046,4.064159386540835,-6.410029055239917,0.6544718581690284,0.0,0.0,0.0,1.0
1717765975.3477764,map,True,False,7,4,0.0,0.0,1.760934829711914,-2.5368666648864746,0.0,0.0,0.0,0.02665257310264024,0.9996447528215046,4.064159386540835,-6.410029055239917,0.6544718581690284,0.0,0.0,0.0,1.0
1717765975.399556,map,True,False,6,4,0.0,0.0,1.9216028451919556,-2.5691566467285156,0.0,0.0,0.0,0.028013505733142548,0.9996075456132207,4.231011696643631,-6.513742109184804,0.6600301912799657,0.0,0.0,0.0,1.0
1717765975.4993896,map,True,False,6,4,0.0,0.0,1.9216028451919556,-2.5691566467285156,0.0,0.0,0.0,0.028013505733142548,0.9996075456132207,4.260964372702487,-6.540636971162816,0.659761923524187,0.0,0.0,0.0,1.0
1717765975.5990045,map,True,False,6,4,0.0,0.0,1.9216028451919556,-2.5691566467285156,0.0,0.0,0.0,0.028013505733142548,0.9996075456132207,4.260964372702487,-6.540636971162816,0.659761923524187,0.0,0.0,0.0,1.0
1717765975.7037673,map,True,False,6,4,0.0,0.0,1.9216028451919556,-2.5691566467285156,0.0,0.0,0.0,0.028013505733142548,0.9996075456132207,4.260964372702487,-6.540636971162816,0.659761923524187,0.0,0.0,0.0,1.0
1717765975.7976933,map,True,False,6,4,0.0,0.0,1.9216028451919556,-2.5691566467285156,0.0,0.0,0.0,0.028013505733142548,0.9996075456132207,4.311247443953139,-6.312604163396946,0.6417363154464192,0.0,0.0,0.0,1.0
1717765976.1010764,map,True,False,6,4,0.0,0.0,1.9216028451919556,-2.5691566467285156,0.0,0.0,0.0,0.028013505733142548,0.9996075456132207,4.306067394883246,-6.060526806289316,0.6560872885150579,0.0,0.0,0.0,1.0
1717765976.2004406,map,True,False,6,4,0.0,0.0,2.065349578857422,-2.5962705612182617,0.0,0.0,0.0,0.029135636250092772,0.9995754652096603,4.27884635772228,-6.004113120109659,0.6565229129222234,0.0,0.0,0.0,1.0
1717765976.2995112,map,True,False,6,4,0.0,0.0,2.065349578857422,-2.5962705612182617,0.0,0.0,0.0,0.029135636250092772,0.9995754652096603,4.27884635772228,-6.004113120109659,0.6565229129222234,0.0,0.0,0.0,1.0
1717765976.3495998,map,True,False,6,4,0.0,0.0,2.065349578857422,-2.5962705612182617,0.0,0.0,0.0,0.029135636250092772,0.9995754652096603,4.27884635772228,-6.004113120109659,0.6565229129222234,0.0,0.0,0.0,1.0
1717765976.4553878,map,True,False,6,4,0.0,0.0,2.065349578857422,-2.5962705612182617,0.0,0.0,0.0,0.029135636250092772,0.9995754652096603,4.2681710138560085,-5.806113019798646,0.641316477082837,0.0,0.0,0.0,1.0
1717765976.500657,map,True,False,6,4,0.0,0.0,2.065349578857422,-2.5962705612182617,0.0,0.0,0.0,0.029135636250092772,0.9995754652096603,4.279006395232052,-5.834382648909653,0.6409754220566981,0.0,0.0,0.0,1.0
1717765976.6010199,map,True,False,6,4,0.0,0.0,2.065349578857422,-2.5962705612182617,0.0,0.0,0.0,0.029135636250092772,0.9995754652096603,4.279006395232052,-5.834382648909653,0.6409754220566981,0.0,0.0,0.0,1.0
1717765976.650539,map,True,False,6,4,0.0,0.0,2.065349578857422,-2.5962705612182617,0.0,0.0,0.0,0.029135636250092772,0.9995754652096603,4.279006395232052,-5.834382648909653,0.6409754220566981,0.0,0.0,0.0,1.0
1717765976.7012177,map,True,False,6,4,0.0,0.0,2.065349578857422,-2.5962705612182617,0.0,0.0,0.0,0.029135636250092772,0.9995754652096603,4.279006395232052,-5.834382648909653,0.6409754220566981,0.0,0.0,0.0,1.0
1717765976.8005166,map,True,False,6,3,0.0,0.0,2.065349578857422,-2.5962705612182617,0.0,0.0,0.0,0.029135636250092772,0.9995754652096603,4.246229223025797,-5.5251065807645485,0.6197949323326495,0.0,0.0,0.0,1.0
1717765976.8504303,map,True,False,6,3,0.0,0.0,2.065349578857422,-2.5962705612182617,0.0,0.0,0.0,0.029135636250092772,0.9995754652096603,4.246229223025797,-5.5251065807645485,0.6197949323326495,0.0,0.0,0.0,1.0
1717765977.1542838,map,True,False,5,3,0.0,0.0,2.2164313793182373,-2.6245040893554688,0.0,0.0,0.0,0.030377567978409174,0.999538493950877,4.300872287855348,-5.4500651428345535,0.6455675235683042,0.0,0.0,0.0,1.0
1717765977.2058723,map,True,False,5,3,0.0,0.0,2.2164313793182373,-2.6245040893554688,0.0,0.0,0.0,0.030377567978409174,0.999538493950877,4.300872287855348,-5.4500651428345535,0.6455675235683042,0.0,0.0,0.0,1.0
1717765977.2535522,map,True,False,5,3,0.0,0.0,2.2164313793182373,-2.6245040893554688,0.0,0.0,0.0,0.030377567978409174,0.999538493950877,4.300872287855348,-5.4500651428345535,0.6455675235683042,0.0,0.0,0.0,1.0
1717765977.3040605,map,True,False,5,3,0.0,0.0,2.2164313793182373,-2.6245040893554688,0.0,0.0,0.0,0.030377567978409174,0.999538493950877,4.300872287855348,-5.4500651428345535,0.6455675235683042,0.0,0.0,0.0,1.0
1717765977.3543916,map,True,False,5,3,0.0,0.0,2.2164313793182373,-2.6245040893554688,0.0,0.0,0.0,0.030377567978409174,0.999538493950877,4.300872287855348,-5.4500651428345535,0.6455675235683042,0.0,0.0,0.0,1.0
1717765977.407102,map,True,False,5,3,0.0,0.0,2.2164313793182373,-2.6245040893554688,0.0,0.0,0.0,0.030377567978409174,0.999538493950877,4.300872287855348,-5.4500651428345535,0.6455675235683042,0.0,0.0,0.0,1.0
1717765977.5051336,map,True,False,5,3,0.0,0.0,2.2164313793182373,-2.6245040893554688,0.0,0.0,0.0,0.030377567978409174,0.999538493950877,4.478500764688997,-5.399821909243936,0.640036296486347,0.0,0.0,0.0,1.0
1717765977.555341,map,True,False,5,3,0.0,0.0,2.2164313793182373,-2.6245040893554688,0.0,0.0,0.0,0.030377567978409174,0.999538493950877,4.478500764688997,-5.399821909243936,0.640036296486347,0.0,0.0,0.0,1.0
1717765977.6068277,map,True,False,5,3,0.0,0.0,2.2164313793182373,-2.6245040893554688,0.0,0.0,0.0,0.030377567978409174,0.999538493950877,4.478500764688997,-5.399821909243936,0.640036296486347,0.0,0.0,0.0,1.0
1717765977.7076788,map,True,False,5,3,0.0,0.0,2.358830213546753,-2.64919114112854,0.0,0.0,0.0,0.031192208899001386,0.99951340340238,4.478500764688997,-5.399821909243936,0.640036296486347,0.0,0.0,0.0,1.0
1717765977.8047693,map,True,False,5,3,0.0,0.0,2.358830213546753,-2.64919114112854,0.0,0.0,0.0,0.031192208899001386,0.99951340340238,4.461730053846088,-5.127818430764894,0.6438111452088228,0.0,0.0,0.0,1.0
1717765977.8549767,map,True,False,5,3,0.0,0.0,2.358830213546753,-2.64919114112854,0.0,0.0,0.0,0.031192208899001386,0.99951340340238,4.461730053846088,-5.127818430764894,0.6438111452088228,0.0,0.0,0.0,1.0
1717765978.1559684,map,True,False,5,3,0.0,0.0,2.358830213546753,-2.64919114112854,0.0,0.0,0.0,0.031192208899001386,0.99951340340238,4.411867199622754,-4.896889984063526,0.631220324042464,0.0,0.0,0.0,1.0
1717765978.207139,map,True,False,5,3,0.0,0.0,2.358830213546753,-2.64919114112854,0.0,0.0,0.0,0.031192208899001386,0.99951340340238,4.411867199622754,-4.896889984063526,0.631220324042464,0.0,0.0,0.0,1.0
1717765978.256945,map,True,False,5,3,0.0,0.0,2.358830213546753,-2.64919114112854,0.0,0.0,0.0,0.031192208899001386,0.99951340340238,4.411867199622754,-4.896889984063526,0.631220324042464,0.0,0.0,0.0,1.0
1717765978.3079562,map,True,False,5,3,0.0,0.0,2.358830213546753,-2.64919114112854,0.0,0.0,0.0,0.031192208899001386,0.99951340340238,4.411867199622754,-4.896889984063526,0.631220324042464,0.0,0.0,0.0,1.0
1717765978.4076574,map,True,False,5,3,0.0,0.0,2.358830213546753,-2.64919114112854,0.0,0.0,0.0,0.031192208899001386,0.99951340340238,4.411867199622754,-4.896889984063526,0.631220324042464,0.0,0.0,0.0,1.0
1717765978.508788,map,True,False,5,3,0.0,0.0,2.5076117515563965,-2.6717543601989746,0.0,0.0,0.0,0.03144767608971575,0.9995053975511522,4.464028731757379,-4.781156816037647,0.6028174522078431,0.0,0.0,0.0,1.0
1717765978.5590196,map,True,False,5,3,0.0,0.0,2.5076117515563965,-2.6717543601989746,0.0,0.0,0.0,0.03144767608971575,0.9995053975511522,4.464028731757379,-4.781156816037647,0.6028174522078431,0.0,0.0,0.0,1.0
1717765978.620183,map,True,False,5,3,0.0,0.0,2.5076117515563965,-2.6717543601989746,0.0,0.0,0.0,0.03144767608971575,0.9995053975511522,4.464028731757379,-4.781156816037647,0.6028174522078431,0.0,0.0,0.0,1.0
1717765978.7140028,map,True,False,5,3,0.0,0.0,2.5076117515563965,-2.6717543601989746,0.0,0.0,0.0,0.03144767608971575,0.9995053975511522,4.464028731757379,-4.781156816037647,0.6028174522078431,0.0,0.0,0.0,1.0
1717765978.7640936,map,True,False,5,3,0.0,0.0,2.5076117515563965,-2.6717543601989746,0.0,0.0,0.0,0.03144767608971575,0.9995053975511522,4.464028731757379,-4.781156816037647,0.6028174522078431,0.0,0.0,0.0,1.0
1717765978.8155146,map,True,False,5,2,0.0,0.0,2.5076117515563965,-2.6717543601989746,0.0,0.0,0.0,0.03144767608971575,0.9995053975511522,4.468263836770634,-4.634571214629088,0.6505954014221889,0.0,0.0,0.0,1.0
1717765979.1677063,map,True,False,4,2,0.0,0.0,2.637887716293335,-2.693477153778076,0.0,0.0,0.0,0.03243392935517992,0.9994738804112687,4.6200225436884,-4.5902775011404415,0.6715128542800985,0.0,0.0,0.0,1.0
1717765979.2175076,map,True,False,4,2,0.0,0.0,2.637887716293335,-2.693477153778076,0.0,0.0,0.0,0.03243392935517992,0.9994738804112687,4.6200225436884,-4.5902775011404415,0.6715128542800985,0.0,0.0,0.0,1.0
1717765979.2712681,map,True,False,4,2,0.0,0.0,2.637887716293335,-2.693477153778076,0.0,0.0,0.0,0.03243392935517992,0.9994738804112687,4.6200225436884,-4.5902775011404415,0.6715128542800985,0.0,0.0,0.0,1.0
1717765979.3190522,map,True,False,4,2,0.0,0.0,2.637887716293335,-2.693477153778076,0.0,0.0,0.0,0.03243392935517992,0.9994738804112687,4.6200225436884,-4.5902775011404415,0.6715128542800985,0.0,0.0,0.0,1.0
1717765979.3714392,map,True,False,4,2,0.0,0.0,2.637887716293335,-2.693477153778076,0.0,0.0,0.0,0.03243392935517992,0.9994738804112687,4.6200225436884,-4.5902775011404415,0.6715128542800985,0.0,0.0,0.0,1.0
1717765979.4188964,map,True,False,4,2,0.0,0.0,2.637887716293335,-2.693477153778076,0.0,0.0,0.0,0.03243392935517992,0.9994738804112687,4.6200225436884,-4.5902775011404415,0.6715128542800985,0.0,0.0,0.0,1.0
1717765979.4695468,map,True,False,4,2,0.0,0.0,2.637887716293335,-2.693477153778076,0.0,0.0,0.0,0.03243392935517992,0.9994738804112687,4.57509496980644,-4.377590287480444,0.6852493497190755,0.0,0.0,0.0,1.0
1717765979.5196216,map,True,False,4,2,0.0,0.0,2.637887716293335,-2.693477153778076,0.0,0.0,0.0,0.03243392935517992,0.9994738804112687,4.581751055867983,-4.37002501878262,0.685207993998914,0.0,0.0,0.0,1.0
1717765979.570071,map,True,False,4,2,0.0,0.0,2.637887716293335,-2.693477153778076,0.0,0.0,0.0,0.03243392935517992,0.9994738804112687,4.581751055867983,-4.37002501878262,0.685207993998914,0.0,0.0,0.0,1.0
1717765979.620169,map,True,False,4,2,0.0,0.0,2.637887716293335,-2.693477153778076,0.0,0.0,0.0,0.03243392935517992,0.9994738804112687,4.581751055867983,-4.37002501878262,0.685207993998914,0.0,0.0,0.0,1.0
1717765979.7197378,map,True,False,4,2,0.0,0.0,2.7531943321228027,-2.713589906692505,0.0,0.0,0.0,0.033327575234116474,0.9994444794207483,4.581751055867983,-4.37002501878262,0.685207993998914,0.0,0.0,0.0,1.0
1717765979.8189204,map,True,False,4,2,0.0,0.0,2.7531943321228027,-2.713589906692505,0.0,0.0,0.0,0.033327575234116474,0.9994444794207483,4.616430448869604,-4.231345262109592,0.6847164914445998,0.0,0.0,0.0,1.0
1717765980.1727395,map,True,False,4,2,0.0,0.0,2.7531943321228027,-2.713589906692505,0.0,0.0,0.0,0.033327575234116474,0.9994444794207483,4.551644858195187,-4.040076234932216,0.684140955702981,0.0,0.0,0.0,1.0
1717765980.2234328,map,True,False,4,2,0.0,0.0,2.7531943321228027,-2.713589906692505,0.0,0.0,0.0,0.033327575234116474,0.9994444794207483,4.551644858195187,-4.040076234932216,0.684140955702981,0.0,0.0,0.0,1.0
1717765980.32349,map,True,False,4,2,0.0,0.0,2.7531943321228027,-2.713589906692505,0.0,0.0,0.0,0.033327575234116474,0.9994444794207483,4.551644858195187,-4.040076234932216,0.684140955702981,0.0,0.0,0.0,1.0
1717765980.3734488,map,True,False,4,2,0.0,0.0,2.8768043518066406,-2.7331488132476807,0.0,0.0,0.0,0.03406379608602228,0.9994196548886934,4.551644858195187,-4.040076234932216,0.684140955702981,0.0,0.0,0.0,1.0
1717765980.4237134,map,True,False,4,2,0.0,0.0,2.8768043518066406,-2.7331488132476807,0.0,0.0,0.0,0.03406379608602228,0.9994196548886934,4.551644858195187,-4.040076234932216,0.684140955702981,0.0,0.0,0.0,1.0
1717765980.5236132,map,True,False,4,2,0.0,0.0,2.8768043518066406,-2.7331488132476807,0.0,0.0,0.0,0.03406379608602228,0.9994196548886934,4.58701401643293,-3.917191243928732,0.6814118652325378,0.0,0.0,0.0,1.0
1717765980.6230721,map,True,False,4,2,0.0,0.0,2.8768043518066406,-2.7331488132476807,0.0,0.0,0.0,0.03406379608602228,0.9994196548886934,4.58701401643293,-3.917191243928732,0.6814118652325378,0.0,0.0,0.0,1.0
1717765980.6733692,map,True,False,4,2,0.0,0.0,2.8768043518066406,-2.7331488132476807,0.0,0.0,0.0,0.03406379608602228,0.9994196548886934,4.58701401643293,-3.917191243928732,0.6814118652325378,0.0,0.0,0.0,1.0
1717765980.7730231,map,True,False,4,2,0.0,0.0,2.8768043518066406,-2.7331488132476807,0.0,0.0,0.0,0.03406379608602228,0.9994196548886934,4.58701401643293,-3.917191243928732,0.6814118652325378,0.0,0.0,0.0,1.0
1717765980.8230088,map,True,False,4,2,0.0,0.0,2.8768043518066406,-2.7331488132476807,0.0,0.0,0.0,0.03406379608602228,0.9994196548886934,4.598786706447766,-3.806552908133804,0.6812472420673351,0.0,0.0,0.0,1.0
1717765981.173954,map,True,False,3,2,0.0,0.0,3.008975028991699,-2.7528700828552246,0.0,0.0,0.0,0.034665139813045774,0.9993989896727962,4.772270198195753,-3.603070163931588,0.6823734938898065,0.0,0.0,0.0,1.0
1717765981.226236,map,True,False,3,2,0.0,0.0,3.008975028991699,-2.7528700828552246,0.0,0.0,0.0,0.034665139813045774,0.9993989896727962,4.772270198195753,-3.603070163931588,0.6823734938898065,0.0,0.0,0.0,1.0
1717765981.277671,map,True,False,3,2,0.0,0.0,3.008975028991699,-2.7528700828552246,0.0,0.0,0.0,0.034665139813045774,0.9993989896727962,4.772270198195753,-3.603070163931588,0.6823734938898065,0.0,0.0,0.0,1.0
1717765981.3771257,map,True,False,3,2,0.0,0.0,3.008975028991699,-2.7528700828552246,0.0,0.0,0.0,0.034665139813045774,0.9993989896727962,4.772270198195753,-3.603070163931588,0.6823734938898065,0.0,0.0,0.0,1.0
1717765981.476552,map,True,False,3,1,0.0,0.0,3.008975028991699,-2.7528700828552246,0.0,0.0,0.0,0.034665139813045774,0.9993989896727962,4.812774664883566,-3.497227741748895,0.68195013100218,0.0,0.0,0.0,1.0
1717765981.5266595,map,True,False,3,1,0.0,0.0,3.008975028991699,-2.7528700828552246,0.0,0.0,0.0,0.034665139813045774,0.9993989896727962,4.810551278286839,-3.487842944249027,0.6801546044035234,0.0,0.0,0.0,1.0
1717765981.626427,map,True,False,3,1,0.0,0.0,3.008975028991699,-2.7528700828552246,0.0,0.0,0.0,0.034665139813045774,0.9993989896727962,4.810551278286839,-3.487842944249027,0.6801546044035234,0.0,0.0,0.0,1.0
1717765981.6776748,map,True,False,3,1,0.0,0.0,3.16048526763916,-2.7757363319396973,0.0,0.0,0.0,0.032179398760080725,0.9994821101482093,4.810551278286839,-3.487842944249027,0.6801546044035234,0.0,0.0,0.0,1.0
1717765981.7755342,map,True,False,3,1,0.0,0.0,3.16048526763916,-2.7757363319396973,0.0,0.0,0.0,0.032179398760080725,0.9994821101482093,4.810551278286839,-3.487842944249027,0.6801546044035234,0.0,0.0,0.0,1.0
1717765981.8760796,map,True,False,3,1,0.0,0.0,3.16048526763916,-2.7757363319396973,0.0,0.0,0.0,0.032179398760080725,0.9994821101482093,4.824490131361468,-3.3778033448169418,0.6815771299403162,0.0,0.0,0.0,1.0
1717765981.9290097,map,True,False,3,1,0.0,0.0,3.16048526763916,-2.7757363319396973,0.0,0.0,0.0,0.032179398760080725,0.9994821101482093,4.754624262224675,-3.37171808274361,0.6802348670418152,0.0,0.0,0.0,1.0
1717765981.9791067,map,True,False,3,1,0.0,0.0,3.16048526763916,-2.7757363319396973,0.0,0.0,0.0,0.032179398760080725,0.9994821101482093,4.754624262224675,-3.37171808274361,0.6802348670418152,0.0,0.0,0.0,1.0
1717765982.0296597,map,True,False,3,1,0.0,0.0,3.16048526763916,-2.7757363319396973,0.0,0.0,0.0,0.032179398760080725,0.9994821101482093,4.754624262224675,-3.37171808274361,0.6802348670418152,0.0,0.0,0.0,1.0
1717765982.0794659,map,True,False,3,1,0.0,0.0,3.16048526763916,-2.7757363319396973,0.0,0.0,0.0,0.032179398760080725,0.9994821101482093,4.754624262224675,-3.37171808274361,0.6802348670418152,0.0,0.0,0.0,1.0
1717765982.1310213,map,True,False,3,1,0.0,0.0,3.16048526763916,-2.7757363319396973,0.0,0.0,0.0,0.032179398760080725,0.9994821101482093,4.754624262224675,-3.37171808274361,0.6802348670418152,0.0,0.0,0.0,1.0
1717765982.2289996,map,True,False,3,1,0.0,0.0,3.274111747741699,-2.78317928314209,0.0,0.0,0.0,0.03305775711320021,0.999453439956242,4.87126191113377,-3.434764644898413,0.6817445860132207,0.0,0.0,0.0,1.0
1717765982.2791703,map,True,False,3,1,0.0,0.0,3.274111747741699,-2.78317928314209,0.0,0.0,0.0,0.03305775711320021,0.999453439956242,4.8497641760555465,-3.514768155989305,0.6804553870745127,0.0,0.0,0.0,1.0
1717765982.3783407,map,True,False,3,1,0.0,0.0,3.274111747741699,-2.78317928314209,0.0,0.0,0.0,0.03305775711320021,0.999453439956242,4.8497641760555465,-3.514768155989305,0.6804553870745127,0.0,0.0,0.0,1.0
1717765982.4295151,map,True,False,3,1,0.0,0.0,3.274111747741699,-2.78317928314209,0.0,0.0,0.0,0.03305775711320021,0.999453439956242,4.8497641760555465,-3.514768155989305,0.6804553870745127,0.0,0.0,0.0,1.0
1717765982.481999,map,True,False,3,1,0.0,0.0,3.274111747741699,-2.78317928314209,0.0,0.0,0.0,0.03305775711320021,0.999453439956242,4.8497641760555465,-3.514768155989305,0.6804553870745127,0.0,0.0,0.0,1.0
1717765982.5331962,map,True,False,3,1,0.0,0.0,3.274111747741699,-2.78317928314209,0.0,0.0,0.0,0.03305775711320021,0.999453439956242,4.8497641760555465,-3.514768155989305,0.6804553870745127,0.0,0.0,0.0,1.0
1717765982.6312122,map,True,False,3,2,0.0,0.0,3.274111747741699,-2.78317928314209,0.0,0.0,0.0,0.03305775711320021,0.999453439956242,4.831714370547063,-3.706735846707126,0.682933189707639,0.0,0.0,0.0,1.0
1717765982.730773,map,True,False,3,2,0.0,0.0,3.274111747741699,-2.78317928314209,0.0,0.0,0.0,0.03305775711320021,0.999453439956242,4.831714370547063,-3.706735846707126,0.682933189707639,0.0,0.0,0.0,1.0
1717765982.8298783,map,True,False,3,2,0.0,0.0,3.274111747741699,-2.78317928314209,0.0,0.0,0.0,0.03305775711320021,0.999453439956242,4.831714370547063,-3.706735846707126,0.682933189707639,0.0,0.0,0.0,1.0
1717765982.9316225,map,True,False,2,2,0.49874686716791977,0.49874686716791977,3.3725101947784424,-2.8096201419830322,0.0,0.0,0.0,0.036666145217137354,0.9993275676347414,4.733118274876885,-3.8700496766941583,0.6820289591452189,0.0,0.0,0.0,1.0
1717765982.9821465,map,True,True,2,2,0.49874686716791977,0.49874686716791977,3.3725101947784424,-2.8096201419830322,0.0,0.0,0.0,0.036666145217137354,0.9993275676347414,4.733118274876885,-3.8700496766941583,0.6820289591452189,0.0,0.0,0.0,1.0
1717765983.033093,map,True,False,2,2,0.49874686716791977,0.49874686716791977,3.3725101947784424,-2.8096201419830322,0.0,0.0,0.0,0.036666145217137354,0.9993275676347414,4.733118274876885,-3.8700496766941583,0.6820289591452189,0.0,0.0,0.0,1.0
1717765983.1418066,map,True,True,2,2,0.49874686716791977,0.49874686716791977,3.3725101947784424,-2.8096201419830322,0.0,0.0,0.0,0.036666145217137354,0.9993275676347414,4.733118274876885,-3.8700496766941583,0.6820289591452189,0.0,0.0,0.0,1.0
1717765983.192581,map,True,False,2,2,0.49874686716791977,0.49874686716791977,3.3725101947784424,-2.8096201419830322,0.0,0.0,0.0,0.036666145217137354,0.9993275676347414,4.733118274876885,-3.8700496766941583,0.6820289591452189,0.0,0.0,0.0,1.0
1717765983.2392743,map,True,False,2,2,0.49874686716791977,0.49874686716791977,3.3725101947784424,-2.8096201419830322,0.0,0.0,0.0,0.036666145217137354,0.9993275676347414,4.732894000649441,-3.991300927295867,0.6824293748531153,0.0,0.0,0.0,1.0
1717765983.2898743,map,True,False,2,2,0.49874686716791977,0.49874686716791977,3.3725101947784424,-2.8096201419830322,0.0,0.0,0.0,0.036666145217137354,0.9993275676347414,4.717055847812868,-4.005319727933697,0.6825081044522866,0.0,0.0,0.0,1.0
1717765983.3404436,map,True,True,2,2,0.49874686716791977,0.49874686716791977,3.3725101947784424,-2.8096201419830322,0.0,0.0,0.0,0.036666145217137354,0.9993275676347414,4.717055847812868,-4.005319727933697,0.6825081044522866,0.0,0.0,0.0,1.0
1717765983.3908052,map,True,True,2,2,0.49874686716791977,0.49874686716791977,3.3725101947784424,-2.8096201419830322,0.0,0.0,0.0,0.036666145217137354,0.9993275676347414,4.717055847812868,-4.005319727933697,0.6825081044522866,0.0,0.0,0.0,1.0
1717765983.490876,map,True,False,2,2,0.49874686716791977,0.49874686716791977,3.3725101947784424,-2.8096201419830322,0.0,0.0,0.0,0.036666145217137354,0.9993275676347414,4.717055847812868,-4.005319727933697,0.6825081044522866,0.0,0.0,0.0,1.0
1717765983.590224,map,True,True,2,2,0.49874686716791977,0.49874686716791977,3.4854583740234375,-2.8137176036834717,0.0,0.0,0.0,0.036101199780266796,0.9993481448622715,4.768396521404126,-4.098943868692842,0.6827803315293246,0.0,0.0,0.0,1.0
1717765983.6407037,map,True,False,2,2,0.49874686716791977,0.49874686716791977,3.4854583740234375,-2.8137176036834717,0.0,0.0,0.0,0.036101199780266796,0.9993481448622715,4.768396521404126,-4.098943868692842,0.6827803315293246,0.0,0.0,0.0,1.0
1717765983.7398694,map,True,True,2,2,0.49874686716791977,0.49874686716791977,3.4854583740234375,-2.8137176036834717,0.0,0.0,0.0,0.036101199780266796,0.9993481448622715,4.768396521404126,-4.098943868692842,0.6827803315293246,0.0,0.0,0.0,1.0
1717765983.7904534,map,True,False,2,2,0.49874686716791977,0.49874686716791977,3.4854583740234375,-2.8137176036834717,0.0,0.0,0.0,0.036101199780266796,0.9993481448622715,4.768396521404126,-4.098943868692842,0.6827803315293246,0.0,0.0,0.0,1.0
1717765983.8405993,map,True,False,2,2,0.49874686716791977,0.49874686716791977,3.4854583740234375,-2.8137176036834717,0.0,0.0,0.0,0.036101199780266796,0.9993481448622715,4.768396521404126,-4.098943868692842,0.6827803315293246,0.0,0.0,0.0,1.0
1717765983.9411538,map,True,False,2,2,0.49874686716791977,0.49874686716791977,3.4854583740234375,-2.8137176036834717,0.0,0.0,0.0,0.036101199780266796,0.9993481448622715,4.830910568030289,-4.178857559432541,0.6829519504487025,0.0,0.0,0.0,1.0
1717765983.9898252,map,True,False,2,2,0.49874686716791977,0.49874686716791977,3.4854583740234375,-2.8137176036834717,0.0,0.0,0.0,0.036101199780266796,0.9993481448622715,4.830910568030289,-4.178857559432541,0.6829519504487025,0.0,0.0,0.0,1.0
1717765984.0408878,map,True,True,2,2,0.49874686716791977,0.49874686716791977,3.4854583740234375,-2.8137176036834717,0.0,0.0,0.0,0.036101199780266796,0.9993481448622715,4.830910568030289,-4.178857559432541,0.6829519504487025,0.0,0.0,0.0,1.0
1717765984.1413286,map,True,True,2,2,0.49874686716791977,0.49874686716791977,3.4854583740234375,-2.8137176036834717,0.0,0.0,0.0,0.036101199780266796,0.9993481448622715,4.830910568030289,-4.178857559432541,0.6829519504487025,0.0,0.0,0.0,1.0
1717765984.191026,map,True,False,2,2,0.49874686716791977,0.49874686716791977,3.617473602294922,-2.8429930210113525,0.0,0.0,0.0,0.03717041486591738,0.9993089433874324,4.830910568030289,-4.178857559432541,0.6829519504487025,0.0,0.0,0.0,1.0
1717765984.2428184,map,True,False,2,2,0.49874686716791977,0.49874686716791977,3.617473602294922,-2.8429930210113525,0.0,0.0,0.0,0.03717041486591738,0.9993089433874324,4.82649793912164,-4.174844377213706,0.6851771547826374,0.0,0.0,0.0,1.0
1717765984.2925901,map,True,False,2,2,0.49874686716791977,0.49874686716791977,3.617473602294922,-2.8429930210113525,0.0,0.0,0.0,0.03717041486591738,0.9993089433874324,4.83652588938392,-4.178438033061035,0.6830305512220622,0.0,0.0,0.0,1.0
1717765984.3431726,map,True,True,2,2,0.49874686716791977,0.49874686716791977,3.617473602294922,-2.8429930210113525,0.0,0.0,0.0,0.03717041486591738,0.9993089433874324,4.83652588938392,-4.178438033061035,0.6830305512220622,0.0,0.0,0.0,1.0
1717765984.3931577,map,True,False,2,2,0.49874686716791977,0.49874686716791977,3.617473602294922,-2.8429930210113525,0.0,0.0,0.0,0.03717041486591738,0.9993089433874324,4.83652588938392,-4.178438033061035,0.6830305512220622,0.0,0.0,0.0,1.0
1717765984.443586,map,True,False,2,2,0.49874686716791977,0.49874686716791977,3.617473602294922,-2.8429930210113525,0.0,0.0,0.0,0.03717041486591738,0.9993089433874324,4.83652588938392,-4.178438033061035,0.6830305512220622,0.0,0.0,0.0,1.0
1717765984.543649,map,True,False,2,2,0.49874686716791977,0.49874686716791977,3.617473602294922,-2.8429930210113525,0.0,0.0,0.0,0.03717041486591738,0.9993089433874324,4.83652588938392,-4.178438033061035,0.6830305512220622,0.0,0.0,0.0,1.0
1717765984.6439037,map,True,True,2,2,0.49874686716791977,0.49874686716791977,3.617473602294922,-2.8429930210113525,0.0,0.0,0.0,0.03717041486591738,0.9993089433874324,4.852328239271679,-4.155766085376963,0.6892156180886663,0.0,0.0,0.0,1.0
1717765984.7428656,map,True,True,2,2,0.49874686716791977,0.49874686716791977,3.617473602294922,-2.8429930210113525,0.0,0.0,0.0,0.03717041486591738,0.9993089433874324,4.852328239271679,-4.155766085376963,0.6892156180886663,0.0,0.0,0.0,1.0
1717765984.7927854,map,True,False,2,2,0.49874686716791977,0.49874686716791977,3.617473602294922,-2.8429930210113525,0.0,0.0,0.0,0.03717041486591738,0.9993089433874324,4.852328239271679,-4.155766085376963,0.6892156180886663,0.0,0.0,0.0,1.0
1717765984.8435113,map,True,False,2,2,0.49874686716791977,0.49874686716791977,3.617473602294922,-2.8429930210113525,0.0,0.0,0.0,0.03717041486591738,0.9993089433874324,4.852328239271679,-4.155766085376963,0.6892156180886663,0.0,0.0,0.0,1.0
1717765984.943432,map,True,True,2,2,0.49874686716791977,0.49874686716791977,3.617473602294922,-2.8429930210113525,0.0,0.0,0.0,0.03717041486591738,0.9993089433874324,4.889728875031425,-4.193154199412193,0.6894202278986793,0.0,0.0,0.0,1.0
1717765985.0465872,map,True,True,2,2,0.49874686716791977,0.49874686716791977,3.710820198059082,-2.8824946880340576,0.0,0.0,0.0,0.03848812000442606,0.9992590632892552,4.889728875031425,-4.193154199412193,0.6894202278986793,0.0,0.0,0.0,1.0
1717765985.0955424,map,True,True,2,2,0.49874686716791977,0.49874686716791977,3.710820198059082,-2.8824946880340576,0.0,0.0,0.0,0.03848812000442606,0.9992590632892552,4.889728875031425,-4.193154199412193,0.6894202278986793,0.0,0.0,0.0,1.0
1717765985.1463776,map,True,True,2,2,0.49874686716791977,0.49874686716791977,3.710820198059082,-2.8824946880340576,0.0,0.0,0.0,0.03848812000442606,0.9992590632892552,4.889728875031425,-4.193154199412193,0.6894202278986793,0.0,0.0,0.0,1.0
1717765985.2466161,map,True,False,2,2,0.49874686716791977,0.49874686716791977,3.710820198059082,-2.8824946880340576,0.0,0.0,0.0,0.03848812000442606,0.9992590632892552,4.924255391002899,-4.23630407663578,0.6896412712751447,0.0,0.0,0.0,1.0
1717765985.2968824,map,True,False,2,2,0.49874686716791977,0.49874686716791977,3.710820198059082,-2.8824946880340576,0.0,0.0,0.0,0.03848812000442606,0.9992590632892552,4.924255391002899,-4.23630407663578,0.6896412712751447,0.0,0.0,0.0,1.0
1717765985.3484013,map,True,False,2,2,0.49874686716791977,0.49874686716791977,3.710820198059082,-2.8824946880340576,0.0,0.0,0.0,0.03848812000442606,0.9992590632892552,4.924255391002899,-4.23630407663578,0.6896412712751447,0.0,0.0,0.0,1.0
1717765985.3972895,map,True,True,2,2,0.49874686716791977,0.49874686716791977,3.710820198059082,-2.8824946880340576,0.0,0.0,0.0,0.03848812000442606,0.9992590632892552,4.924255391002899,-4.23630407663578,0.6896412712751447,0.0,0.0,0.0,1.0
1717765985.4502804,map,True,False,2,2,0.49874686716791977,0.49874686716791977,3.710820198059082,-2.8824946880340576,0.0,0.0,0.0,0.03848812000442606,0.9992590632892552,4.924255391002899,-4.23630407663578,0.6896412712751447,0.0,0.0,0.0,1.0
1717765985.5504475,map,True,True,2,2,0.49874686716791977,0.49874686716791977,3.710820198059082,-2.8824946880340576,0.0,0.0,0.0,0.03848812000442606,0.9992590632892552,4.924255391002899,-4.23630407663578,0.6896412712751447,0.0,0.0,0.0,1.0
1717765985.5988917,map,True,False,2,2,0.49874686716791977,0.49874686716791977,3.710820198059082,-2.8824946880340576,0.0,0.0,0.0,0.03848812000442606,0.9992590632892552,4.924255391002899,-4.23630407663578,0.6896412712751447,0.0,0.0,0.0,1.0
1717765985.6997776,map,True,False,2,2,0.49874686716791977,0.49874686716791977,3.710820198059082,-2.8824946880340576,0.0,0.0,0.0,0.03848812000442606,0.9992590632892552,4.924255391002899,-4.23630407663578,0.6896412712751447,0.0,0.0,0.0,1.0
1717765985.7975721,map,True,False,1,2,0.0,0.0,3.849146604537964,-2.9142730236053467,0.0,0.0,0.0,0.039331083138719726,0.9992262409755582,4.924255391002899,-4.23630407663578,0.6896412712751447,0.0,0.0,0.0,1.0
1717765997.196005,map,True,False,4,2,0.0,0.0,2.8374335765838623,-2.734269380569458,0.0,0.0,0.0,0.03562106689721566,0.9993653667813497,4.721957950521616,-4.145723698846024,0.6840754124458756,0.0,0.0,0.0,1.0
1717765997.2970004,map,True,False,4,2,0.0,0.0,2.8374335765838623,-2.734269380569458,0.0,0.0,0.0,0.03562106689721566,0.9993653667813497,4.68465361004982,-4.185297234571584,0.6841652833917676,0.0,0.0,0.0,1.0
1717765997.3965695,map,True,False,4,2,0.0,0.0,2.8374335765838623,-2.734269380569458,0.0,0.0,0.0,0.03562106689721566,0.9993653667813497,4.694996828630507,-4.141671242876554,0.6808209571910389,0.0,0.0,0.0,1.0
1717765997.4537144,map,True,False,4,2,0.0,0.0,2.8374335765838623,-2.734269380569458,0.0,0.0,0.0,0.03562106689721566,0.9993653667813497,4.694996828630507,-4.141671242876554,0.6808209571910389,0.0,0.0,0.0,1.0
1717765997.5547132,map,True,False,4,2,0.0,0.0,2.8374335765838623,-2.734269380569458,0.0,0.0,0.0,0.03562106689721566,0.9993653667813497,4.694996828630507,-4.141671242876554,0.6808209571910389,0.0,0.0,0.0,1.0
1717765997.6542795,map,True,False,4,2,0.0,0.0,2.8374335765838623,-2.734269380569458,0.0,0.0,0.0,0.03562106689721566,0.9993653667813497,4.685187359436506,-4.1577064158392005,0.6806703217798512,0.0,0.0,0.0,1.0
1717765997.703822,map,True,False,4,2,0.0,0.0,2.8374335765838623,-2.734269380569458,0.0,0.0,0.0,0.03562106689721566,0.9993653667813497,4.703341334680806,-4.168891949660732,0.6806490067749752,0.0,0.0,0.0,1.0
1717765997.7962992,map,True,False,4,2,0.0,0.0,2.8374335765838623,-2.734269380569458,0.0,0.0,0.0,0.03562106689721566,0.9993653667813497,4.703341334680806,-4.168891949660732,0.6806490067749752,0.0,0.0,0.0,1.0
