car_pos_meter , car_pos_cell, car_speed, ped_pos_meter, ped_pos_cell, ped_speed
-3.727273, 3, 1, 3.994347, 3, 1
-3.719727, 3, 1, 3.979376, 3, 1
-3.712182, 3, 2, 3.964383, 3, 1
-3.697037, 3, 2, 3.957234, 3, 1
-3.681891, 3, 1, 3.943082, 3, 1
-3.674345, 3, 1, 3.927711, 3, 1
-3.6668, 3, 2, 3.913113, 3, 1
-3.651655, 3, 1, 3.899274, 3, 1
-3.644109, 3, 2, 3.892379, 3, 1
-3.628964, 3, 1, 3.879747, 3, 1
-3.621418, 3, 1, 3.867981, 3, 1
-3.613873, 3, 1, 3.857782, 3, 1
-3.606327, 3, 2, 3.848028, 3, 1
-3.591182, 3, 1, 3.843113, 3, 1
-3.583637, 3, 2, 3.833066, 3, 1
-3.568491, 3, 1, 3.822712, 3, 1
-3.560946, 3, 1, 3.812243, 3, 1
-3.5534, 3, 1, 3.801218, 3, 1
-3.545855, 3, 1, 3.795794, 3, 1
-3.538309, 3, 1, 3.784658, 3, 1
-3.530764, 3, 1, 3.77337, 3, 1
-3.523218, 3, 2, 3.762091, 3, 1
-3.508073, 3, 2, 3.750287, 3, 1
-3.492928, 3, 1, 3.744234, 3, 1
-3.485382, 3, 2, 3.731699, 3, 1
-3.470237, 3, 1, 3.719031, 3, 1
-3.462691, 3, 1, 3.706032, 3, 1
-3.455146, 3, 2, 3.692452, 3, 1
-3.44, 3, 1, 3.685617, 3, 1
-3.432455, 3, 1, 3.671469, 3, 1
-3.424909, 3, 1, 3.656785, 3, 1
-3.417364, 3, 1, 3.641795, 3, 1
-3.409818, 3, 2, 3.626475, 3, 1
-3.394673, 3, 1, 3.618792, 3, 1
-3.387128, 3, 1, 3.603378, 3, 1
-3.379582, 3, 1, 3.587574, 3, 1
-3.372037, 3, 1, 3.57156, 3, 1
-3.364491, 3, 2, 3.554863, 3, 1
-3.349346, 3, 1, 3.546458, 3, 1
-3.3418, 3, 1, 3.529182, 3, 1
-3.334255, 3, 2, 3.511979, 3, 1
-3.319109, 3, 1, 3.494157, 3, 1
-3.311564, 3, 2, 3.475707, 3, 1
-3.296419, 3, 2, 3.466395, 3, 1
-3.281273, 3, 1, 3.447698, 3, 1
-3.273728, 3, 1, 3.429311, 3, 1
-3.266182, 3, 1, 3.410636, 3, 1
-3.258637, 3, 2, 3.391551, 3, 1
-3.243491, 3, 1, 3.38161, 3, 1
-3.235946, 3, 1, 3.361279, 3, 1
-3.2284, 3, 2, 3.340278, 3, 1
-3.213255, 3, 2, 3.31849, 2, 1
-3.19811, 3, 2, 3.296268, 2, 1
-3.182964, 3, 2, 3.285285, 2, 1
-3.167819, 3, 2, 3.262758, 2, 1
-3.152673, 3, 2, 3.239713, 2, 1
-3.137528, 3, 2, 3.216034, 2, 1
-3.122383, 3, 2, 3.191522, 2, 1
-3.107237, 3, 2, 3.179171, 2, 1
-3.092092, 3, 2, 3.153988, 2, 1
-3.076946, 3, 2, 3.128735, 2, 1
-3.061801, 3, 2, 3.102886, 2, 1
-3.046656, 3, 2, 3.076795, 2, 1
-3.03151, 3, 2, 3.063513, 2, 1
-3.016365, 3, 2, 3.03703, 2, 1
-3.00122, 3, 2, 3.010234, 2, 1
-2.986074, 2, 2, 2.98277, 2, 1
-2.970929, 2, 1, 2.955259, 2, 1
-2.963383, 2, 1, 2.941332, 2, 1
-2.955838, 2, 2, 2.913156, 2, 1
-2.940693, 2, 2, 2.885336, 2, 1
-2.925547, 2, 1, 2.857501, 2, 1
-2.918002, 2, 1, 2.830251, 2, 1
-2.910456, 2, 2, 2.816757, 2, 1
-2.895311, 2, 1, 2.790135, 2, 1
-2.887765, 2, 1, 2.764253, 2, 1
-2.88022, 2, 2, 2.739265, 2, 1
-2.865074, 2, 1, 2.715848, 2, 1
-2.857529, 2, 2, 2.704298, 2, 1
-2.842384, 2, 2, 2.681251, 2, 1
-2.827238, 2, 2, 2.658512, 2, 1
-2.812093, 2, 1, 2.635723, 2, 1
-2.804547, 2, 1, 2.612839, 2, 1
-2.797002, 2, 2, 2.60171, 2, 1
-2.781857, 2, 2, 2.578885, 2, 1
-2.766711, 2, 2, 2.556239, 2, 1
-2.751566, 2, 2, 2.533123, 2, 1
-2.73642, 2, 1, 2.509144, 2, 1
-2.728875, 2, 2, 2.496949, 2, 1
-2.71373, 2, 2, 2.472925, 2, 1
-2.698584, 2, 1, 2.450192, 2, 1
-2.691039, 2, 1, 2.428439, 2, 1
-2.683493, 2, 1, 2.407078, 2, 1
-2.675948, 2, 1, 2.397202, 2, 1
-2.668402, 2, 2, 2.375956, 2, 1
-2.653257, 2, 2, 2.354964, 2, 1
-2.638111, 2, 2, 2.333902, 2, 1
-2.622966, 2, 1, 2.31152, 2, 1
-2.615421, 2, 2, 2.289297, 2, 1
-2.600275, 2, 2, 2.27856, 2, 1
-2.58513, 2, 1, 2.256123, 2, 1
-2.577584, 2, 1, 2.23265, 2, 1
-2.570039, 2, 2, 2.207085, 1, 1
-2.554893, 2, 2, 2.181973, 1, 1
-2.539748, 2, 2, 2.169591, 1, 1
-2.524603, 2, 2, 2.144611, 1, 1
-2.509457, 2, 2, 2.120208, 1, 1
-2.494312, 2, 2, 2.096295, 1, 1
-2.479167, 2, 2, 2.084713, 1, 1
-2.464021, 2, 2, 2.061079, 1, 1
-2.448876, 2, 2, 2.038599, 1, 1
-2.43373, 2, 2, 2.015962, 1, 1
-2.418585, 2, 2, 1.99294, 1, 1
-2.40344, 2, 2, 1.969435, 1, 1
-2.388294, 2, 2, 1.957094, 1, 1
-2.373149, 2, 2, 1.932786, 1, 1
-2.358003, 2, 2, 1.908659, 1, 1
-2.342858, 2, 2, 1.883722, 1, 1
-2.327713, 2, 2, 1.85901, 1, 1
-2.312567, 2, 2, 1.846585, 1, 1
-2.297422, 2, 2, 1.82169, 1, 1
-2.282276, 2, 2, 1.796484, 1, 1
-2.267131, 2, 2, 1.770679, 1, 1
-2.251986, 2, 2, 1.745431, 1, 1
-2.23684, 2, 2, 1.732698, 1, 1
-2.221695, 2, 2, 1.707687, 1, 1
-2.20655, 2, 2, 1.682159, 1, 1
-2.191404, 2, 2, 1.65607, 1, 1
-2.176259, 2, 2, 1.630018, 1, 1
-2.161114, 2, 2, 1.61651, 1, 1
-2.145968, 2, 2, 1.590405, 1, 1
-2.130823, 2, 2, 1.563952, 1, 1
-2.115677, 2, 2, 1.537631, 1, 1
-2.100532, 2, 2, 1.512278, 1, 1
-2.085387, 2, 2, 1.499226, 1, 1
-2.070241, 2, 2, 1.474645, 1, 1
-2.055096, 2, 2, 1.449399, 1, 1
-2.03995, 2, 2, 1.424791, 1, 1
-2.024805, 2, 2, 1.400872, 1, 1
-2.00966, 2, 2, 1.388796, 1, 1
-1.994514, 1, 2, 1.365265, 1, 1
-1.979369, 1, 2, 1.340959, 1, 1
-1.964223, 1, 2, 1.31667, 1, 1
-1.949078, 1, 2, 1.293414, 1, 1
-1.933933, 1, 2, 1.281562, 1, 1
-1.918787, 1, 2, 1.258913, 1, 1
-1.903642, 1, 2, 1.235321, 1, 1
-1.888496, 1, 2, 1.211944, 1, 1
-1.873351, 1, 2, 1.188257, 1, 1
-1.858206, 1, 2, 1.176195, 1, 1
-1.84306, 1, 2, 1.152105, 1, 1
-1.827915, 1, 2, 1.127447, 1, 1
-1.812769, 1, 2, 1.102026, 0, 1
-1.797624, 1, 2, 1.076509, 0, 1
-1.782479, 1, 2, 1.063703, 0, 1
-1.767333, 1, 2, 1.037363, 0, 1
-1.752188, 1, 2, 1.010455, 0, 1
-1.737043, 1, 2, 0.9826837, 0, 1
-1.721897, 1, 2, 0.9548542, 0, 1
-1.706752, 1, 2, 0.9408758, 0, 1
-1.691606, 1, 2, 0.9124317, 0, 1
-1.676461, 1, 2, 0.8841479, 0, 1
-1.661316, 1, 2, 0.8556688, 0, 1
-1.64617, 1, 2, 0.828419, 0, 1
-1.631025, 1, 2, 0.8152962, 0, 1
-1.615879, 1, 2, 0.7895427, 0, 1
-1.600734, 1, 2, 0.7647169, 0, 1
-1.585589, 1, 2, 0.7403316, 0, 1
-1.570443, 1, 2, 0.7167728, 0, 1
-1.555298, 1, 2, 0.7052462, 0, 1
-1.540152, 1, 2, 0.6827245, 0, 1
-1.525007, 1, 2, 0.660701, 0, 1
-1.509862, 1, 2, 0.6390498, 0, 1
-1.494716, 1, 2, 0.617353, 0, 1
-1.479571, 1, 2, 0.6066265, 0, 1
-1.464426, 1, 2, 0.5854878, 0, 1
-1.44928, 1, 2, 0.563905, 0, 1
-1.434135, 1, 2, 0.5422368, 0, 1
-1.418989, 1, 2, 0.5207477, 0, 1
-1.403844, 1, 2, 0.5094578, 0, 1
-1.388698, 1, 2, 0.4871426, 0, 1
-1.373553, 1, 2, 0.4637802, 0, 1
-1.358407, 1, 2, 0.4400444, 0, 1
-1.343262, 1, 2, 0.4160151, 0, 1
-1.328116, 1, 2, 0.4036529, 0, 1
-1.312971, 1, 2, 0.3784425, 0, 1
-1.297825, 1, 2, 0.3529201, 0, 1
-1.28268, 1, 2, 0.3270934, 0, 1
-1.267534, 1, 2, 0.3005719, 0, 1
-1.252389, 1, 2, 0.2873008, 0, 1
-1.237243, 1, 2, 0.2607861, 0, 1
-1.222098, 1, 2, 0.2342196, 0, 1
-1.206952, 1, 2, 0.2074261, 0, 1
-1.191807, 1, 2, 0.181478, 0, 1
-1.176661, 1, 2, 0.1689582, 0, 1
-1.161516, 1, 2, 0.1436362, 0, 1
-1.146371, 1, 2, 0.1188717, 0, 1
-1.131225, 1, 2, 0.09402585, 0, 1
-1.11608, 1, 2, 0.07032967, 0, 1
-1.100934, 1, 2, 0.05872726, 0, 1
-1.085789, 1, 2, 0.0364213, 0, 1
-1.070643, 1, 2, 0.01410794, 0, 1
-1.055498, 1, 2, -0.007697582, 0, 1
-1.040352, 1, 2, -0.02873421, 0, 1
-1.025207, 1, 2, -0.03914595, 0, 1
-1.010061, 1, 2, -0.05994797, 0, 1
-0.9949158, 0, 2, -0.08077049, 0, 1
-0.9797703, 0, 2, -0.1026325, 0, 1
-0.9646248, 0, 2, -0.1249428, 0, 1
-0.9494793, 0, 2, -0.136301, 0, 1
-0.9343339, 0, 2, -0.1593704, 0, 1
-0.9191884, 0, 2, -0.1830335, 0, 1
-0.904043, 0, 2, -0.206985, 0, 1
-0.8888975, 0, 2, -0.2313776, 0, 1
-0.873752, 0, 2, -0.243587, 0, 1
-0.8586065, 0, 2, -0.2683234, 0, 1
-0.843461, 0, 2, -0.2943864, 0, 1
-0.8283156, 0, 2, -0.3207688, 0, 1
-0.8131701, 0, 2, -0.3474379, 0, 1
-0.7980246, 0, 2, -0.3606586, 0, 1
-0.7828791, 0, 2, -0.3875961, 0, 1
-0.7677336, 0, 2, -0.4137087, 0, 1
-0.7525882, 0, 2, -0.4401202, 0, 1
-0.7374427, 0, 2, -0.4664249, 0, 1
-0.7222973, 0, 2, -0.4796906, 0, 1
-0.7071518, 0, 2, -0.5061522, 0, 1
-0.6920063, 0, 2, -0.5323043, 0, 1
-0.6768608, 0, 2, -0.5581942, 0, 1
-0.6617153, 0, 2, -0.5709724, 0, 1
-0.6465698, 0, 2, -0.5951633, 0, 1
-0.6314244, 0, 2, -0.6185384, 0, 1
-0.6162789, 0, 2, -0.6407223, 0, 1
-0.6011334, 0, 2, -0.6620207, 0, 1
-0.585988, 0, 2, -0.6829367, 0, 1
-0.5708425, 0, 2, -0.6932945, 0, 1
-0.555697, 0, 2, -0.7143259, 0, 1
-0.5405515, 0, 2, -0.7351341, 0, 1
-0.5254061, 0, 2, -0.7557883, 0, 1
-0.5102606, 0, 2, -0.7758994, 0, 1
-0.4951151, 0, 2, -0.7856779, 0, 1
-0.4799696, 0, 2, -0.8046637, 0, 1
-0.4648242, 0, 2, -0.8231463, 0, 1
-0.4496787, 0, 2, -0.8416619, 0, 1
-0.4345332, 0, 2, -0.8601933, 0, 1
-0.4193877, 0, 2, -0.8693628, 0, 1
-0.4042422, 0, 2, -0.8877201, 0, 1
-0.3890968, 0, 2, -0.9060426, 0, 1
-0.3739513, 0, 2, -0.9249563, 0, 1
-0.3588059, 0, 2, -0.9433651, 0, 1
-0.3436604, 0, 2, -0.9523563, 0, 1
-0.3285149, 0, 2, -0.9704227, 0, 1
-0.3133695, 0, 2, -0.9873848, 0, 1
-0.298224, 0, 2, -1.004324, 0, 1
-0.2830786, 0, 2, -1.021152, 0, 1
-0.2679331, 0, 2, -1.029473, 0, 1
-0.2527877, 0, 2, -1.046193, 0, 1
-0.2376422, 0, 2, -1.062695, 0, 1
-0.2224968, 0, 2, -1.079409, 0, 1
-0.2073513, 0, 2, -1.095801, 0, 1
-0.1922059, 0, 2, -1.103679, 0, 1
-0.1770604, 0, 2, -1.118693, -1, 1
-0.161915, 0, 2, -1.133394, -1, 1
-0.1467695, 0, 2, -1.149034, -1, 1
-0.131624, 0, 2, -1.16494, -1, 1
-0.1164786, 0, 2, -1.173194, -1, 1
-0.1013331, 0, 2, -1.189738, -1, 1
-0.08618769, 0, 2, -1.206291, -1, 1
-0.07104223, 0, 2, -1.222834, -1, 1
-0.05589678, 0, 2, -1.239746, -1, 1
-0.04075133, 0, 2, -1.248182, -1, 1
-0.02560587, 0, 2, -1.263074, -1, 1
-0.01046042, 0, 2, -1.27608, -1, 1
0.004685034, 0, 2, -1.289992, -1, 1
0.01983049, 0, 2, -1.302799, -1, 1
0.03497594, 0, 2, -1.308643, -1, 1
0.05012139, 0, 2, -1.318492, -1, 1
0.06526685, 0, 2, -1.328892, -1, 1
0.0804123, 0, 2, -1.339551, -1, 1
0.09555776, 0, 2, -1.349903, -1, 1
0.1107032, 0, 2, -1.355015, -1, 1
0.1258487, 0, 2, -1.364632, -1, 1
0.1409941, 0, 2, -1.373231, -1, 1
0.1561396, 0, 2, -1.3815, -1, 1
0.171285, 0, 2, -1.389558, -1, 1
0.1864305, 0, 2, -1.393524, -1, 1
0.2015759, 0, 2, -1.401135, -1, 1
0.2167214, 0, 2, -1.408538, -1, 1
0.2318668, 0, 2, -1.416068, -1, 1
0.2470123, 0, 2, -1.423208, -1, 1
0.2621577, 0, 2, -1.42663, -1, 1
0.2773032, 0, 2, -1.432784, -1, 1
0.2924486, 0, 2, -1.438159, -1, 1
0.3075941, 0, 2, -1.442423, -1, 1
0.3227396, 0, 2, -1.445733, -1, 1
0.337885, 0, 2, -1.446843, -1, 1
0.3530305, 0, 2, -1.449258, -1, 1
0.368176, 0, 2, -1.451767, -1, 1
0.3833214, 0, 2, -1.454071, -1, 1
0.3984669, 0, 2, -1.456896, -1, 1
0.4136124, 0, 2, -1.458348, -1, 1
0.4287578, 0, 2, -1.461299, -1, 1
0.4439033, 0, 2, -1.464643, -1, 1
0.4590488, 0, 2, -1.46773, -1, 1
0.4741943, 0, 2, -1.470805, -1, 1
0.4893397, 0, 2, -1.47259, -1, 1
0.5044852, 0, 2, -1.475734, -1, 1
0.5196307, 0, 2, -1.478732, -1, 1
0.5347762, 0, 2, -1.481373, -1, 1
0.5499216, 0, 2, -1.483276, -1, 1
0.5650671, 0, 2, -1.484591, -1, 1
0.5802126, 0, 2, -1.485281, -1, 1
0.5953581, 0, 2, -1.486078, -1, 1
0.6105036, 0, 2, -1.486828, -1, 1
0.625649, 0, 2, -1.487046, -1, 1
0.6407945, 0, 2, -1.48688, -1, 1
0.65594, 0, 2, -1.486922, -1, 1
0.6710854, 0, 2, -1.48696, -1, 1
0.6862309, 0, 2, -1.486669, -1, 1
0.7013764, 0, 2, -1.4865, -1, 1
0.7165219, 0, 2, -1.486337, -1, 1
0.7316673, 0, 2, -1.486649, -1, 1
0.7468128, 0, 2, -1.485697, -1, 1
0.7619583, 0, 2, -1.485507, -1, 1
0.7771038, 0, 2, -1.484964, -1, 1
0.7922493, 0, 2, -1.483905, -1, 1
0.8073947, 0, 2, -1.483383, -1, 1
0.8225402, 0, 2, -1.481673, -1, 1
0.8376856, 0, 2, -1.479347, -1, 1
0.8528311, 0, 2, -1.476466, -1, 1
0.8679766, 0, 2, -1.474934, -1, 1
0.8831221, 0, 2, -1.471679, -1, 1
0.8982676, 0, 2, -1.46875, -1, 1
0.913413, 0, 2, -1.466794, -1, 1
0.9285585, 0, 2, -1.466614, -1, 1
0.943704, 0, 2, -1.466973, -1, 1
0.9588495, 0, 2, -1.469005, -1, 1
0.973995, 0, 2, -1.471928, -1, 1
0.9891405, 0, 2, -1.47565, -1, 1
1.004286, -1, 2, -1.479029, -1, 1
1.019431, -1, 2, -1.480569, -1, 1
1.034577, -1, 2, -1.481341, -1, 1
1.049722, -1, 2, -1.482168, -1, 1
1.064868, -1, 2, -1.482805, -1, 1
1.080013, -1, 2, -1.483698, -1, 1
1.095159, -1, 2, -1.483882, -1, 1
1.110304, -1, 2, -1.484257, -1, 1
1.12545, -1, 2, -1.483696, -1, 1
1.140595, -1, 2, -1.482802, -1, 1
1.155741, -1, 2, -1.481557, -1, 1
1.170886, -1, 2, -1.480646, -1, 1
1.186032, -1, 2, -1.478718, -1, 1
1.201177, -1, 2, -1.476172, -1, 1
1.216323, -1, 2, -1.473454, -1, 1
1.231468, -1, 2, -1.470542, -1, 1
1.246614, -1, 2, -1.468849, -1, 1
1.261759, -1, 2, -1.465227, -1, 1
1.276904, -1, 2, -1.461261, -1, 1
1.29205, -1, 2, -1.457117, -1, 1
1.307195, -1, 2, -1.452571, -1, 1
1.322341, -1, 2, -1.450062, -1, 1
1.337486, -1, 2, -1.44512, -1, 1
1.352632, -1, 2, -1.43989, -1, 1
1.367777, -1, 2, -1.434849, -1, 1
1.382923, -1, 2, -1.430166, -1, 1
1.398068, -1, 2, -1.427825, -1, 1
1.413214, -1, 2, -1.422915, -1, 1
1.428359, -1, 2, -1.417625, -1, 1
1.443505, -1, 2, -1.413428, -1, 1
1.45865, -1, 2, -1.410885, -1, 1
1.473795, -1, 2, -1.409888, -1, 1
1.488941, -1, 2, -1.408067, -1, 1
1.504086, -1, 2, -1.406466, -1, 1
1.519232, -1, 2, -1.404099, -1, 1
1.534377, -1, 2, -1.40078, -1, 1
1.549522, -1, 2, -1.398994, -1, 1
1.564668, -1, 2, -1.395333, -1, 1
1.579813, -1, 2, -1.392356, -1, 1
1.594959, -1, 2, -1.389604, -1, 1
1.610104, -1, 2, -1.387432, -1, 1
1.625249, -1, 2, -1.386198, -1, 1
1.640395, -1, 2, -1.383568, -1, 1
1.65554, -1, 2, -1.38111, -1, 1
1.670686, -1, 2, -1.378726, -1, 1
1.685831, -1, 2, -1.37633, -1, 1
1.700976, -1, 2, -1.375108, -1, 1
1.716122, -1, 2, -1.372983, -1, 1
1.731267, -1, 2, -1.370911, -1, 1
1.746412, -1, 2, -1.369034, -1, 1
1.761558, -1, 2, -1.367436, -1, 1
1.776703, -1, 2, -1.366072, -1, 1
1.791849, -1, 2, -1.365532, -1, 1
