car_pos_meter , car_pos_cell, car_speed, ped_pos_meter, ped_pos_cell, ped_speed
-30.37037, 30, 2, 4.083707, 31, 1
-30.24696, 30, 2, 4.07542, 31, 1
-30.12356, 30, 2, 4.059376, 31, 1
-30.00015, 30, 2, 4.043611, 31, 1
-27.16179, 27, 2, 3.752528, 29, 1
-24.07662, 24, 2, 3.498853, 27, 1
-20.99145, 20, 2, 3.28801, 25, 1
-17.90628, 17, 2, 3.174487, 24, 1
-14.82111, 14, 2, 3.165809, 24, 1
-11.73593, 11, 2, 3.169352, 24, 1
-8.650743, 8, 2, 3.16697, 24, 1
-5.565553, 5, 2, 3.151286, 24, 1
-2.480364, 2, 2, 3.12115, 24, 1
0.6048206, 0, 2, 2.975503, 23, 1
3.690007, -3, 2, 2.64686, 20, 1
6.775196, -6, 2, 2.131882, 16, 1
9.736978, -9, 2, 1.535066, 11, 1
12.82216, -12, 2, 0.8852882, 6, 1
15.90733, -15, 2, 0.2658329, 2, 1
18.9925, -18, 2, -0.2948537, -2, 1
22.07768, -22, 2, -0.764194, -5, 1
25.16285, -25, 2, -1.108924, -8, 1
28.24802, -28, 2, -1.257527, -9, 1
31.33319, -31, 2, -1.182228, -9, 1
34.41836, -34, 2, -1.079006, -8, 1
37.50353, -37, 2, -1.002799, -7, 1
