car_pos_meter , car_pos_cell, car_speed, ped_pos_meter, ped_pos_cell, ped_speed
-25.625, 25, 2, 3.998339, 25, 1
-25.52088, 25, 2, 3.98259, 25, 1
-25.41675, 25, 2, 3.96714, 25, 1
-25.31263, 25, 2, 3.952061, 25, 1
-25.2085, 25, 2, 3.944731, 25, 1
-25.10438, 25, 2, 3.93057, 25, 1
-25.00025, 25, 2, 3.916796, 25, 1
-24.89613, 24, 2, 3.903171, 25, 1
-24.792, 24, 2, 3.89632, 25, 1
-24.68788, 24, 2, 3.882769, 25, 1
-24.58375, 24, 2, 3.868741, 25, 1
-24.47963, 24, 2, 3.855212, 25, 1
-24.37551, 24, 2, 3.840928, 24, 1
-24.27138, 24, 2, 3.826358, 24, 1
-24.16726, 24, 2, 3.818892, 24, 1
-24.06313, 24, 2, 3.804133, 24, 1
-23.95901, 23, 2, 3.789125, 24, 1
-23.85488, 23, 2, 3.773645, 24, 1
-23.75076, 23, 2, 3.757895, 24, 1
-23.64663, 23, 2, 3.742145, 24, 1
-23.54251, 23, 2, 3.733956, 24, 1
-23.43839, 23, 2, 3.717916, 24, 1
-23.33426, 23, 2, 3.701715, 24, 1
-23.23013, 23, 2, 3.685739, 23, 1
-23.12601, 23, 2, 3.677519, 23, 1
-23.02189, 23, 2, 3.66161, 23, 1
-22.91776, 22, 2, 3.64584, 23, 1
-22.81364, 22, 2, 3.630219, 23, 1
-22.70951, 22, 2, 3.614731, 23, 1
-22.60539, 22, 2, 3.606894, 23, 1
-22.50126, 22, 2, 3.591252, 23, 1
-22.39714, 22, 2, 3.575887, 23, 1
-22.29301, 22, 2, 3.560537, 23, 1
-22.18889, 22, 2, 3.545349, 23, 1
-22.08476, 22, 2, 3.53067, 22, 1
-21.98064, 21, 2, 3.523235, 22, 1
-21.87652, 21, 2, 3.509087, 22, 1
-21.77239, 21, 2, 3.49512, 22, 1
-21.66827, 21, 2, 3.481092, 22, 1
-21.56414, 21, 2, 3.466751, 22, 1
-21.46002, 21, 2, 3.459267, 22, 1
-21.35589, 21, 2, 3.444774, 22, 1
-21.25177, 21, 2, 3.43009, 22, 1
-21.14764, 21, 2, 3.415219, 22, 1
-21.04352, 21, 2, 3.400378, 22, 1
-20.9394, 20, 2, 3.392749, 22, 1
-20.83527, 20, 2, 3.377628, 21, 1
-20.73115, 20, 2, 3.362107, 21, 1
-20.62702, 20, 2, 3.346361, 21, 1
-20.5229, 20, 2, 3.328423, 21, 1
-20.41877, 20, 2, 3.320143, 21, 1
-20.31465, 20, 2, 3.304313, 21, 1
-20.21052, 20, 2, 3.287218, 21, 1
-20.1064, 20, 2, 3.269889, 21, 1
-20.00227, 20, 2, 3.251939, 21, 1
-19.89815, 19, 2, 3.242826, 21, 1
-19.79403, 19, 2, 3.225546, 20, 1
-19.6899, 19, 2, 3.208479, 20, 1
-19.58578, 19, 2, 3.191693, 20, 1
-19.48165, 19, 2, 3.175081, 20, 1
-19.37753, 19, 2, 3.166504, 20, 1
-19.2734, 19, 2, 3.150171, 20, 1
-19.16928, 19, 2, 3.133936, 20, 1
-19.06515, 19, 2, 3.117201, 20, 1
-18.96103, 18, 2, 3.100648, 20, 1
-18.8569, 18, 2, 3.092404, 20, 1
-18.75278, 18, 2, 3.076514, 19, 1
-18.64865, 18, 2, 3.06107, 19, 1
-18.54453, 18, 2, 3.046069, 19, 1
-18.44041, 18, 2, 3.031188, 19, 1
-18.33628, 18, 2, 3.023787, 19, 1
-18.23216, 18, 2, 3.008894, 19, 1
-18.12803, 18, 2, 2.99451, 19, 1
-18.02391, 18, 2, 2.97992, 19, 1
-17.91978, 17, 2, 2.964953, 19, 1
-17.81566, 17, 2, 2.95761, 19, 1
-17.71153, 17, 2, 2.942196, 19, 1
-17.60741, 17, 2, 2.926276, 19, 1
-17.50328, 17, 2, 2.909199, 18, 1
-17.39916, 17, 2, 2.890768, 18, 1
-17.29504, 17, 2, 2.881706, 18, 1
-17.19091, 17, 2, 2.862438, 18, 1
-17.08679, 17, 2, 2.842546, 18, 1
-16.98266, 16, 2, 2.821632, 18, 1
-16.87854, 16, 2, 2.80003, 18, 1
-16.77441, 16, 2, 2.788731, 18, 1
-16.67029, 16, 2, 2.765783, 17, 1
-16.56616, 16, 2, 2.741688, 17, 1
-16.46204, 16, 2, 2.716254, 17, 1
-16.35792, 16, 2, 2.689884, 17, 1
-16.25379, 16, 2, 2.676417, 17, 1
-16.14967, 16, 2, 2.649557, 17, 1
-16.04554, 16, 2, 2.622435, 17, 1
-15.94142, 15, 2, 2.595267, 16, 1
-15.83729, 15, 2, 2.568175, 16, 1
-15.73317, 15, 2, 2.554316, 16, 1
-15.62904, 15, 2, 2.524803, 16, 1
-15.52492, 15, 2, 2.496382, 16, 1
-15.42079, 15, 2, 2.466648, 16, 1
-15.31667, 15, 2, 2.437618, 15, 1
-15.21255, 15, 1, 2.423377, 15, 1
-15.16067, 15, 2, 2.395636, 15, 1
-15.05655, 15, 2, 2.368496, 15, 1
-14.95242, 14, 2, 2.341242, 15, 1
-14.8483, 14, 2, 2.313658, 15, 1
-14.74417, 14, 1, 2.300138, 14, 1
-14.6923, 14, 2, 2.273045, 14, 1
-14.58817, 14, 2, 2.246119, 14, 1
-14.48405, 14, 2, 2.21949, 14, 1
-14.37992, 14, 2, 2.193438, 14, 1
-14.2758, 14, 2, 2.180925, 14, 1
-14.17167, 14, 2, 2.155463, 14, 1
-14.06755, 14, 2, 2.130345, 13, 1
-13.96342, 13, 1, 2.105405, 13, 1
-13.91155, 13, 2, 2.079593, 13, 1
-13.80743, 13, 1, 2.066888, 13, 1
-13.75555, 13, 2, 2.040566, 13, 1
-13.65143, 13, 2, 2.013229, 13, 1
-13.5473, 13, 2, 1.985693, 12, 1
-13.44318, 13, 2, 1.956923, 12, 1
-13.33905, 13, 2, 1.942856, 12, 1
-13.23493, 13, 2, 1.913303, 12, 1
-13.1308, 13, 2, 1.883547, 12, 1
-13.02668, 13, 2, 1.853693, 12, 1
-12.92255, 12, 2, 1.823276, 11, 1
-12.81843, 12, 2, 1.808355, 11, 1
-12.7143, 12, 2, 1.778401, 11, 1
-12.61018, 12, 2, 1.748306, 11, 1
-12.50606, 12, 2, 1.718486, 11, 1
-12.40193, 12, 2, 1.687964, 10, 1
-12.29781, 12, 2, 1.672869, 10, 1
-12.19368, 12, 2, 1.642445, 10, 1
-12.08956, 12, 2, 1.612381, 10, 1
-11.98543, 11, 2, 1.582781, 10, 1
-11.88131, 11, 2, 1.552949, 10, 1
-11.77718, 11, 2, 1.538396, 9, 1
-11.67306, 11, 2, 1.508784, 9, 1
-11.56893, 11, 2, 1.479212, 9, 1
-11.46481, 11, 2, 1.450087, 9, 1
-11.36069, 11, 2, 1.420624, 9, 1
-11.25656, 11, 2, 1.405976, 9, 1
-11.15244, 11, 2, 1.377232, 8, 1
-11.04831, 11, 2, 1.348572, 8, 1
-10.94419, 10, 2, 1.320433, 8, 1
-10.84006, 10, 2, 1.292357, 8, 1
-10.73594, 10, 2, 1.278317, 8, 1
-10.63181, 10, 2, 1.250133, 8, 1
-10.52769, 10, 2, 1.222214, 7, 1
-10.42356, 10, 2, 1.193466, 7, 1
-10.31944, 10, 2, 1.164556, 7, 1
-10.21532, 10, 2, 1.150304, 7, 1
-10.11119, 10, 2, 1.121958, 7, 1
-10.00707, 10, 2, 1.093585, 7, 1
-9.902941, 9, 2, 1.064819, 6, 1
-9.798816, 9, 2, 1.035667, 6, 1
-9.694691, 9, 2, 1.021319, 6, 1
-9.590566, 9, 2, 0.9926786, 6, 1
-9.486441, 9, 2, 0.9642954, 6, 1
-9.382315, 9, 2, 0.9359114, 6, 1
-9.27819, 9, 2, 0.9075229, 5, 1
-9.174065, 9, 2, 0.8935108, 5, 1
-9.06994, 9, 2, 0.8660479, 5, 1
-8.965815, 8, 2, 0.83901, 5, 1
-8.86169, 8, 2, 0.8117182, 5, 1
-8.757565, 8, 2, 0.7853277, 5, 1
-8.65344, 8, 2, 0.7722273, 5, 1
-8.549314, 8, 2, 0.7456651, 4, 1
-8.445189, 8, 2, 0.719126, 4, 1
-8.341063, 8, 2, 0.6923263, 4, 1
-8.236938, 8, 2, 0.6647148, 4, 1
-8.132813, 8, 2, 0.6502829, 4, 1
-8.028688, 8, 2, 0.6215577, 4, 1
-7.924563, 7, 2, 0.5929089, 3, 1
-7.820438, 7, 2, 0.5651886, 3, 1
-7.716313, 7, 2, 0.5391841, 3, 1
-7.612188, 7, 2, 0.5263817, 3, 1
-7.508063, 7, 2, 0.5016451, 3, 1
-7.403937, 7, 2, 0.478128, 3, 1
-7.299812, 7, 2, 0.455183, 2, 1
-7.195687, 7, 2, 0.4329917, 2, 1
-7.091562, 7, 2, 0.4220519, 2, 1
-6.987437, 6, 2, 0.4001741, 2, 1
-6.883312, 6, 2, 0.3788567, 2, 1
-6.779187, 6, 2, 0.3573143, 2, 1
-6.675062, 6, 2, 0.3359067, 2, 1
-6.570936, 6, 2, 0.3253107, 2, 1
-6.466811, 6, 2, 0.3042738, 1, 1
-6.362686, 6, 2, 0.2839682, 1, 1
-6.258561, 6, 2, 0.2635527, 1, 1
-6.154436, 6, 2, 0.2433987, 1, 1
-6.050311, 6, 2, 0.2335916, 1, 1
-5.946186, 5, 2, 0.2146032, 1, 1
-5.842061, 5, 2, 0.1958268, 1, 1
-5.737935, 5, 2, 0.1771319, 1, 1
-5.63381, 5, 2, 0.1593685, 1, 1
-5.529685, 5, 2, 0.1503854, 0, 1
-5.42556, 5, 2, 0.132724, 0, 1
-5.321434, 5, 2, 0.1152191, 0, 1
-5.217309, 5, 2, 0.09737992, 0, 1
-5.113184, 5, 2, 0.08026385, 0, 1
-5.009059, 5, 2, 0.07156157, 0, 1
-4.904934, 4, 2, 0.05390787, 0, 1
-4.800809, 4, 2, 0.03594828, 0, 1
-4.696684, 4, 2, 0.01660538, 0, 1
-4.592559, 4, 2, -0.003781319, 0, 1
-4.488433, 4, 2, -0.01476479, 0, 1
-4.384308, 4, 2, -0.0382843, 0, 1
-4.280183, 4, 2, -0.061553, 0, 1
-4.176058, 4, 2, -0.08684397, 0, 1
-4.071933, 4, 2, -0.1119442, 0, 1
-3.967808, 3, 2, -0.1248093, 0, 1
-3.863683, 3, 2, -0.1495042, 0, 1
-3.759557, 3, 2, -0.1733928, -1, 1
-3.655432, 3, 2, -0.1959929, -1, 1
-3.551307, 3, 2, -0.2152319, -1, 1
-3.447182, 3, 2, -0.2243295, -1, 1
-3.343057, 3, 2, -0.2421494, -1, 1
-3.238932, 3, 2, -0.2582507, -1, 1
-3.134807, 3, 2, -0.2751856, -1, 1
-3.030682, 3, 2, -0.2921705, -1, 1
-2.926556, 2, 2, -0.300087, -1, 1
-2.822431, 2, 2, -0.3158674, -2, 1
-2.718306, 2, 2, -0.3312054, -2, 1
-2.614181, 2, 2, -0.3446541, -2, 1
-2.510056, 2, 2, -0.3575821, -2, 1
-2.405931, 2, 2, -0.3638253, -2, 1
-2.301806, 2, 2, -0.3766818, -2, 1
-2.197681, 2, 2, -0.3901887, -2, 1
-2.093556, 2, 2, -0.4034286, -2, 1
-1.989431, 1, 2, -0.417655, -2, 1
-1.885306, 1, 2, -0.4244251, -2, 1
-1.781181, 1, 2, -0.4385366, -2, 1
-1.677056, 1, 2, -0.4523706, -2, 1
-1.572931, 1, 2, -0.4653206, -3, 1
-1.468806, 1, 2, -0.4779735, -3, 1
-1.364681, 1, 2, -0.4838033, -3, 1
-1.260556, 1, 2, -0.4947214, -3, 1
-1.156431, 1, 2, -0.5052953, -3, 1
-1.052306, 1, 2, -0.5155835, -3, 1
-0.948181, 0, 2, -0.5259233, -3, 1
-0.844056, 0, 2, -0.5315185, -3, 1
-0.739931, 0, 2, -0.543983, -3, 1
-0.635806, 0, 2, -0.5572176, -3, 1
-0.531681, 0, 2, -0.5708585, -3, 1
-0.427556, 0, 2, -0.5846081, -3, 1
-0.323431, 0, 2, -0.5914726, -3, 1
-0.2193061, 0, 2, -0.6050563, -3, 1
-0.1151811, 0, 2, -0.6189337, -4, 1
-0.01105607, 0, 2, -0.6327977, -4, 1
0.09306893, 0, 2, -0.6466613, -4, 1
0.1971939, 0, 2, -0.6534772, -4, 1
0.3013189, 0, 2, -0.6659646, -4, 1
0.4054439, 0, 2, -0.6782064, -4, 1
0.5095689, 0, 2, -0.6891403, -4, 1
0.6136939, 0, 2, -0.7009172, -4, 1
0.7178189, 0, 2, -0.705389, -4, 1
0.8219439, 0, 2, -0.7156048, -4, 1
0.9260688, 0, 2, -0.7241402, -4, 1
1.030194, -1, 2, -0.7318964, -4, 1
1.134319, -1, 2, -0.7381582, -4, 1
1.238444, -1, 2, -0.7412462, -4, 1
1.342569, -1, 2, -0.7465324, -4, 1
1.446694, -1, 2, -0.7515745, -4, 1
1.550819, -1, 2, -0.7558098, -4, 1
1.654944, -1, 2, -0.7604809, -4, 1
1.759069, -1, 2, -0.7628059, -4, 1
1.863194, -1, 2, -0.7673383, -4, 1
1.967319, -1, 2, -0.7712989, -5, 1
2.071444, -2, 2, -0.7753062, -5, 1
2.175569, -2, 2, -0.778429, -5, 1
2.279694, -2, 2, -0.7799706, -5, 1
2.383819, -2, 2, -0.7835474, -5, 1
2.487944, -2, 2, -0.7869048, -5, 1
2.592069, -2, 2, -0.790359, -5, 1
2.696194, -2, 2, -0.7940888, -5, 1
2.800319, -2, 2, -0.7976356, -5, 1
2.904444, -2, 2, -0.7994337, -5, 1
3.008569, -3, 2, -0.8030052, -5, 1
3.112695, -3, 2, -0.8063622, -5, 1
3.21682, -3, 2, -0.8093357, -5, 1
3.320945, -3, 2, -0.8119135, -5, 1
3.42507, -3, 2, -0.8131471, -5, 1
3.529195, -3, 2, -0.8154893, -5, 1
3.63332, -3, 2, -0.8174105, -5, 1
3.737445, -3, 2, -0.8190436, -5, 1
3.841571, -3, 2, -0.8209944, -5, 1
3.945696, -3, 2, -0.8219128, -5, 1
4.049821, -4, 2, -0.8241558, -5, 1
4.153946, -4, 2, -0.8251548, -5, 1
4.258071, -4, 2, -0.8250494, -5, 1
4.362196, -4, 2, -0.8260889, -5, 1
4.466321, -4, 2, -0.8270082, -5, 1
4.570446, -4, 2, -0.8287892, -5, 1
4.674572, -4, 2, -0.8313498, -5, 1
4.778697, -4, 2, -0.8335876, -5, 1
4.882822, -4, 2, -0.8360362, -5, 1
4.986947, -4, 2, -0.8375015, -5, 1
5.091072, -5, 2, -0.8398418, -5, 1
5.195198, -5, 2, -0.841701, -5, 1
5.299323, -5, 2, -0.8428593, -5, 1
5.403448, -5, 2, -0.8438129, -5, 1
5.507573, -5, 2, -0.8444595, -5, 1
5.611698, -5, 2, -0.8454175, -5, 1
5.715823, -5, 2, -0.8462481, -5, 1
5.819948, -5, 2, -0.8469968, -5, 1
5.924073, -5, 2, -0.8478127, -5, 1
6.028199, -6, 2, -0.8482809, -5, 1
6.132324, -6, 2, -0.8488951, -5, 1
6.236449, -6, 2, -0.8493886, -5, 1
6.340574, -6, 2, -0.8498211, -5, 1
6.444699, -6, 2, -0.8499832, -5, 1
6.548824, -6, 2, -0.8501029, -5, 1
6.652949, -6, 2, -0.8505068, -5, 1
6.757074, -6, 2, -0.8509417, -5, 1
6.8612, -6, 2, -0.8511882, -5, 1
6.965325, -6, 2, -0.8515968, -5, 1
7.06945, -7, 2, -0.8519287, -5, 1
7.173575, -7, 2, -0.8528042, -5, 1
