car_pos_meter , car_pos_cell, car_speed, ped_pos_meter, ped_pos_cell, ped_speed
-5.125, 5, 2, 3.988825, 5, 1
-5.104175, 5, 2, 3.976624, 5, 1
-5.08335, 5, 2, 3.970129, 5, 1
-5.062525, 5, 2, 3.958373, 5, 1
-5.0417, 5, 1, 3.945785, 5, 1
-5.031325, 5, 1, 3.934071, 5, 1
-5.02095, 5, 1, 3.922118, 5, 1
-5.010575, 5, 1, 3.915735, 5, 1
-5.0002, 5, 2, 3.903107, 5, 1
-4.979375, 4, 2, 3.889759, 5, 1
-4.95855, 4, 2, 3.876554, 5, 1
-4.937726, 4, 2, 3.862504, 5, 1
-4.916901, 4, 2, 3.855691, 5, 1
-4.896076, 4, 2, 3.842026, 4, 1
-4.875251, 4, 1, 3.827946, 4, 1
-4.864876, 4, 1, 3.813894, 4, 1
-4.854501, 4, 2, 3.799906, 4, 1
-4.833676, 4, 2, 3.785642, 4, 1
-4.812851, 4, 2, 3.778527, 4, 1
-4.792026, 4, 2, 3.764044, 4, 1
-4.771201, 4, 1, 3.749027, 4, 1
-4.760826, 4, 1, 3.734267, 4, 1
-4.750451, 4, 1, 3.719124, 4, 1
-4.740076, 4, 1, 3.711433, 4, 1
-4.729701, 4, 1, 3.695594, 4, 1
-4.719326, 4, 1, 3.679432, 4, 1
-4.708951, 4, 2, 3.663108, 4, 1
-4.688126, 4, 2, 3.654859, 4, 1
-4.667301, 4, 1, 3.638416, 4, 1
-4.656926, 4, 1, 3.621471, 4, 1
-4.646551, 4, 1, 3.603782, 4, 1
-4.636176, 4, 1, 3.585962, 4, 1
-4.625801, 4, 2, 3.56796, 4, 1
-4.604976, 4, 1, 3.558693, 4, 1
-4.594601, 4, 1, 3.541667, 4, 1
-4.584226, 4, 2, 3.524806, 4, 1
-4.563401, 4, 1, 3.508743, 4, 1
-4.553026, 4, 2, 3.492441, 4, 1
-4.532201, 4, 1, 3.483897, 4, 1
-4.521826, 4, 1, 3.467027, 4, 1
-4.511451, 4, 1, 3.449131, 4, 1
-4.501076, 4, 2, 3.431705, 4, 1
-4.480251, 4, 2, 3.414038, 4, 1
-4.459426, 4, 1, 3.405033, 4, 1
-4.449051, 4, 1, 3.387787, 4, 1
-4.438676, 4, 2, 3.37022, 4, 1
-4.417851, 4, 1, 3.353273, 4, 1
-4.407476, 4, 1, 3.336197, 4, 1
-4.397101, 4, 1, 3.327507, 4, 1
-4.386726, 4, 1, 3.309864, 4, 1
-4.376351, 4, 1, 3.291463, 4, 1
-4.365976, 4, 1, 3.273316, 4, 1
-4.355601, 4, 2, 3.254963, 4, 1
-4.334776, 4, 1, 3.245768, 4, 1
-4.324401, 4, 2, 3.227172, 4, 1
-4.303576, 4, 2, 3.208333, 4, 1
-4.282752, 4, 2, 3.190404, 4, 1
-4.261927, 4, 2, 3.17179, 4, 1
-4.241102, 4, 1, 3.162409, 4, 1
-4.230727, 4, 1, 3.143904, 4, 1
-4.220352, 4, 2, 3.12539, 4, 1
-4.199527, 4, 2, 3.106858, 4, 1
-4.178702, 4, 2, 3.088308, 4, 1
-4.157877, 4, 1, 3.078828, 4, 1
-4.147502, 4, 2, 3.060548, 3, 1
-4.126677, 4, 2, 3.042112, 3, 1
-4.105852, 4, 2, 3.024209, 3, 1
-4.085027, 4, 2, 3.006829, 3, 1
-4.064202, 4, 2, 2.998116, 3, 1
-4.043377, 4, 2, 2.982063, 3, 1
-4.022552, 4, 2, 2.96598, 3, 1
-4.001728, 4, 2, 2.95077, 3, 1
-3.980903, 3, 1, 2.935899, 3, 1
-3.970528, 3, 1, 2.927938, 3, 1
-3.960153, 3, 2, 2.912585, 3, 1
-3.939328, 3, 1, 2.896521, 3, 1
-3.928953, 3, 1, 2.880497, 3, 1
-3.918578, 3, 1, 2.864321, 3, 1
-3.908203, 3, 1, 2.856163, 3, 1
-3.897828, 3, 2, 2.839689, 3, 1
-3.877003, 3, 1, 2.82271, 3, 1
-3.866628, 3, 2, 2.805737, 3, 1
-3.845803, 3, 1, 2.788806, 3, 1
-3.835428, 3, 1, 2.780146, 3, 1
-3.825053, 3, 2, 2.763222, 3, 1
-3.804228, 3, 1, 2.746165, 3, 1
-3.793853, 3, 2, 2.728947, 3, 1
-3.773028, 3, 1, 2.711946, 3, 1
-3.762653, 3, 1, 2.70335, 3, 1
-3.752278, 3, 2, 2.68661, 3, 1
-3.731453, 3, 2, 2.669372, 3, 1
-3.710628, 3, 1, 2.652577, 3, 1
-3.700253, 3, 1, 2.635726, 3, 1
-3.689878, 3, 1, 2.627281, 3, 1
-3.679503, 3, 1, 2.610369, 3, 1
-3.669128, 3, 1, 2.592565, 3, 1
-3.658753, 3, 1, 2.574544, 3, 1
-3.648378, 3, 2, 2.556338, 3, 1
-3.627553, 3, 2, 2.547185, 3, 1
-3.606728, 3, 2, 2.529159, 3, 1
-3.585903, 3, 2, 2.51077, 3, 1
-3.565078, 3, 1, 2.492303, 3, 1
-3.554703, 3, 1, 2.47415, 3, 1
-3.544328, 3, 2, 2.465086, 3, 1
-3.523503, 3, 1, 2.446968, 3, 1
-3.513128, 3, 1, 2.428616, 3, 1
-3.502753, 3, 1, 2.410791, 3, 1
-3.492378, 3, 1, 2.392858, 3, 1
-3.482003, 3, 2, 2.384018, 3, 1
-3.461178, 3, 2, 2.366442, 3, 1
-3.440353, 3, 1, 2.348692, 3, 1
-3.429978, 3, 1, 2.331111, 3, 1
-3.419603, 3, 1, 2.313563, 3, 1
-3.409228, 3, 2, 2.30444, 2, 1
-3.388403, 3, 2, 2.286657, 2, 1
-3.367579, 3, 2, 2.267854, 2, 1
-3.346754, 3, 2, 2.248045, 2, 1
-3.325929, 3, 2, 2.237814, 2, 1
-3.305104, 3, 2, 2.216902, 2, 1
-3.284279, 3, 2, 2.195988, 2, 1
-3.263454, 3, 2, 2.17587, 2, 1
-3.242629, 3, 2, 2.156258, 2, 1
-3.221804, 3, 2, 2.136023, 2, 1
-3.200979, 3, 2, 2.126358, 2, 1
-3.180154, 3, 2, 2.106513, 2, 1
-3.159329, 3, 2, 2.087384, 2, 1
-3.138505, 3, 2, 2.068398, 2, 1
-3.11768, 3, 2, 2.049826, 2, 1
-3.096855, 3, 2, 2.040646, 2, 1
-3.07603, 3, 2, 2.023029, 2, 1
-3.055205, 3, 2, 2.005563, 2, 1
-3.03438, 3, 2, 1.988887, 2, 1
-3.013555, 3, 2, 1.972506, 2, 1
-2.99273, 2, 2, 1.964315, 2, 1
-2.971905, 2, 1, 1.948647, 2, 1
-2.96153, 2, 2, 1.933021, 2, 1
-2.940705, 2, 1, 1.917573, 2, 1
-2.93033, 2, 2, 1.90222, 2, 1
-2.909505, 2, 2, 1.894654, 2, 1
-2.88868, 2, 1, 1.879634, 2, 1
-2.878305, 2, 1, 1.86482, 2, 1
-2.86793, 2, 2, 1.849502, 2, 1
-2.847106, 2, 2, 1.833877, 2, 1
-2.826281, 2, 1, 1.825969, 2, 1
-2.815906, 2, 2, 1.810059, 2, 1
-2.795081, 2, 2, 1.793706, 2, 1
-2.774256, 2, 1, 1.777116, 2, 1
-2.763881, 2, 1, 1.760306, 2, 1
-2.753506, 2, 1, 1.751831, 2, 1
-2.743131, 2, 1, 1.734649, 2, 1
-2.732756, 2, 1, 1.717432, 2, 1
-2.722381, 2, 2, 1.700174, 2, 1
-2.701556, 2, 2, 1.682841, 2, 1
-2.680731, 2, 1, 1.673853, 2, 1
-2.670356, 2, 1, 1.656065, 2, 1
-2.659981, 2, 2, 1.637712, 2, 1
-2.639156, 2, 1, 1.61929, 2, 1
-2.628781, 2, 2, 1.601798, 2, 1
-2.607956, 2, 1, 1.592772, 2, 1
-2.597581, 2, 1, 1.575295, 2, 1
-2.587206, 2, 2, 1.557344, 2, 1
-2.566381, 2, 2, 1.540086, 2, 1
-2.545556, 2, 2, 1.523166, 1, 1
-2.524731, 2, 2, 1.514402, 1, 1
-2.503906, 2, 2, 1.497574, 1, 1
-2.483081, 2, 2, 1.480129, 1, 1
-2.462256, 2, 2, 1.46272, 1, 1
-2.441432, 2, 2, 1.445728, 1, 1
-2.420607, 2, 2, 1.437157, 1, 1
-2.399782, 2, 2, 1.420304, 1, 1
-2.378957, 2, 2, 1.403318, 1, 1
-2.358132, 2, 2, 1.386786, 1, 1
-2.337307, 2, 2, 1.370119, 1, 1
-2.316482, 2, 2, 1.361579, 1, 1
-2.295657, 2, 2, 1.345411, 1, 1
-2.274832, 2, 2, 1.32867, 1, 1
-2.254007, 2, 2, 1.311889, 1, 1
-2.233182, 2, 2, 1.295293, 1, 1
-2.212358, 2, 2, 1.286763, 1, 1
-2.191533, 2, 2, 1.270378, 1, 1
-2.170708, 2, 2, 1.253207, 1, 1
-2.149883, 2, 2, 1.235868, 1, 1
-2.129058, 2, 2, 1.218802, 1, 1
-2.108233, 2, 2, 1.210052, 1, 1
-2.087408, 2, 2, 1.192868, 1, 1
-2.066583, 2, 2, 1.174972, 1, 1
-2.045758, 2, 2, 1.15656, 1, 1
-2.024933, 2, 2, 1.137975, 1, 1
-2.004108, 2, 2, 1.128387, 1, 1
-1.983283, 1, 2, 1.109887, 1, 1
-1.962458, 1, 2, 1.091325, 1, 1
-1.941633, 1, 2, 1.072786, 1, 1
-1.920808, 1, 2, 1.054872, 1, 1
-1.899983, 1, 2, 1.045928, 1, 1
-1.879158, 1, 2, 1.028002, 1, 1
-1.858333, 1, 2, 1.010851, 1, 1
-1.837508, 1, 2, 0.993392, 1, 1
-1.816683, 1, 2, 0.976413, 1, 1
-1.795858, 1, 2, 0.9677844, 1, 1
-1.775033, 1, 2, 0.9515471, 1, 1
-1.754208, 1, 2, 0.9354358, 1, 1
-1.733383, 1, 2, 0.919389, 1, 1
-1.712558, 1, 2, 0.9033141, 1, 1
-1.691733, 1, 2, 0.8951495, 1, 1
-1.670908, 1, 2, 0.8787317, 1, 1
-1.650083, 1, 2, 0.8621154, 1, 1
-1.629258, 1, 2, 0.8455634, 1, 1
-1.608433, 1, 2, 0.8285441, 1, 1
-1.587608, 1, 2, 0.8198807, 1, 1
-1.566783, 1, 2, 0.8023164, 1, 1
-1.545958, 1, 2, 0.7845538, 1, 1
-1.525133, 1, 2, 0.7668223, 0, 1
-1.504308, 1, 2, 0.7494249, 0, 1
-1.483483, 1, 2, 0.7405455, 0, 1
-1.462658, 1, 2, 0.7228739, 0, 1
-1.441833, 1, 2, 0.7051651, 0, 1
-1.421008, 1, 2, 0.6873064, 0, 1
-1.400183, 1, 2, 0.6693475, 0, 1
-1.379358, 1, 2, 0.6602366, 0, 1
-1.358533, 1, 2, 0.6423507, 0, 1
-1.337708, 1, 2, 0.6240139, 0, 1
-1.316882, 1, 2, 0.6059794, 0, 1
-1.296057, 1, 2, 0.5879824, 0, 1
-1.275232, 1, 2, 0.5788689, 0, 1
-1.254407, 1, 2, 0.5610435, 0, 1
-1.233582, 1, 2, 0.5429935, 0, 1
-1.212757, 1, 2, 0.5249829, 0, 1
-1.191932, 1, 2, 0.5069056, 0, 1
-1.171107, 1, 2, 0.4977946, 0, 1
-1.150282, 1, 2, 0.480216, 0, 1
-1.129457, 1, 2, 0.4625275, 0, 1
-1.108632, 1, 2, 0.4451694, 0, 1
-1.087807, 1, 2, 0.4274795, 0, 1
-1.066982, 1, 2, 0.4185987, 0, 1
-1.046157, 1, 2, 0.401289, 0, 1
-1.025332, 1, 2, 0.3837347, 0, 1
-1.004507, 1, 2, 0.3666537, 0, 1
-0.983682, 0, 2, 0.3499169, 0, 1
-0.962857, 0, 2, 0.3411334, 0, 1
-0.942032, 0, 2, 0.3242111, 0, 1
-0.921207, 0, 2, 0.3066752, 0, 1
-0.9003819, 0, 2, 0.2890229, 0, 1
-0.8795569, 0, 2, 0.2708745, 0, 1
-0.8587319, 0, 2, 0.2616012, 0, 1
-0.8379068, 0, 2, 0.242749, 0, 1
-0.8170818, 0, 2, 0.2237411, 0, 1
-0.7962568, 0, 2, 0.204829, 0, 1
-0.7754318, 0, 2, 0.1854646, 0, 1
-0.7546067, 0, 2, 0.1666527, 0, 1
-0.7337817, 0, 2, 0.1575994, 0, 1
-0.7129567, 0, 2, 0.1382613, 0, 1
-0.6921316, 0, 2, 0.1193676, 0, 1
-0.6713066, 0, 2, 0.1015191, 0, 1
-0.6504816, 0, 2, 0.07735586, 0, 1
-0.6296566, 0, 2, 0.05907297, 0, 1
-0.6088315, 0, 2, 0.04164076, 0, 1
-0.5880065, 0, 2, 0.0244379, 0, 1
-0.5671815, 0, 2, 0.008124828, 0, 1
-0.5463564, 0, 2, 6.198883E-05, 0, 1
-0.5255314, 0, 2, -0.01598072, 0, 1
-0.5047064, 0, 2, -0.03148365, 0, 1
-0.4838814, 0, 2, -0.04643869, 0, 1
-0.4630564, 0, 2, -0.060853, 0, 1
-0.4422314, 0, 2, -0.07494354, 0, 1
-0.4214064, 0, 2, -0.08180714, 0, 1
-0.4005814, 0, 2, -0.09588003, 0, 1
-0.3797564, 0, 2, -0.1103935, 0, 1
-0.3589314, 0, 2, -0.125247, 0, 1
-0.3381064, 0, 2, -0.1329389, 0, 1
-0.3172814, 0, 2, -0.1483116, 0, 1
-0.2964564, 0, 2, -0.1644592, 0, 1
-0.2756314, 0, 2, -0.1812487, 0, 1
-0.2548064, 0, 2, -0.1982512, 0, 1
-0.2339814, 0, 2, -0.207118, 0, 1
-0.2131564, 0, 2, -0.2251759, 0, 1
-0.1923314, 0, 2, -0.2435098, 0, 1
-0.1715064, 0, 2, -0.2623057, 0, 1
-0.1506814, 0, 2, -0.2813983, 0, 1
-0.1298564, 0, 2, -0.3005853, 0, 1
-0.1090314, 0, 2, -0.3104014, 0, 1
-0.08820641, 0, 2, -0.3337822, 0, 1
-0.06738141, 0, 2, -0.351552, 0, 1
-0.04655641, 0, 2, -0.3648882, 0, 1
-0.02573141, 0, 2, -0.3845382, 0, 1
-0.004906416, 0, 2, -0.3932762, 0, 1
0.01591858, 0, 2, -0.4114103, 0, 1
0.03674358, 0, 2, -0.4297566, 0, 1
0.05756858, 0, 2, -0.4477015, 0, 1
0.07839358, 0, 2, -0.4649677, 0, 1
0.09921858, 0, 2, -0.4740586, 0, 1
0.1200436, 0, 2, -0.4904766, 0, 1
0.1408686, 0, 2, -0.5065889, 0, 1
0.1616936, 0, 2, -0.5223389, 0, 1
0.1825186, 0, 2, -0.5370502, 0, 1
0.2033436, 0, 2, -0.5438571, 0, 1
0.2241686, 0, 2, -0.5570235, 0, 1
0.2449936, 0, 2, -0.5696983, 0, 1
0.2658186, 0, 2, -0.5811691, 0, 1
0.2866436, 0, 2, -0.5869322, 0, 1
0.3074686, 0, 2, -0.5977392, 0, 1
0.3282936, 0, 2, -0.6076365, 0, 1
0.3491186, 0, 2, -0.6167612, 0, 1
0.3699436, 0, 2, -0.6253004, 0, 1
0.3907686, 0, 2, -0.6336842, 0, 1
0.4115936, 0, 2, -0.637887, 0, 1
0.4324186, 0, 2, -0.6455765, 0, 1
0.4532436, 0, 2, -0.6528559, 0, 1
0.4740686, 0, 2, -0.6598625, 0, 1
0.4948936, 0, 2, -0.6661053, 0, 1
0.5157186, 0, 2, -0.6694112, 0, 1
0.5365436, 0, 2, -0.6748343, 0, 1
0.5573686, 0, 2, -0.6798897, 0, 1
0.5781937, 0, 2, -0.6848416, 0, 1
0.5990187, 0, 2, -0.6899557, 0, 1
0.6198437, 0, 2, -0.6924992, 0, 1
0.6406687, 0, 2, -0.6971855, 0, 1
0.6614938, 0, 2, -0.7018294, 0, 1
0.6823188, 0, 2, -0.7063541, 0, 1
0.7031438, 0, 2, -0.710484, 0, 1
0.7239689, 0, 2, -0.7128038, 0, 1
0.7447939, 0, 2, -0.7167978, 0, 1
0.7656189, 0, 2, -0.7206011, 0, 1
0.7864439, 0, 2, -0.7243176, 0, 1
0.807269, 0, 2, -0.7280512, 0, 1
0.828094, 0, 2, -0.729888, 0, 1
0.848919, 0, 2, -0.7335119, 0, 1
0.8697441, 0, 2, -0.737257, 0, 1
0.8905691, 0, 2, -0.7409124, 0, 1
0.9113941, 0, 2, -0.7439966, 0, 1
0.9322191, 0, 2, -0.7454929, 0, 1
0.9530442, 0, 2, -0.7486291, 0, 1
0.9738692, 0, 2, -0.751976, 0, 1
0.9946942, 0, 2, -0.7552576, 0, 1
1.015519, -1, 2, -0.7584591, 0, 1
1.036344, -1, 2, -0.7601933, 0, 1
1.057169, -1, 2, -0.7633252, 0, 1
1.077994, -1, 2, -0.7664423, 0, 1
1.098819, -1, 2, -0.769455, -1, 1
1.119644, -1, 2, -0.7724447, -1, 1
1.140469, -1, 2, -0.7741475, -1, 1
1.161294, -1, 2, -0.7766881, -1, 1
1.182119, -1, 2, -0.7791672, -1, 1
1.202945, -1, 2, -0.7810268, -1, 1
1.22377, -1, 2, -0.7820973, -1, 1
1.244595, -1, 2, -0.7826366, -1, 1
1.26542, -1, 2, -0.7833033, -1, 1
1.286245, -1, 2, -0.7839227, -1, 1
1.30707, -1, 2, -0.7842641, -1, 1
1.327895, -1, 2, -0.784749, -1, 1
1.34872, -1, 2, -0.7849512, -1, 1
1.369545, -1, 2, -0.7856631, -1, 1
1.39037, -1, 2, -0.7865753, -1, 1
1.411195, -1, 2, -0.7873416, -1, 1
1.43202, -1, 2, -0.787858, -1, 1
1.452845, -1, 2, -0.7880826, -1, 1
1.47367, -1, 2, -0.7886763, -1, 1
1.494495, -1, 2, -0.789207, -1, 1
1.51532, -1, 2, -0.7897549, -1, 1
1.536145, -1, 2, -0.7905154, -1, 1
1.55697, -1, 2, -0.7908192, -1, 1
1.577795, -1, 2, -0.7913799, -1, 1
1.59862, -1, 2, -0.7914124, -1, 1
1.619445, -1, 2, -0.7914972, -1, 1
1.64027, -1, 2, -0.7917013, -1, 1
1.661095, -1, 2, -0.7919455, -1, 1
1.68192, -1, 2, -0.7924261, -1, 1
1.702745, -1, 2, -0.7929416, -1, 1
1.72357, -1, 2, -0.7928724, -1, 1
1.744395, -1, 2, -0.7926655, -1, 1
1.76522, -1, 2, -0.7928653, -1, 1
1.786045, -1, 2, -0.793293, -1, 1
1.80687, -1, 2, -0.7933378, -1, 1
1.827695, -1, 2, -0.7940359, -1, 1
1.84852, -1, 2, -0.7944975, -1, 1
1.869345, -1, 2, -0.7947011, -1, 1
1.89017, -1, 2, -0.7947831, -1, 1
1.910995, -1, 2, -0.7885075, -1, 1
1.931821, -1, 2, -0.7888322, -1, 1
1.952646, -1, 2, -0.7887125, -1, 1
1.973471, -1, 2, -0.7893109, -1, 1
1.994296, -1, 2, -0.7887316, -1, 1
2.015121, -2, 2, -0.7886977, -1, 1
2.035945, -2, 2, -0.791512, -1, 1
2.05677, -2, 2, -0.7909851, -1, 1
2.077595, -2, 2, -0.792098, -1, 1
2.09842, -2, 2, -0.7914348, -1, 1
2.119245, -2, 2, -0.7916231, -1, 1
2.14007, -2, 2, -0.7916346, -1, 1
2.160895, -2, 2, -0.7914109, -1, 1
2.18172, -2, 2, -0.7912149, -1, 1
2.202545, -2, 2, -0.7908249, -1, 1
2.22337, -2, 2, -0.790082, -1, 1
2.244195, -2, 2, -0.7896233, -1, 1
2.265019, -2, 2, -0.7896433, -1, 1
2.285844, -2, 2, -0.7893562, -1, 1
2.306669, -2, 2, -0.7890472, -1, 1
2.327494, -2, 2, -0.7883434, -1, 1
2.348319, -2, 2, -0.7878275, -1, 1
2.369144, -2, 2, -0.7875357, -1, 1
2.389969, -2, 2, -0.7871904, -1, 1
2.410794, -2, 2, -0.7871475, -1, 1
