timestamp_sec,frame_id,game_played,yielding,player1discrete,player2discrete,player1yieldprob,player2yieldprob,player1_pose_x,player1_pose_y,player1_pose_z,player1_pose_orient_x,player1_pose_orient_y,player1_pose_orient_z,player1_pose_orient_w,player2_pose_x,player2_pose_y,player2_pose_z,player2_pose_orient_x,player2_pose_orient_y,player2_pose_orient_z,player2_pose_orient_w
1718111317.3832967,map,True,False,5,5,0.612995793784914,0.612995793784914,1.2434431314468384,-1.5837856531143188,0.0,0.0,0.0,0.04158352021787696,0.9991350307392995,3.132631934904439,-6.752572209179046,0.8211419800908949,0.0,0.0,0.0,1.0
1718111317.4288402,map,True,True,5,5,0.612995793784914,0.612995793784914,1.2434431314468384,-1.5837856531143188,0.0,0.0,0.0,0.04158352021787696,0.9991350307392995,3.095073087413814,-6.778919791462266,0.8060475123835008,0.0,0.0,0.0,1.0
1718111317.4801579,map,True,True,5,5,0.612995793784914,0.612995793784914,1.2434431314468384,-1.5837856531143188,0.0,0.0,0.0,0.04158352021787696,0.9991350307392995,3.0706796223399953,-6.661104130777432,0.8105833088661546,0.0,0.0,0.0,1.0
1718111317.5299816,map,True,True,5,5,0.612995793784914,0.612995793784914,1.2434431314468384,-1.5837856531143188,0.0,0.0,0.0,0.04158352021787696,0.9991350307392995,3.0706796223399953,-6.661104130777432,0.8105833088661546,0.0,0.0,0.0,1.0
1718111317.5818858,map,True,False,5,5,0.612995793784914,0.612995793784914,1.2434431314468384,-1.5837856531143188,0.0,0.0,0.0,0.04158352021787696,0.9991350307392995,3.096056316325931,-6.479213686273967,0.8065673799605028,0.0,0.0,0.0,1.0
1718111317.6320198,map,True,True,5,5,0.612995793784914,0.612995793784914,1.2434431314468384,-1.5837856531143188,0.0,0.0,0.0,0.04158352021787696,0.9991350307392995,3.092052346756176,-6.331031335503299,0.7885989387539721,0.0,0.0,0.0,1.0
1718111317.6894658,map,True,True,5,5,0.612995793784914,0.612995793784914,1.2434431314468384,-1.5837856531143188,0.0,0.0,0.0,0.04158352021787696,0.9991350307392995,3.092052346756176,-6.331031335503299,0.7885989387539721,0.0,0.0,0.0,1.0
1718111317.737717,map,True,True,5,5,0.612995793784914,0.612995793784914,1.2434431314468384,-1.5837856531143188,0.0,0.0,0.0,0.04158352021787696,0.9991350307392995,3.092973222220458,-6.296840122318995,0.7878861219311227,0.0,0.0,0.0,1.0
1718111317.8367577,map,True,True,5,5,0.612995793784914,0.612995793784914,1.2434431314468384,-1.5837856531143188,0.0,0.0,0.0,0.04158352021787696,0.9991350307392995,3.092973222220458,-6.296840122318995,0.7878861219311227,0.0,0.0,0.0,1.0
1718111317.8826883,map,True,True,5,5,0.612995793784914,0.612995793784914,1.2434431314468384,-1.5837856531143188,0.0,0.0,0.0,0.04158352021787696,0.9991350307392995,3.1335449502888846,-6.50874208241142,0.807346272505454,0.0,0.0,0.0,1.0
1718111317.988728,map,True,False,5,5,0.612995793784914,0.612995793784914,1.2434431314468384,-1.5837856531143188,0.0,0.0,0.0,0.04158352021787696,0.9991350307392995,3.13231208016067,-6.302798791089437,0.8094437280775088,0.0,0.0,0.0,1.0
1718111318.0489316,map,True,True,5,5,0.612995793784914,0.612995793784914,1.2434431314468384,-1.5837856531143188,0.0,0.0,0.0,0.04158352021787696,0.9991350307392995,3.2088743771368016,-6.368863995794884,0.8106506424597114,0.0,0.0,0.0,1.0
1718111318.0941246,map,True,True,5,5,0.612995793784914,0.612995793784914,1.2434431314468384,-1.5837856531143188,0.0,0.0,0.0,0.04158352021787696,0.9991350307392995,3.2088743771368016,-6.368863995794884,0.8106506424597114,0.0,0.0,0.0,1.0
1718111318.1384943,map,True,False,5,5,0.612995793784914,0.612995793784914,1.3885409832000732,-1.612902283668518,0.0,0.0,0.0,0.04013774321317274,0.9991941632429047,3.2088743771368016,-6.368863995794884,0.8106506424597114,0.0,0.0,0.0,1.0
1718111318.1896894,map,True,True,5,5,0.612995793784914,0.612995793784914,1.3885409832000732,-1.612902283668518,0.0,0.0,0.0,0.04013774321317274,0.9991941632429047,3.2088743771368016,-6.368863995794884,0.8106506424597114,0.0,0.0,0.0,1.0
1718111318.286931,map,True,False,5,5,0.612995793784914,0.612995793784914,1.3885409832000732,-1.612902283668518,0.0,0.0,0.0,0.04013774321317274,0.9991941632429047,3.2607816821943594,-6.335168734637833,0.8101220837835278,0.0,0.0,0.0,1.0
1718111318.3858967,map,True,False,5,5,0.612995793784914,0.612995793784914,1.3885409832000732,-1.612902283668518,0.0,0.0,0.0,0.04013774321317274,0.9991941632429047,3.2607816821943594,-6.335168734637833,0.8101220837835278,0.0,0.0,0.0,1.0
1718111318.4368749,map,True,False,5,5,0.612995793784914,0.612995793784914,1.3885409832000732,-1.612902283668518,0.0,0.0,0.0,0.04013774321317274,0.9991941632429047,3.2607816821943594,-6.335168734637833,0.8101220837835278,0.0,0.0,0.0,1.0
1718111318.5409677,map,True,True,5,5,0.612995793784914,0.612995793784914,1.3885409832000732,-1.612902283668518,0.0,0.0,0.0,0.04013774321317274,0.9991941632429047,3.254052745381981,-6.1015088430457975,0.8037823872073198,0.0,0.0,0.0,1.0
1718111318.5934927,map,True,False,5,5,0.612995793784914,0.612995793784914,1.3885409832000732,-1.612902283668518,0.0,0.0,0.0,0.04013774321317274,0.9991941632429047,3.254052745381981,-6.1015088430457975,0.8037823872073198,0.0,0.0,0.0,1.0
1718111318.6886728,map,True,False,5,5,0.612995793784914,0.612995793784914,1.3885409832000732,-1.612902283668518,0.0,0.0,0.0,0.04013774321317274,0.9991941632429047,3.254052745381981,-6.1015088430457975,0.8037823872073198,0.0,0.0,0.0,1.0
1718111318.7874281,map,True,True,5,5,0.612995793784914,0.612995793784914,1.3885409832000732,-1.612902283668518,0.0,0.0,0.0,0.04013774321317274,0.9991941632429047,3.254052745381981,-6.1015088430457975,0.8037823872073198,0.0,0.0,0.0,1.0
1718111318.841799,map,True,False,5,4,0.0,0.0,1.3885409832000732,-1.612902283668518,0.0,0.0,0.0,0.04013774321317274,0.9991941632429047,3.191912333582784,-5.416699489056763,0.7567507207189358,0.0,0.0,0.0,1.0
1718111318.890619,map,True,False,5,4,0.0,0.0,1.3885409832000732,-1.612902283668518,0.0,0.0,0.0,0.04013774321317274,0.9991941632429047,3.1718046377330715,-5.308852076562807,0.7601432576028005,0.0,0.0,0.0,1.0
1718111318.942589,map,True,False,5,4,0.0,0.0,1.3885409832000732,-1.612902283668518,0.0,0.0,0.0,0.04013774321317274,0.9991941632429047,3.1718046377330715,-5.308852076562807,0.7601432576028005,0.0,0.0,0.0,1.0
1718111319.039572,map,True,False,5,4,0.0,0.0,1.3885409832000732,-1.612902283668518,0.0,0.0,0.0,0.04013774321317274,0.9991941632429047,3.1718046377330715,-5.308852076562807,0.7601432576028005,0.0,0.0,0.0,1.0
1718111319.091734,map,True,False,5,4,0.0,0.0,1.3885409832000732,-1.612902283668518,0.0,0.0,0.0,0.04013774321317274,0.9991941632429047,3.1718046377330715,-5.308852076562807,0.7601432576028005,0.0,0.0,0.0,1.0
1718111319.1894863,map,True,True,4,4,0.5922520728754596,0.5922520728754596,1.6212987899780273,-1.6729801893234253,0.0,0.0,0.0,0.03875822711974955,0.999248624687594,3.328631498747625,-5.642834445872072,0.7922517613694996,0.0,0.0,0.0,1.0
1718111319.5935447,map,True,False,4,4,0.5922520728754596,0.5922520728754596,1.6212987899780273,-1.6729801893234253,0.0,0.0,0.0,0.03875822711974955,0.999248624687594,3.3199675793266548,-5.319868177594577,0.7717909299882458,0.0,0.0,0.0,1.0
1718111319.642736,map,True,False,4,4,0.5922520728754596,0.5922520728754596,1.6212987899780273,-1.6729801893234253,0.0,0.0,0.0,0.03875822711974955,0.999248624687594,3.3199675793266548,-5.319868177594577,0.7717909299882458,0.0,0.0,0.0,1.0
1718111319.6990392,map,True,True,4,4,0.5922520728754596,0.5922520728754596,1.6212987899780273,-1.6729801893234253,0.0,0.0,0.0,0.03875822711974955,0.999248624687594,3.3199675793266548,-5.319868177594577,0.7717909299882458,0.0,0.0,0.0,1.0
1718111319.7467196,map,True,True,4,4,0.5922520728754596,0.5922520728754596,1.6212987899780273,-1.6729801893234253,0.0,0.0,0.0,0.03875822711974955,0.999248624687594,3.3199675793266548,-5.319868177594577,0.7717909299882458,0.0,0.0,0.0,1.0
1718111319.84589,map,True,False,4,4,0.5922520728754596,0.5922520728754596,1.6212987899780273,-1.6729801893234253,0.0,0.0,0.0,0.03875822711974955,0.999248624687594,3.3199675793266548,-5.319868177594577,0.7717909299882458,0.0,0.0,0.0,1.0
1718111319.9473462,map,True,False,4,3,0.0,0.0,1.6212987899780273,-1.6729801893234253,0.0,0.0,0.0,0.03875822711974955,0.999248624687594,3.3035473151621617,-4.80225840861306,0.7447375790181442,0.0,0.0,0.0,1.0
1718111320.0026186,map,True,False,4,3,0.0,0.0,1.6212987899780273,-1.6729801893234253,0.0,0.0,0.0,0.03875822711974955,0.999248624687594,3.3035473151621617,-4.80225840861306,0.7447375790181442,0.0,0.0,0.0,1.0
1718111320.0511012,map,True,False,4,3,0.0,0.0,1.6212987899780273,-1.6729801893234253,0.0,0.0,0.0,0.03875822711974955,0.999248624687594,3.3035473151621617,-4.80225840861306,0.7447375790181442,0.0,0.0,0.0,1.0
1718111320.1050181,map,True,False,4,3,0.0,0.0,1.6212987899780273,-1.6729801893234253,0.0,0.0,0.0,0.03875822711974955,0.999248624687594,3.3035473151621617,-4.80225840861306,0.7447375790181442,0.0,0.0,0.0,1.0
1718111320.1540015,map,True,False,4,3,0.0,0.0,1.6212987899780273,-1.6729801893234253,0.0,0.0,0.0,0.03875822711974955,0.999248624687594,3.3035473151621617,-4.80225840861306,0.7447375790181442,0.0,0.0,0.0,1.0
1718111320.2019935,map,True,False,4,3,0.0,0.0,1.6212987899780273,-1.6729801893234253,0.0,0.0,0.0,0.03875822711974955,0.999248624687594,3.323355775207395,-4.503493861613595,0.7567730723930327,0.0,0.0,0.0,1.0
1718111320.65732,map,True,False,4,3,0.0,0.0,1.7366905212402344,-1.6965827941894531,0.0,0.0,0.0,0.03773741311965654,0.999287694322663,3.334614553812699,-4.3008573020618925,0.7636411282259167,0.0,0.0,0.0,1.0
1718111320.7127059,map,True,False,4,3,0.0,0.0,1.7366905212402344,-1.6965827941894531,0.0,0.0,0.0,0.03773741311965654,0.999287694322663,3.334614553812699,-4.3008573020618925,0.7636411282259167,0.0,0.0,0.0,1.0
1718111320.8132267,map,True,False,4,3,0.0,0.0,1.7366905212402344,-1.6965827941894531,0.0,0.0,0.0,0.03773741311965654,0.999287694322663,3.334614553812699,-4.3008573020618925,0.7636411282259167,0.0,0.0,0.0,1.0
1718111320.8623497,map,True,False,4,3,0.0,0.0,1.7366905212402344,-1.6965827941894531,0.0,0.0,0.0,0.03773741311965654,0.999287694322663,3.334614553812699,-4.3008573020618925,0.7636411282259167,0.0,0.0,0.0,1.0
1718111320.9609516,map,True,False,4,3,0.0,0.0,1.7366905212402344,-1.6965827941894531,0.0,0.0,0.0,0.03773741311965654,0.999287694322663,3.478379644119269,-4.066884609015342,0.7420748433488379,0.0,0.0,0.0,1.0
1718111321.0679386,map,True,False,4,2,0.0,0.0,1.7366905212402344,-1.6965827941894531,0.0,0.0,0.0,0.03773741311965654,0.999287694322663,3.41530159719644,-3.8074739924824375,0.7046381160288647,0.0,0.0,0.0,1.0
1718111321.1637776,map,True,False,4,2,0.0,0.0,1.7366905212402344,-1.6965827941894531,0.0,0.0,0.0,0.03773741311965654,0.999287694322663,3.41530159719644,-3.8074739924824375,0.7046381160288647,0.0,0.0,0.0,1.0
1718111321.2162824,map,True,False,4,2,0.0,0.0,1.7366905212402344,-1.6965827941894531,0.0,0.0,0.0,0.03773741311965654,0.999287694322663,3.41530159719644,-3.8074739924824375,0.7046381160288647,0.0,0.0,0.0,1.0
1718111321.265508,map,True,False,4,2,0.0,0.0,1.7366905212402344,-1.6965827941894531,0.0,0.0,0.0,0.03773741311965654,0.999287694322663,3.4329862860324045,-3.774042513100431,0.6941175778662503,0.0,0.0,0.0,1.0
1718111321.3638804,map,True,False,4,2,0.0,0.0,1.7366905212402344,-1.6965827941894531,0.0,0.0,0.0,0.03773741311965654,0.999287694322663,3.5336873568516936,-3.790521241644043,0.6838323006067768,0.0,0.0,0.0,1.0
1718111321.4638875,map,True,False,4,2,0.0,0.0,1.8838788270950317,-1.734940767288208,0.0,0.0,0.0,0.03675364268675472,0.9993243617241878,3.5336873568516936,-3.790521241644043,0.6838323006067768,0.0,0.0,0.0,1.0
1718111321.5650587,map,True,False,4,2,0.0,0.0,1.8838788270950317,-1.734940767288208,0.0,0.0,0.0,0.03675364268675472,0.9993243617241878,3.5336873568516936,-3.790521241644043,0.6838323006067768,0.0,0.0,0.0,1.0
1718111321.6668963,map,True,False,4,2,0.0,0.0,1.8838788270950317,-1.734940767288208,0.0,0.0,0.0,0.03675364268675472,0.9993243617241878,3.6049443885360635,-3.5581078098913945,0.6832004034805603,0.0,0.0,0.0,1.0
1718111321.7649465,map,True,False,4,2,0.0,0.0,1.8838788270950317,-1.734940767288208,0.0,0.0,0.0,0.03675364268675472,0.9993243617241878,3.6049443885360635,-3.5581078098913945,0.6832004034805603,0.0,0.0,0.0,1.0
1718111321.8645244,map,True,False,4,2,0.0,0.0,1.8838788270950317,-1.734940767288208,0.0,0.0,0.0,0.03675364268675472,0.9993243617241878,3.6049443885360635,-3.5581078098913945,0.6832004034805603,0.0,0.0,0.0,1.0
1718111321.9149332,map,True,False,4,2,0.0,0.0,1.8838788270950317,-1.734940767288208,0.0,0.0,0.0,0.03675364268675472,0.9993243617241878,3.6049443885360635,-3.5581078098913945,0.6832004034805603,0.0,0.0,0.0,1.0
1718111322.017492,map,True,False,3,2,0.0,0.0,2.118972063064575,-1.7934935092926025,0.0,0.0,0.0,0.03548436517505727,0.9993702276329428,3.7217286728053987,-3.3325205534405566,0.6824484413495617,0.0,0.0,0.0,1.0
1718111322.0654757,map,True,False,3,2,0.0,0.0,2.118972063064575,-1.7934935092926025,0.0,0.0,0.0,0.03548436517505727,0.9993702276329428,3.7217286728053987,-3.3325205534405566,0.6824484413495617,0.0,0.0,0.0,1.0
1718111322.165909,map,True,False,3,2,0.0,0.0,2.118972063064575,-1.7934935092926025,0.0,0.0,0.0,0.03548436517505727,0.9993702276329428,3.7217286728053987,-3.3325205534405566,0.6824484413495617,0.0,0.0,0.0,1.0
1718111322.367923,map,True,False,3,2,0.0,0.0,2.118972063064575,-1.7934935092926025,0.0,0.0,0.0,0.03548436517505727,0.9993702276329428,3.74342311434927,-3.155663036375744,0.6845507094117793,0.0,0.0,0.0,1.0
1718111322.4140782,map,True,False,3,2,0.0,0.0,2.118972063064575,-1.7934935092926025,0.0,0.0,0.0,0.03548436517505727,0.9993702276329428,3.74342311434927,-3.155663036375744,0.6845507094117793,0.0,0.0,0.0,1.0
1718111322.4650867,map,True,False,3,2,0.0,0.0,2.118972063064575,-1.7934935092926025,0.0,0.0,0.0,0.03548436517505727,0.9993702276329428,3.74342311434927,-3.155663036375744,0.6845507094117793,0.0,0.0,0.0,1.0
1718111322.5152082,map,True,False,3,2,0.0,0.0,2.118972063064575,-1.7934935092926025,0.0,0.0,0.0,0.03548436517505727,0.9993702276329428,3.74342311434927,-3.155663036375744,0.6845507094117793,0.0,0.0,0.0,1.0
1718111322.5659528,map,True,False,3,2,0.0,0.0,2.118972063064575,-1.7934935092926025,0.0,0.0,0.0,0.03548436517505727,0.9993702276329428,3.74342311434927,-3.155663036375744,0.6845507094117793,0.0,0.0,0.0,1.0
1718111322.6152973,map,True,False,3,2,0.0,0.0,2.118972063064575,-1.7934935092926025,0.0,0.0,0.0,0.03548436517505727,0.9993702276329428,3.74342311434927,-3.155663036375744,0.6845507094117793,0.0,0.0,0.0,1.0
1718111322.6665213,map,True,False,3,2,0.0,0.0,2.118972063064575,-1.7934935092926025,0.0,0.0,0.0,0.03548436517505727,0.9993702276329428,3.763327115277427,-2.9238475424074313,0.6836691577645967,0.0,0.0,0.0,1.0
1718111322.7162368,map,True,False,3,2,0.0,0.0,2.118972063064575,-1.7934935092926025,0.0,0.0,0.0,0.03548436517505727,0.9993702276329428,3.754303380600059,-2.882170013192904,0.6814757948109434,0.0,0.0,0.0,1.0
1718111322.767026,map,True,False,3,2,0.0,0.0,2.224735975265503,-1.8174349069595337,0.0,0.0,0.0,0.03518559183681672,0.999380799158005,3.754303380600059,-2.882170013192904,0.6814757948109434,0.0,0.0,0.0,1.0
1718111322.867309,map,True,False,3,2,0.0,0.0,2.224735975265503,-1.8174349069595337,0.0,0.0,0.0,0.03518559183681672,0.999380799158005,3.754303380600059,-2.882170013192904,0.6814757948109434,0.0,0.0,0.0,1.0
1718111322.9172306,map,True,False,3,2,0.0,0.0,2.224735975265503,-1.8174349069595337,0.0,0.0,0.0,0.03518559183681672,0.999380799158005,3.754303380600059,-2.882170013192904,0.6814757948109434,0.0,0.0,0.0,1.0
1718111323.0171402,map,True,False,3,1,0.0,0.0,2.224735975265503,-1.8174349069595337,0.0,0.0,0.0,0.03518559183681672,0.999380799158005,3.708315705283618,-2.760012095956506,0.6813472445115725,0.0,0.0,0.0,1.0
1718111323.0671723,map,True,False,3,1,0.0,0.0,2.224735975265503,-1.8174349069595337,0.0,0.0,0.0,0.03518559183681672,0.999380799158005,3.708315705283618,-2.760012095956506,0.6813472445115725,0.0,0.0,0.0,1.0
1718111323.1189983,map,True,False,3,1,0.0,0.0,2.224735975265503,-1.8174349069595337,0.0,0.0,0.0,0.03518559183681672,0.999380799158005,3.708315705283618,-2.760012095956506,0.6813472445115725,0.0,0.0,0.0,1.0
1718111323.1683962,map,True,False,3,1,0.0,0.0,2.224735975265503,-1.8174349069595337,0.0,0.0,0.0,0.03518559183681672,0.999380799158005,3.708315705283618,-2.760012095956506,0.6813472445115725,0.0,0.0,0.0,1.0
1718111323.2173169,map,True,False,3,1,0.0,0.0,2.224735975265503,-1.8174349069595337,0.0,0.0,0.0,0.03518559183681672,0.999380799158005,3.708315705283618,-2.760012095956506,0.6813472445115725,0.0,0.0,0.0,1.0
1718111323.3688674,map,True,False,3,1,0.0,0.0,2.224735975265503,-1.8174349069595337,0.0,0.0,0.0,0.03518559183681672,0.999380799158005,3.7459605732828596,-2.7623943398001236,0.6814474372407344,0.0,0.0,0.0,1.0
1718111323.4189196,map,True,False,3,1,0.0,0.0,2.224735975265503,-1.8174349069595337,0.0,0.0,0.0,0.03518559183681672,0.999380799158005,3.77656697742771,-2.7415665083450302,0.6813110307636667,0.0,0.0,0.0,1.0
1718111323.5189698,map,True,False,3,1,0.0,0.0,2.224735975265503,-1.8174349069595337,0.0,0.0,0.0,0.03518559183681672,0.999380799158005,3.77656697742771,-2.7415665083450302,0.6813110307636667,0.0,0.0,0.0,1.0
1718111323.5699112,map,True,False,3,1,0.0,0.0,2.3662803173065186,-1.844683289527893,0.0,0.0,0.0,0.03380692178174135,0.9994283770918414,3.77656697742771,-2.7415665083450302,0.6813110307636667,0.0,0.0,0.0,1.0
1718111323.6203434,map,True,False,3,1,0.0,0.0,2.3662803173065186,-1.844683289527893,0.0,0.0,0.0,0.03380692178174135,0.9994283770918414,3.77656697742771,-2.7415665083450302,0.6813110307636667,0.0,0.0,0.0,1.0
1718111323.6705692,map,True,False,3,1,0.0,0.0,2.3662803173065186,-1.844683289527893,0.0,0.0,0.0,0.03380692178174135,0.9994283770918414,3.77656697742771,-2.7415665083450302,0.6813110307636667,0.0,0.0,0.0,1.0
1718111323.7705994,map,True,False,3,2,0.0,0.0,2.3662803173065186,-1.844683289527893,0.0,0.0,0.0,0.03380692178174135,0.9994283770918414,3.7889431059083742,-2.763425227766357,0.6814585588566391,0.0,0.0,0.0,1.0
1718111323.870896,map,True,False,3,2,0.0,0.0,2.3662803173065186,-1.844683289527893,0.0,0.0,0.0,0.03380692178174135,0.9994283770918414,3.7889431059083742,-2.763425227766357,0.6814585588566391,0.0,0.0,0.0,1.0
1718111323.9234538,map,True,False,3,2,0.0,0.0,2.3662803173065186,-1.844683289527893,0.0,0.0,0.0,0.03380692178174135,0.9994283770918414,3.7889431059083742,-2.763425227766357,0.6814585588566391,0.0,0.0,0.0,1.0
1718111324.0264344,map,True,False,3,2,0.0,0.0,2.3662803173065186,-1.844683289527893,0.0,0.0,0.0,0.03380692178174135,0.9994283770918414,3.8391709145531263,-2.774346744952833,0.6815019575594395,0.0,0.0,0.0,1.0
1718111324.074074,map,True,False,3,2,0.0,0.0,2.3662803173065186,-1.844683289527893,0.0,0.0,0.0,0.03380692178174135,0.9994283770918414,3.818869635496683,-2.7736431382400366,0.6815559034055992,0.0,0.0,0.0,1.0
1718111324.1211557,map,True,False,3,2,0.0,0.0,2.3662803173065186,-1.844683289527893,0.0,0.0,0.0,0.03380692178174135,0.9994283770918414,3.818869635496683,-2.7736431382400366,0.6815559034055992,0.0,0.0,0.0,1.0
1718111324.1714227,map,True,False,3,2,0.0,0.0,2.3662803173065186,-1.844683289527893,0.0,0.0,0.0,0.03380692178174135,0.9994283770918414,3.818869635496683,-2.7736431382400366,0.6815559034055992,0.0,0.0,0.0,1.0
1718111324.224111,map,True,False,3,2,0.0,0.0,2.3662803173065186,-1.844683289527893,0.0,0.0,0.0,0.03380692178174135,0.9994283770918414,3.818869635496683,-2.7736431382400366,0.6815559034055992,0.0,0.0,0.0,1.0
1718111324.3708506,map,True,False,2,2,0.49874686716791977,0.49874686716791977,2.4753589630126953,-1.8673527240753174,0.0,0.0,0.0,0.032501299872456646,0.9994716887851142,3.8179061532178453,-2.7709449493236473,0.6816574486157128,0.0,0.0,0.0,1.0
1718111324.4206424,map,True,False,2,2,0.49874686716791977,0.49874686716791977,2.4753589630126953,-1.8673527240753174,0.0,0.0,0.0,0.032501299872456646,0.9994716887851142,3.8160515182300814,-2.774621583584888,0.6816717858133884,0.0,0.0,0.0,1.0
1718111324.4708912,map,True,True,2,2,0.49874686716791977,0.49874686716791977,2.4753589630126953,-1.8673527240753174,0.0,0.0,0.0,0.032501299872456646,0.9994716887851142,3.8160515182300814,-2.774621583584888,0.6816717858133884,0.0,0.0,0.0,1.0
1718111324.5719585,map,True,False,2,2,0.49874686716791977,0.49874686716791977,2.4753589630126953,-1.8673527240753174,0.0,0.0,0.0,0.032501299872456646,0.9994716887851142,3.8160515182300814,-2.774621583584888,0.6816717858133884,0.0,0.0,0.0,1.0
1718111324.6722133,map,True,False,2,2,0.49874686716791977,0.49874686716791977,2.4753589630126953,-1.8673527240753174,0.0,0.0,0.0,0.032501299872456646,0.9994716887851142,3.8160515182300814,-2.774621583584888,0.6816717858133884,0.0,0.0,0.0,1.0
1718111324.7760057,map,True,False,2,2,0.49874686716791977,0.49874686716791977,2.4753589630126953,-1.8673527240753174,0.0,0.0,0.0,0.032501299872456646,0.9994716887851142,3.829264643269542,-2.777778764777828,0.6817286266399739,0.0,0.0,0.0,1.0
1718111324.8229494,map,True,True,2,2,0.49874686716791977,0.49874686716791977,2.4753589630126953,-1.8673527240753174,0.0,0.0,0.0,0.032501299872456646,0.9994716887851142,3.829264643269542,-2.777778764777828,0.6817286266399739,0.0,0.0,0.0,1.0
1718111324.8739948,map,True,False,2,2,0.49874686716791977,0.49874686716791977,2.4753589630126953,-1.8673527240753174,0.0,0.0,0.0,0.032501299872456646,0.9994716887851142,3.829264643269542,-2.777778764777828,0.6817286266399739,0.0,0.0,0.0,1.0
1718111324.9239585,map,True,True,2,2,0.49874686716791977,0.49874686716791977,2.4753589630126953,-1.8673527240753174,0.0,0.0,0.0,0.032501299872456646,0.9994716887851142,3.829264643269542,-2.777778764777828,0.6817286266399739,0.0,0.0,0.0,1.0
1718111325.024301,map,True,True,2,2,0.49874686716791977,0.49874686716791977,2.65324068069458,-1.9118791818618774,0.0,0.0,0.0,0.03204600597882774,0.9994863889882856,3.8628441231367234,-2.8004336995032135,0.681841084480352,0.0,0.0,0.0,1.0
1718111325.0740094,map,True,True,2,2,0.49874686716791977,0.49874686716791977,2.65324068069458,-1.9118791818618774,0.0,0.0,0.0,0.03204600597882774,0.9994863889882856,3.8315128322069265,-2.795750705793417,0.6819152644898618,0.0,0.0,0.0,1.0
1718111325.1742249,map,True,False,2,2,0.49874686716791977,0.49874686716791977,2.65324068069458,-1.9118791818618774,0.0,0.0,0.0,0.03204600597882774,0.9994863889882856,3.8315128322069265,-2.795750705793417,0.6819152644898618,0.0,0.0,0.0,1.0
1718111325.224261,map,True,True,2,2,0.49874686716791977,0.49874686716791977,2.65324068069458,-1.9118791818618774,0.0,0.0,0.0,0.03204600597882774,0.9994863889882856,3.8315128322069265,-2.795750705793417,0.6819152644898618,0.0,0.0,0.0,1.0
1718111325.3740506,map,True,True,2,2,0.49874686716791977,0.49874686716791977,2.65324068069458,-1.9118791818618774,0.0,0.0,0.0,0.03204600597882774,0.9994863889882856,3.859033878782995,-2.7876717579675843,0.6833632454579025,0.0,0.0,0.0,1.0
1718111325.424559,map,True,True,2,2,0.49874686716791977,0.49874686716791977,2.65324068069458,-1.9118791818618774,0.0,0.0,0.0,0.03204600597882774,0.9994863889882856,3.859033878782995,-2.7876717579675843,0.6833632454579025,0.0,0.0,0.0,1.0
1718111325.4754915,map,True,True,2,2,0.49874686716791977,0.49874686716791977,2.65324068069458,-1.9118791818618774,0.0,0.0,0.0,0.03204600597882774,0.9994863889882856,3.859033878782995,-2.7876717579675843,0.6833632454579025,0.0,0.0,0.0,1.0
1718111325.5251644,map,True,False,2,2,0.49874686716791977,0.49874686716791977,2.65324068069458,-1.9118791818618774,0.0,0.0,0.0,0.03204600597882774,0.9994863889882856,3.859033878782995,-2.7876717579675843,0.6833632454579025,0.0,0.0,0.0,1.0
1718111325.5760913,map,True,False,2,2,0.49874686716791977,0.49874686716791977,2.65324068069458,-1.9118791818618774,0.0,0.0,0.0,0.03204600597882774,0.9994863889882856,3.859033878782995,-2.7876717579675843,0.6833632454579025,0.0,0.0,0.0,1.0
1718111325.6800523,map,True,False,1,2,0.0,0.0,2.785799503326416,-1.9723597764968872,0.0,0.0,0.0,0.03285281537142708,0.9994601938508643,3.859033878782995,-2.7876717579675843,0.6833632454579025,0.0,0.0,0.0,1.0
1718111325.7403572,map,True,False,1,2,0.0,0.0,2.785799503326416,-1.9723597764968872,0.0,0.0,0.0,0.03285281537142708,0.9994601938508643,3.859033878782995,-2.7876717579675843,0.6833632454579025,0.0,0.0,0.0,1.0
1718111325.7862167,map,True,False,1,2,0.0,0.0,2.785799503326416,-1.9723597764968872,0.0,0.0,0.0,0.03285281537142708,0.9994601938508643,3.8881656721432245,-2.744858491033538,0.6818490649050084,0.0,0.0,0.0,1.0
1718111325.8848164,map,True,False,1,2,0.0,0.0,2.785799503326416,-1.9723597764968872,0.0,0.0,0.0,0.03285281537142708,0.9994601938508643,3.8881656721432245,-2.744858491033538,0.6818490649050084,0.0,0.0,0.0,1.0
1718111325.9850903,map,True,False,1,2,0.0,0.0,2.785799503326416,-1.9723597764968872,0.0,0.0,0.0,0.03285281537142708,0.9994601938508643,3.8881656721432245,-2.744858491033538,0.6818490649050084,0.0,0.0,0.0,1.0
1718111326.0369797,map,True,False,1,2,0.0,0.0,2.785799503326416,-1.9723597764968872,0.0,0.0,0.0,0.03285281537142708,0.9994601938508643,3.8881656721432245,-2.744858491033538,0.6818490649050084,0.0,0.0,0.0,1.0
1718111326.0895486,map,True,False,1,2,0.0,0.0,2.785799503326416,-1.9723597764968872,0.0,0.0,0.0,0.03285281537142708,0.9994601938508643,3.9390922123694114,-2.684242424408572,0.6816599010115603,0.0,0.0,0.0,1.0
1718111326.1387699,map,True,False,1,2,0.0,0.0,2.785799503326416,-1.9723597764968872,0.0,0.0,0.0,0.03285281537142708,0.9994601938508643,3.9563213520727927,-2.7825347491072874,0.6818596677187995,0.0,0.0,0.0,1.0
1718111326.1889968,map,True,False,1,2,0.0,0.0,2.785799503326416,-1.9723597764968872,0.0,0.0,0.0,0.03285281537142708,0.9994601938508643,3.9563213520727927,-2.7825347491072874,0.6818596677187995,0.0,0.0,0.0,1.0
1718111326.2399535,map,True,False,1,2,0.0,0.0,2.785799503326416,-1.9723597764968872,0.0,0.0,0.0,0.03285281537142708,0.9994601938508643,3.9563213520727927,-2.7825347491072874,0.6818596677187995,0.0,0.0,0.0,1.0
