timestamp_sec,frame_id,game_played,yielding,player1discrete,player2discrete,player1yieldprob,player2yieldprob,player1_pose_x,player1_pose_y,player1_pose_z,player1_pose_orient_x,player1_pose_orient_y,player1_pose_orient_z,player1_pose_orient_w,player2_pose_x,player2_pose_y,player2_pose_z,player2_pose_orient_x,player2_pose_orient_y,player2_pose_orient_z,player2_pose_orient_w
1717777250.0167398,map,True,False,4,5,0.0,0.0,2.709839344024658,-2.4643983840942383,0.0,0.0,0.0,0.06740923558852659,0.9977254032552761,4.620194660665074,-7.156695375538512,1.1303273148915682,0.0,0.0,0.0,1.0
1717777250.0669608,map,True,False,4,5,0.0,0.0,2.709839344024658,-2.4643983840942383,0.0,0.0,0.0,0.06740923558852659,0.9977254032552761,4.620194660665074,-7.156695375538512,1.1303273148915682,0.0,0.0,0.0,1.0
1717777250.1181605,map,True,False,4,5,0.0,0.0,2.709839344024658,-2.4643983840942383,0.0,0.0,0.0,0.06740923558852659,0.9977254032552761,4.620194660665074,-7.156695375538512,1.1303273148915682,0.0,0.0,0.0,1.0
1717777250.1683095,map,True,False,4,5,0.0,0.0,2.709839344024658,-2.4643983840942383,0.0,0.0,0.0,0.06740923558852659,0.9977254032552761,4.620194660665074,-7.156695375538512,1.1303273148915682,0.0,0.0,0.0,1.0
1717777250.3184378,map,True,False,4,5,0.0,0.0,2.709839344024658,-2.4643983840942383,0.0,0.0,0.0,0.06740923558852659,0.9977254032552761,4.637013551652305,-6.977260934450708,1.1061265579808386,0.0,0.0,0.0,1.0
1717777250.3687787,map,True,False,4,5,0.0,0.0,2.709839344024658,-2.4643983840942383,0.0,0.0,0.0,0.06740923558852659,0.9977254032552761,4.622636327961864,-6.9082909365869565,1.1131836397744967,0.0,0.0,0.0,1.0
1717777250.4688957,map,True,False,4,5,0.0,0.0,2.709839344024658,-2.4643983840942383,0.0,0.0,0.0,0.06740923558852659,0.9977254032552761,4.622636327961864,-6.9082909365869565,1.1131836397744967,0.0,0.0,0.0,1.0
1717777250.56854,map,True,False,4,5,0.0,0.0,2.709839344024658,-2.4643983840942383,0.0,0.0,0.0,0.06740923558852659,0.9977254032552761,4.622636327961864,-6.9082909365869565,1.1131836397744967,0.0,0.0,0.0,1.0
1717777250.6687179,map,True,True,4,4,0.5922520728754596,0.5922520728754596,2.709839344024658,-2.4643983840942383,0.0,0.0,0.0,0.06740923558852659,0.9977254032552761,4.5823674517346165,-6.346387621837012,0.788496625922507,0.0,0.0,0.0,1.0
1717777250.7673147,map,True,True,4,4,0.5922520728754596,0.5922520728754596,2.8114852905273438,-2.484651565551758,0.0,0.0,0.0,0.06813872775850974,0.9976758621904929,4.585448104625564,-6.260909900748641,0.7922156391829387,0.0,0.0,0.0,1.0
1717777250.8177032,map,True,True,4,4,0.5922520728754596,0.5922520728754596,2.8114852905273438,-2.484651565551758,0.0,0.0,0.0,0.06813872775850974,0.9976758621904929,4.585448104625564,-6.260909900748641,0.7922156391829387,0.0,0.0,0.0,1.0
1717777250.8677151,map,True,False,4,4,0.5922520728754596,0.5922520728754596,2.8114852905273438,-2.484651565551758,0.0,0.0,0.0,0.06813872775850974,0.9976758621904929,4.585448104625564,-6.260909900748641,0.7922156391829387,0.0,0.0,0.0,1.0
1717777250.967645,map,True,True,4,4,0.5922520728754596,0.5922520728754596,2.8114852905273438,-2.484651565551758,0.0,0.0,0.0,0.06813872775850974,0.9976758621904929,4.585448104625564,-6.260909900748641,0.7922156391829387,0.0,0.0,0.0,1.0
1717777251.0177946,map,True,True,4,4,0.5922520728754596,0.5922520728754596,2.8114852905273438,-2.484651565551758,0.0,0.0,0.0,0.06813872775850974,0.9976758621904929,4.584379507638476,-5.793900526960052,0.9621850208602977,0.0,0.0,0.0,1.0
1717777251.0686264,map,True,False,4,4,0.5922520728754596,0.5922520728754596,2.8114852905273438,-2.484651565551758,0.0,0.0,0.0,0.06813872775850974,0.9976758621904929,4.57872550487745,-5.92537714993773,0.8822739660108733,0.0,0.0,0.0,1.0
1717777251.1199267,map,True,True,4,4,0.5922520728754596,0.5922520728754596,2.8114852905273438,-2.484651565551758,0.0,0.0,0.0,0.06813872775850974,0.9976758621904929,4.57872550487745,-5.92537714993773,0.8822739660108733,0.0,0.0,0.0,1.0
1717777251.1705136,map,True,False,4,4,0.5922520728754596,0.5922520728754596,2.8114852905273438,-2.484651565551758,0.0,0.0,0.0,0.06813872775850974,0.9976758621904929,4.57872550487745,-5.92537714993773,0.8822739660108733,0.0,0.0,0.0,1.0
1717777251.4215329,map,True,True,4,4,0.5922520728754596,0.5922520728754596,2.9427170753479004,-2.513049602508545,0.0,0.0,0.0,0.06949623109941551,0.9975822098635142,4.628706519330229,-5.763163636441059,0.8129510439424268,0.0,0.0,0.0,1.0
1717777251.521189,map,True,False,4,4,0.5922520728754596,0.5922520728754596,2.9427170753479004,-2.513049602508545,0.0,0.0,0.0,0.06949623109941551,0.9975822098635142,4.628706519330229,-5.763163636441059,0.8129510439424268,0.0,0.0,0.0,1.0
1717777251.6240232,map,True,False,4,4,0.5922520728754596,0.5922520728754596,2.9427170753479004,-2.513049602508545,0.0,0.0,0.0,0.06949623109941551,0.9975822098635142,4.628706519330229,-5.763163636441059,0.8129510439424268,0.0,0.0,0.0,1.0
1717777251.7202966,map,True,True,4,4,0.5922520728754596,0.5922520728754596,2.9427170753479004,-2.513049602508545,0.0,0.0,0.0,0.06949623109941551,0.9975822098635142,4.68373114649664,-5.762044536097535,0.7530910927791524,0.0,0.0,0.0,1.0
1717777251.820117,map,True,True,4,4,0.5922520728754596,0.5922520728754596,2.9427170753479004,-2.513049602508545,0.0,0.0,0.0,0.06949623109941551,0.9975822098635142,4.68373114649664,-5.762044536097535,0.7530910927791524,0.0,0.0,0.0,1.0
1717777251.8708134,map,True,True,4,4,0.5922520728754596,0.5922520728754596,2.9427170753479004,-2.513049602508545,0.0,0.0,0.0,0.06949623109941551,0.9975822098635142,4.68373114649664,-5.762044536097535,0.7530910927791524,0.0,0.0,0.0,1.0
1717777251.9203892,map,True,False,4,4,0.5922520728754596,0.5922520728754596,2.9427170753479004,-2.513049602508545,0.0,0.0,0.0,0.06949623109941551,0.9975822098635142,4.68373114649664,-5.762044536097535,0.7530910927791524,0.0,0.0,0.0,1.0
1717777252.0203679,map,True,False,3,4,0.0,0.0,3.0191149711608887,-2.537890672683716,0.0,0.0,0.0,0.069995088892035,0.9975473307133839,4.68373114649664,-5.762044536097535,0.7530910927791524,0.0,0.0,0.0,1.0
1717777252.0705414,map,True,True,3,3,0.6616527499769684,0.6616527499769684,3.0191149711608887,-2.537890672683716,0.0,0.0,0.0,0.069995088892035,0.9975473307133839,4.650550376897536,-5.068054525516009,0.6856650689938095,0.0,0.0,0.0,1.0
1717777252.1211739,map,True,True,3,3,0.6616527499769684,0.6616527499769684,3.0191149711608887,-2.537890672683716,0.0,0.0,0.0,0.069995088892035,0.9975473307133839,4.65692130649945,-5.0629652818171245,0.6815533180107307,0.0,0.0,0.0,1.0
1717777252.1750011,map,True,True,3,3,0.6616527499769684,0.6616527499769684,3.0191149711608887,-2.537890672683716,0.0,0.0,0.0,0.069995088892035,0.9975473307133839,4.65692130649945,-5.0629652818171245,0.6815533180107307,0.0,0.0,0.0,1.0
1717777252.4767392,map,True,True,3,3,0.6616527499769684,0.6616527499769684,3.0191149711608887,-2.537890672683716,0.0,0.0,0.0,0.069995088892035,0.9975473307133839,4.660313376799528,-4.909609553321589,0.6853356822947604,0.0,0.0,0.0,1.0
1717777252.5260592,map,True,False,3,3,0.6616527499769684,0.6616527499769684,3.0191149711608887,-2.537890672683716,0.0,0.0,0.0,0.069995088892035,0.9975473307133839,4.660313376799528,-4.909609553321589,0.6853356822947604,0.0,0.0,0.0,1.0
1717777252.5775847,map,True,True,3,3,0.6616527499769684,0.6616527499769684,3.0191149711608887,-2.537890672683716,0.0,0.0,0.0,0.069995088892035,0.9975473307133839,4.660313376799528,-4.909609553321589,0.6853356822947604,0.0,0.0,0.0,1.0
1717777252.6765494,map,True,False,3,3,0.6616527499769684,0.6616527499769684,3.1563711166381836,-2.554069995880127,0.0,0.0,0.0,0.07329775245886658,0.9973101052010869,4.660313376799528,-4.909609553321589,0.6853356822947604,0.0,0.0,0.0,1.0
1717777252.7338655,map,True,False,3,2,0.0,0.0,3.1563711166381836,-2.554069995880127,0.0,0.0,0.0,0.07329775245886658,0.9973101052010869,4.579817281418803,-4.425279896254723,0.6874479650968355,0.0,0.0,0.0,1.0
1717777252.7822213,map,True,False,3,2,0.0,0.0,3.1563711166381836,-2.554069995880127,0.0,0.0,0.0,0.07329775245886658,0.9973101052010869,4.589987819297644,-4.389018077848893,0.6842249876695297,0.0,0.0,0.0,1.0
1717777252.8307264,map,True,False,3,2,0.0,0.0,3.1563711166381836,-2.554069995880127,0.0,0.0,0.0,0.07329775245886658,0.9973101052010869,4.589987819297644,-4.389018077848893,0.6842249876695297,0.0,0.0,0.0,1.0
1717777252.8804622,map,True,False,3,2,0.0,0.0,3.1563711166381836,-2.554069995880127,0.0,0.0,0.0,0.07329775245886658,0.9973101052010869,4.589987819297644,-4.389018077848893,0.6842249876695297,0.0,0.0,0.0,1.0
1717777252.9309723,map,True,False,3,2,0.0,0.0,3.1563711166381836,-2.554069995880127,0.0,0.0,0.0,0.07329775245886658,0.9973101052010869,4.589987819297644,-4.389018077848893,0.6842249876695297,0.0,0.0,0.0,1.0
1717777252.9808228,map,True,False,3,2,0.0,0.0,3.1563711166381836,-2.554069995880127,0.0,0.0,0.0,0.07329775245886658,0.9973101052010869,4.589987819297644,-4.389018077848893,0.6842249876695297,0.0,0.0,0.0,1.0
1717777253.0311587,map,True,False,3,2,0.0,0.0,3.1563711166381836,-2.554069995880127,0.0,0.0,0.0,0.07329775245886658,0.9973101052010869,4.589987819297644,-4.389018077848893,0.6842249876695297,0.0,0.0,0.0,1.0
1717777253.0812829,map,True,False,3,2,0.0,0.0,3.2220053672790527,-2.5524446964263916,0.0,0.0,0.0,0.07238013696141808,0.997377114912966,4.636713139632262,-4.157756337313858,0.6863241336224785,0.0,0.0,0.0,1.0
1717777253.1321526,map,True,False,3,2,0.0,0.0,3.2220053672790527,-2.5524446964263916,0.0,0.0,0.0,0.07238013696141808,0.997377114912966,4.636713139632262,-4.157756337313858,0.6863241336224785,0.0,0.0,0.0,1.0
1717777253.1823573,map,True,False,3,2,0.0,0.0,3.2220053672790527,-2.5524446964263916,0.0,0.0,0.0,0.07238013696141808,0.997377114912966,4.636713139632262,-4.157756337313858,0.6863241336224785,0.0,0.0,0.0,1.0
1717777253.3871396,map,True,False,3,2,0.0,0.0,3.2220053672790527,-2.5524446964263916,0.0,0.0,0.0,0.07238013696141808,0.997377114912966,4.706907819385274,-4.0479680444025625,0.6858936473035886,0.0,0.0,0.0,1.0
1717777253.482819,map,True,False,3,2,0.0,0.0,3.2220053672790527,-2.5524446964263916,0.0,0.0,0.0,0.07238013696141808,0.997377114912966,4.6679522179021316,-3.983330968987313,0.685734851049237,0.0,0.0,0.0,1.0
1717777253.5332184,map,True,False,3,2,0.0,0.0,3.2220053672790527,-2.5524446964263916,0.0,0.0,0.0,0.07238013696141808,0.997377114912966,4.6679522179021316,-3.983330968987313,0.685734851049237,0.0,0.0,0.0,1.0
1717777253.5831745,map,True,False,3,2,0.0,0.0,3.2220053672790527,-2.5524446964263916,0.0,0.0,0.0,0.07238013696141808,0.997377114912966,4.6679522179021316,-3.983330968987313,0.685734851049237,0.0,0.0,0.0,1.0
1717777253.6336353,map,True,False,3,2,0.0,0.0,3.2220053672790527,-2.5524446964263916,0.0,0.0,0.0,0.07238013696141808,0.997377114912966,4.6679522179021316,-3.983330968987313,0.685734851049237,0.0,0.0,0.0,1.0
1717777253.7328815,map,True,False,3,2,0.0,0.0,3.281860589981079,-2.5651488304138184,0.0,0.0,0.0,0.0742282674204947,0.9972412829597886,4.657746145790757,-3.8123410840027177,0.6851455072547978,0.0,0.0,0.0,1.0
1717777253.7830725,map,True,False,3,2,0.0,0.0,3.281860589981079,-2.5651488304138184,0.0,0.0,0.0,0.0742282674204947,0.9972412829597886,4.6695869253002105,-3.814348516441587,0.685135607091812,0.0,0.0,0.0,1.0
1717777253.8849304,map,True,False,3,2,0.0,0.0,3.281860589981079,-2.5651488304138184,0.0,0.0,0.0,0.0742282674204947,0.9972412829597886,4.6695869253002105,-3.814348516441587,0.685135607091812,0.0,0.0,0.0,1.0
1717777253.9839036,map,True,False,3,2,0.0,0.0,3.281860589981079,-2.5651488304138184,0.0,0.0,0.0,0.0742282674204947,0.9972412829597886,4.6695869253002105,-3.814348516441587,0.685135607091812,0.0,0.0,0.0,1.0
1717777254.084648,map,True,False,3,2,0.0,0.0,3.281860589981079,-2.5651488304138184,0.0,0.0,0.0,0.0742282674204947,0.9972412829597886,4.770666630551046,-3.812325637271046,0.6850404369643058,0.0,0.0,0.0,1.0
1717777254.135074,map,True,False,3,2,0.0,0.0,3.281860589981079,-2.5651488304138184,0.0,0.0,0.0,0.0742282674204947,0.9972412829597886,4.770666630551046,-3.812325637271046,0.6850404369643058,0.0,0.0,0.0,1.0
1717777254.4070241,map,True,False,3,2,0.0,0.0,3.3859918117523193,-2.5676987171173096,0.0,0.0,0.0,0.07341396041011516,0.9973015587112041,4.781008581738973,-3.820385671991394,0.685109071856056,0.0,0.0,0.0,1.0
1717777254.4418578,map,True,False,3,2,0.0,0.0,3.3859918117523193,-2.5676987171173096,0.0,0.0,0.0,0.07341396041011516,0.9973015587112041,4.770383298500221,-3.821315983029508,0.6829389011550906,0.0,0.0,0.0,1.0
1717777254.4909904,map,True,False,3,2,0.0,0.0,3.3859918117523193,-2.5676987171173096,0.0,0.0,0.0,0.07341396041011516,0.9973015587112041,4.770383298500221,-3.821315983029508,0.6829389011550906,0.0,0.0,0.0,1.0
1717777254.5416434,map,True,False,3,2,0.0,0.0,3.3859918117523193,-2.5676987171173096,0.0,0.0,0.0,0.07341396041011516,0.9973015587112041,4.770383298500221,-3.821315983029508,0.6829389011550906,0.0,0.0,0.0,1.0
1717777254.641313,map,True,False,3,2,0.0,0.0,3.3859918117523193,-2.5676987171173096,0.0,0.0,0.0,0.07341396041011516,0.9973015587112041,4.770383298500221,-3.821315983029508,0.6829389011550906,0.0,0.0,0.0,1.0
1717777254.7406504,map,True,True,2,2,0.49874686716791977,0.49874686716791977,3.481520175933838,-2.595473051071167,0.0,0.0,0.0,0.07397322998110285,0.9972602297214468,4.812647409153684,-3.805887107998549,0.6849953010044716,0.0,0.0,0.0,1.0
1717777254.7913797,map,True,True,2,2,0.49874686716791977,0.49874686716791977,3.481520175933838,-2.595473051071167,0.0,0.0,0.0,0.07397322998110285,0.9972602297214468,4.809025115668762,-3.8075441172763345,0.6850073522494695,0.0,0.0,0.0,1.0
1717777254.8406384,map,True,False,2,2,0.49874686716791977,0.49874686716791977,3.481520175933838,-2.595473051071167,0.0,0.0,0.0,0.07397322998110285,0.9972602297214468,4.809025115668762,-3.8075441172763345,0.6850073522494695,0.0,0.0,0.0,1.0
1717777254.8908572,map,True,False,2,2,0.49874686716791977,0.49874686716791977,3.481520175933838,-2.595473051071167,0.0,0.0,0.0,0.07397322998110285,0.9972602297214468,4.809025115668762,-3.8075441172763345,0.6850073522494695,0.0,0.0,0.0,1.0
1717777254.9413064,map,True,False,2,2,0.49874686716791977,0.49874686716791977,3.481520175933838,-2.595473051071167,0.0,0.0,0.0,0.07397322998110285,0.9972602297214468,4.809025115668762,-3.8075441172763345,0.6850073522494695,0.0,0.0,0.0,1.0
1717777254.9921093,map,True,False,2,2,0.49874686716791977,0.49874686716791977,3.481520175933838,-2.595473051071167,0.0,0.0,0.0,0.07397322998110285,0.9972602297214468,4.809025115668762,-3.8075441172763345,0.6850073522494695,0.0,0.0,0.0,1.0
1717777255.0419016,map,True,False,2,2,0.49874686716791977,0.49874686716791977,3.481520175933838,-2.595473051071167,0.0,0.0,0.0,0.07397322998110285,0.9972602297214468,4.809025115668762,-3.8075441172763345,0.6850073522494695,0.0,0.0,0.0,1.0
1717777255.0926552,map,True,False,2,2,0.49874686716791977,0.49874686716791977,3.481520175933838,-2.595473051071167,0.0,0.0,0.0,0.07397322998110285,0.9972602297214468,4.849728375613623,-3.837699329235156,0.685099139152987,0.0,0.0,0.0,1.0
1717777255.1441767,map,True,True,2,2,0.49874686716791977,0.49874686716791977,3.4761548042297363,-2.5839340686798096,0.0,0.0,0.0,0.07462266288586789,0.9972118460308128,4.849728375613623,-3.837699329235156,0.685099139152987,0.0,0.0,0.0,1.0
1717777255.396579,map,True,False,2,2,0.49874686716791977,0.49874686716791977,3.4761548042297363,-2.5839340686798096,0.0,0.0,0.0,0.07462266288586789,0.9972118460308128,4.885476440386542,-3.8504209051387344,0.6851191301504248,0.0,0.0,0.0,1.0
1717777255.4467213,map,True,False,2,2,0.49874686716791977,0.49874686716791977,3.4761548042297363,-2.5839340686798096,0.0,0.0,0.0,0.07462266288586789,0.9972118460308128,4.887093764491806,-3.903470969743796,0.6853292215166183,0.0,0.0,0.0,1.0
1717777255.4965916,map,True,True,2,2,0.49874686716791977,0.49874686716791977,3.4761548042297363,-2.5839340686798096,0.0,0.0,0.0,0.07462266288586789,0.9972118460308128,4.887093764491806,-3.903470969743796,0.6853292215166183,0.0,0.0,0.0,1.0
1717777255.5960107,map,True,False,2,2,0.49874686716791977,0.49874686716791977,3.4761548042297363,-2.5839340686798096,0.0,0.0,0.0,0.07462266288586789,0.9972118460308128,4.887093764491806,-3.903470969743796,0.6853292215166183,0.0,0.0,0.0,1.0
1717777255.6462939,map,True,False,2,2,0.49874686716791977,0.49874686716791977,3.6700494289398193,-2.6334235668182373,0.0,0.0,0.0,0.0791839914980738,0.9968600149433484,4.887093764491806,-3.903470969743796,0.6853292215166183,0.0,0.0,0.0,1.0
1717777255.696935,map,True,False,2,2,0.49874686716791977,0.49874686716791977,3.6700494289398193,-2.6334235668182373,0.0,0.0,0.0,0.0791839914980738,0.9968600149433484,4.887093764491806,-3.903470969743796,0.6853292215166183,0.0,0.0,0.0,1.0
1717777255.7947056,map,True,False,2,2,0.49874686716791977,0.49874686716791977,3.6700494289398193,-2.6334235668182373,0.0,0.0,0.0,0.0791839914980738,0.9968600149433484,4.901485635895646,-3.9080217197977856,0.6853161760285861,0.0,0.0,0.0,1.0
1717777255.844861,map,True,True,2,2,0.49874686716791977,0.49874686716791977,3.6700494289398193,-2.6334235668182373,0.0,0.0,0.0,0.0791839914980738,0.9968600149433484,4.901485635895646,-3.9080217197977856,0.6853161760285861,0.0,0.0,0.0,1.0
1717777255.8961918,map,True,True,2,2,0.49874686716791977,0.49874686716791977,3.6700494289398193,-2.6334235668182373,0.0,0.0,0.0,0.0791839914980738,0.9968600149433484,4.901485635895646,-3.9080217197977856,0.6853161760285861,0.0,0.0,0.0,1.0
1717777255.949101,map,True,False,2,2,0.49874686716791977,0.49874686716791977,3.6700494289398193,-2.6334235668182373,0.0,0.0,0.0,0.0791839914980738,0.9968600149433484,4.901485635895646,-3.9080217197977856,0.6853161760285861,0.0,0.0,0.0,1.0
1717777255.997205,map,True,True,2,2,0.49874686716791977,0.49874686716791977,3.6700494289398193,-2.6334235668182373,0.0,0.0,0.0,0.0791839914980738,0.9968600149433484,4.901485635895646,-3.9080217197977856,0.6853161760285861,0.0,0.0,0.0,1.0
1717777256.0495994,map,True,True,2,2,0.49874686716791977,0.49874686716791977,3.6700494289398193,-2.6334235668182373,0.0,0.0,0.0,0.0791839914980738,0.9968600149433484,4.901485635895646,-3.9080217197977856,0.6853161760285861,0.0,0.0,0.0,1.0
1717777256.0990758,map,True,True,2,2,0.49874686716791977,0.49874686716791977,3.6700494289398193,-2.6334235668182373,0.0,0.0,0.0,0.0791839914980738,0.9968600149433484,4.953187550270377,-3.8383239730835266,0.8824255653708781,0.0,0.0,0.0,1.0
1717777256.4003706,map,True,True,2,2,0.49874686716791977,0.49874686716791977,3.753671407699585,-2.6715545654296875,0.0,0.0,0.0,0.0812758177034547,0.9966916552465575,4.997026638385572,-3.9619590170624317,0.8973086110013663,0.0,0.0,0.0,1.0
1717777256.4990249,map,True,True,2,2,0.49874686716791977,0.49874686716791977,3.753671407699585,-2.6715545654296875,0.0,0.0,0.0,0.0812758177034547,0.9966916552465575,4.997026638385572,-3.9619590170624317,0.8973086110013663,0.0,0.0,0.0,1.0
1717777256.5489616,map,True,False,2,2,0.49874686716791977,0.49874686716791977,3.753671407699585,-2.6715545654296875,0.0,0.0,0.0,0.0812758177034547,0.9966916552465575,4.997026638385572,-3.9619590170624317,0.8973086110013663,0.0,0.0,0.0,1.0
1717777256.5998182,map,True,False,2,2,0.49874686716791977,0.49874686716791977,3.753671407699585,-2.6715545654296875,0.0,0.0,0.0,0.0812758177034547,0.9966916552465575,4.997026638385572,-3.9619590170624317,0.8973086110013663,0.0,0.0,0.0,1.0
1717777256.699415,map,True,True,2,2,0.49874686716791977,0.49874686716791977,3.753671407699585,-2.6715545654296875,0.0,0.0,0.0,0.0812758177034547,0.9966916552465575,4.997026638385572,-3.9619590170624317,0.8973086110013663,0.0,0.0,0.0,1.0
1717777256.7990954,map,True,False,1,2,0.0,0.0,3.842954397201538,-2.7147696018218994,0.0,0.0,0.0,0.08330771294096946,0.9965238652316801,4.997026638385572,-3.9619590170624317,0.8973086110013663,0.0,0.0,0.0,1.0
1717777256.8491943,map,True,False,1,2,0.0,0.0,3.842954397201538,-2.7147696018218994,0.0,0.0,0.0,0.08330771294096946,0.9965238652316801,4.997026638385572,-3.9619590170624317,0.8973086110013663,0.0,0.0,0.0,1.0
1717777256.9011393,map,True,False,1,2,0.0,0.0,3.842954397201538,-2.7147696018218994,0.0,0.0,0.0,0.08330771294096946,0.9965238652316801,4.997026638385572,-3.9619590170624317,0.8973086110013663,0.0,0.0,0.0,1.0
1717777257.0035932,map,True,False,1,2,0.0,0.0,3.842954397201538,-2.7147696018218994,0.0,0.0,0.0,0.08330771294096946,0.9965238652316801,4.997026638385572,-3.9619590170624317,0.8973086110013663,0.0,0.0,0.0,1.0
1717777257.1012166,map,True,False,1,2,0.0,0.0,3.842954397201538,-2.7147696018218994,0.0,0.0,0.0,0.08330771294096946,0.9965238652316801,4.997026638385572,-3.9619590170624317,0.8973086110013663,0.0,0.0,0.0,1.0
1717777257.1516323,map,True,False,1,2,0.0,0.0,3.842954397201538,-2.7147696018218994,0.0,0.0,0.0,0.08330771294096946,0.9965238652316801,4.997026638385572,-3.9619590170624317,0.8973086110013663,0.0,0.0,0.0,1.0
