car_pos_meter , car_pos_cell, car_speed, ped_pos_meter, ped_pos_cell, ped_speed
-5.125, 5, 2, 3.985168, 5, 1
-5.104175, 5, 1, 3.976334, 5, 1
-5.0938, 5, 1, 3.959242, 5, 1
-5.083425, 5, 1, 3.941629, 5, 1
-5.07305, 5, 2, 3.924532, 5, 1
-5.052225, 5, 1, 3.907638, 5, 1
-4.803225, 4, 2, 3.523861, 4, 1
-4.282602, 4, 1, 3.10802, 4, 1
-4.023226, 4, 2, 2.686241, 3, 1
-3.502604, 3, 2, 2.208107, 2, 1
-2.981981, 2, 2, 1.73613, 2, 1
-2.461358, 2, 2, 1.26067, 1, 1
-1.940735, 1, 2, 0.7959814, 1, 1
-1.420109, 1, 2, 0.3336897, 0, 1
-0.8994836, 0, 2, -0.1721005, 0, 1
-0.378858, 0, 2, -0.580276, 0, 1
0.1417669, 0, 2, -0.7849355, -1, 1
0.6623921, 0, 2, -0.8589029, -1, 1
1.183018, -1, 2, -0.8818512, -1, 1
