timestamp_sec,frame_id,game_played,yielding,player1discrete,player2discrete,player1yieldprob,player2yieldprob,player1_pose_x,player1_pose_y,player1_pose_z,player1_pose_orient_x,player1_pose_orient_y,player1_pose_orient_z,player1_pose_orient_w,player2_pose_x,player2_pose_y,player2_pose_z,player2_pose_orient_x,player2_pose_orient_y,player2_pose_orient_z,player2_pose_orient_w
1718031519.341114,map,True,False,5,7,0.0,0.0,1.412888765335083,-1.6461838483810425,0.0,0.0,0.0,0.03470640855391373,0.9993975583000273,3.2018631102220425,-8.328727057706335,0.9308699773881615,0.0,0.0,0.0,1.0
1718031519.3895242,map,True,False,5,7,0.0,0.0,1.412888765335083,-1.6461838483810425,0.0,0.0,0.0,0.03470640855391373,0.9993975583000273,3.2018631102220425,-8.328727057706335,0.9308699773881615,0.0,0.0,0.0,1.0
1718031519.4402616,map,True,False,5,7,0.0,0.0,1.412888765335083,-1.6461838483810425,0.0,0.0,0.0,0.03470640855391373,0.9993975583000273,3.2018631102220425,-8.328727057706335,0.9308699773881615,0.0,0.0,0.0,1.0
1718031519.5398698,map,True,False,5,7,0.0,0.0,1.412888765335083,-1.6461838483810425,0.0,0.0,0.0,0.03470640855391373,0.9993975583000273,3.2018631102220425,-8.328727057706335,0.9308699773881615,0.0,0.0,0.0,1.0
1718031519.5894418,map,True,False,5,7,0.0,0.0,1.412888765335083,-1.6461838483810425,0.0,0.0,0.0,0.03470640855391373,0.9993975583000273,3.2102531868791058,-7.999238759731545,0.9367832176489608,0.0,0.0,0.0,1.0
1718031519.6397374,map,True,False,5,7,0.0,0.0,1.412888765335083,-1.6461838483810425,0.0,0.0,0.0,0.03470640855391373,0.9993975583000273,3.2102531868791058,-7.999238759731545,0.9367832176489608,0.0,0.0,0.0,1.0
1718031519.6902251,map,True,False,5,7,0.0,0.0,1.4863591194152832,-1.657974123954773,0.0,0.0,0.0,0.03445142835311821,0.999406370156098,3.2102531868791058,-7.999238759731545,0.9367832176489608,0.0,0.0,0.0,1.0
1718031519.7890592,map,True,False,5,7,0.0,0.0,1.4863591194152832,-1.657974123954773,0.0,0.0,0.0,0.03445142835311821,0.999406370156098,3.2102531868791058,-7.999238759731545,0.9367832176489608,0.0,0.0,0.0,1.0
1718031519.8397255,map,True,False,5,7,0.0,0.0,1.4863591194152832,-1.657974123954773,0.0,0.0,0.0,0.03445142835311821,0.999406370156098,3.2102531868791058,-7.999238759731545,0.9367832176489608,0.0,0.0,0.0,1.0
1718031519.8907664,map,True,False,5,6,0.0,0.0,1.4863591194152832,-1.657974123954773,0.0,0.0,0.0,0.03445142835311821,0.999406370156098,3.2374818494550386,-7.954371400114452,0.9252586612990714,0.0,0.0,0.0,1.0
1718031519.990367,map,True,False,5,6,0.0,0.0,1.4863591194152832,-1.657974123954773,0.0,0.0,0.0,0.03445142835311821,0.999406370156098,3.2524203027060463,-7.930045621555183,0.8322709124452801,0.0,0.0,0.0,1.0
1718031520.0412116,map,True,False,5,6,0.0,0.0,1.4863591194152832,-1.657974123954773,0.0,0.0,0.0,0.03445142835311821,0.999406370156098,3.2524203027060463,-7.930045621555183,0.8322709124452801,0.0,0.0,0.0,1.0
1718031520.1393352,map,True,False,5,6,0.0,0.0,1.4863591194152832,-1.657974123954773,0.0,0.0,0.0,0.03445142835311821,0.999406370156098,3.2524203027060463,-7.930045621555183,0.8322709124452801,0.0,0.0,0.0,1.0
1718031520.1898706,map,True,False,5,6,0.0,0.0,1.5757758617401123,-1.6710644960403442,0.0,0.0,0.0,0.03452523525940266,0.9994038205407558,3.2524203027060463,-7.930045621555183,0.8322709124452801,0.0,0.0,0.0,1.0
1718031520.29013,map,True,False,5,6,0.0,0.0,1.5757758617401123,-1.6710644960403442,0.0,0.0,0.0,0.03452523525940266,0.9994038205407558,3.270234427005023,-7.617843468321821,0.8161736831021351,0.0,0.0,0.0,1.0
1718031520.3935845,map,True,False,5,6,0.0,0.0,1.5757758617401123,-1.6710644960403442,0.0,0.0,0.0,0.03452523525940266,0.9994038205407558,3.270234427005023,-7.617843468321821,0.8161736831021351,0.0,0.0,0.0,1.0
1718031520.4416928,map,True,False,5,6,0.0,0.0,1.5757758617401123,-1.6710644960403442,0.0,0.0,0.0,0.03452523525940266,0.9994038205407558,3.270234427005023,-7.617843468321821,0.8161736831021351,0.0,0.0,0.0,1.0
1718031520.491602,map,True,False,5,6,0.0,0.0,1.5757758617401123,-1.6710644960403442,0.0,0.0,0.0,0.03452523525940266,0.9994038205407558,3.270234427005023,-7.617843468321821,0.8161736831021351,0.0,0.0,0.0,1.0
1718031520.589702,map,True,False,5,6,0.0,0.0,1.5757758617401123,-1.6710644960403442,0.0,0.0,0.0,0.03452523525940266,0.9994038205407558,3.270234427005023,-7.617843468321821,0.8161736831021351,0.0,0.0,0.0,1.0
1718031520.690323,map,True,False,5,6,0.0,0.0,1.5757758617401123,-1.6710644960403442,0.0,0.0,0.0,0.03452523525940266,0.9994038205407558,3.3407887426186207,-7.517398604478647,0.7793493665067328,0.0,0.0,0.0,1.0
1718031520.741123,map,True,False,5,6,0.0,0.0,1.5757758617401123,-1.6710644960403442,0.0,0.0,0.0,0.03452523525940266,0.9994038205407558,3.3407887426186207,-7.517398604478647,0.7793493665067328,0.0,0.0,0.0,1.0
1718031520.791165,map,True,False,5,6,0.0,0.0,1.5757758617401123,-1.6710644960403442,0.0,0.0,0.0,0.03452523525940266,0.9994038205407558,3.3407887426186207,-7.517398604478647,0.7793493665067328,0.0,0.0,0.0,1.0
1718031520.846907,map,True,False,5,6,0.0,0.0,1.5757758617401123,-1.6710644960403442,0.0,0.0,0.0,0.03452523525940266,0.9994038205407558,3.3407887426186207,-7.517398604478647,0.7793493665067328,0.0,0.0,0.0,1.0
1718031520.9937322,map,True,False,4,6,0.0,0.0,1.6596593856811523,-1.6844080686569214,0.0,0.0,0.0,0.03385509411044953,0.9994267519349738,3.369595721241003,-7.161885682238857,0.8055796919190689,0.0,0.0,0.0,1.0
1718031521.0927734,map,True,False,4,6,0.0,0.0,1.6596593856811523,-1.6844080686569214,0.0,0.0,0.0,0.03385509411044953,0.9994267519349738,3.369595721241003,-7.161885682238857,0.8055796919190689,0.0,0.0,0.0,1.0
1718031521.143863,map,True,False,4,6,0.0,0.0,1.6596593856811523,-1.6844080686569214,0.0,0.0,0.0,0.03385509411044953,0.9994267519349738,3.369595721241003,-7.161885682238857,0.8055796919190689,0.0,0.0,0.0,1.0
1718031521.1957772,map,True,False,4,6,0.0,0.0,1.6596593856811523,-1.6844080686569214,0.0,0.0,0.0,0.03385509411044953,0.9994267519349738,3.369595721241003,-7.161885682238857,0.8055796919190689,0.0,0.0,0.0,1.0
1718031521.2510357,map,True,False,4,6,0.0,0.0,1.6596593856811523,-1.6844080686569214,0.0,0.0,0.0,0.03385509411044953,0.9994267519349738,3.369595721241003,-7.161885682238857,0.8055796919190689,0.0,0.0,0.0,1.0
1718031521.295246,map,True,False,4,6,0.0,0.0,1.6596593856811523,-1.6844080686569214,0.0,0.0,0.0,0.03385509411044953,0.9994267519349738,3.369595721241003,-7.161885682238857,0.8055796919190689,0.0,0.0,0.0,1.0
1718031521.3441584,map,True,False,4,5,0.0,0.0,1.6596593856811523,-1.6844080686569214,0.0,0.0,0.0,0.03385509411044953,0.9994267519349738,3.36439803082101,-6.798426803503177,0.7898277575878825,0.0,0.0,0.0,1.0
1718031521.3945966,map,True,False,4,5,0.0,0.0,1.6596593856811523,-1.6844080686569214,0.0,0.0,0.0,0.03385509411044953,0.9994267519349738,3.36439803082101,-6.798426803503177,0.7898277575878825,0.0,0.0,0.0,1.0
1718031521.4449532,map,True,False,4,5,0.0,0.0,1.6596593856811523,-1.6844080686569214,0.0,0.0,0.0,0.03385509411044953,0.9994267519349738,3.36439803082101,-6.798426803503177,0.7898277575878825,0.0,0.0,0.0,1.0
1718031521.5440974,map,True,False,4,5,0.0,0.0,1.6596593856811523,-1.6844080686569214,0.0,0.0,0.0,0.03385509411044953,0.9994267519349738,3.36439803082101,-6.798426803503177,0.7898277575878825,0.0,0.0,0.0,1.0
1718031521.5948944,map,True,False,4,5,0.0,0.0,1.6596593856811523,-1.6844080686569214,0.0,0.0,0.0,0.03385509411044953,0.9994267519349738,3.36439803082101,-6.798426803503177,0.7898277575878825,0.0,0.0,0.0,1.0
1718031521.644956,map,True,False,4,5,0.0,0.0,1.7778410911560059,-1.7092812061309814,0.0,0.0,0.0,0.034216277985467065,0.9994144513500501,3.36439803082101,-6.798426803503177,0.7898277575878825,0.0,0.0,0.0,1.0
1718031521.6973178,map,True,False,4,5,0.0,0.0,1.7778410911560059,-1.7092812061309814,0.0,0.0,0.0,0.034216277985467065,0.9994144513500501,3.439217229146953,-6.435642113129198,0.7750347635069396,0.0,0.0,0.0,1.0
1718031521.7470415,map,True,False,4,5,0.0,0.0,1.7778410911560059,-1.7092812061309814,0.0,0.0,0.0,0.034216277985467065,0.9994144513500501,3.439217229146953,-6.435642113129198,0.7750347635069396,0.0,0.0,0.0,1.0
1718031521.7985735,map,True,False,4,5,0.0,0.0,1.7778410911560059,-1.7092812061309814,0.0,0.0,0.0,0.034216277985467065,0.9994144513500501,3.439217229146953,-6.435642113129198,0.7750347635069396,0.0,0.0,0.0,1.0
1718031521.8512404,map,True,False,4,5,0.0,0.0,1.7778410911560059,-1.7092812061309814,0.0,0.0,0.0,0.034216277985467065,0.9994144513500501,3.439217229146953,-6.435642113129198,0.7750347635069396,0.0,0.0,0.0,1.0
1718031522.0497067,map,True,False,4,5,0.0,0.0,1.7778410911560059,-1.7092812061309814,0.0,0.0,0.0,0.034216277985467065,0.9994144513500501,3.4649830164758644,-6.217297896529314,0.7771771176367345,0.0,0.0,0.0,1.0
1718031522.149803,map,True,False,4,5,0.0,0.0,1.7778410911560059,-1.7092812061309814,0.0,0.0,0.0,0.034216277985467065,0.9994144513500501,3.4649830164758644,-6.217297896529314,0.7771771176367345,0.0,0.0,0.0,1.0
1718031522.249745,map,True,False,4,5,0.0,0.0,1.8984999656677246,-1.7352168560028076,0.0,0.0,0.0,0.03420871744944121,0.9994147048181763,3.4649830164758644,-6.217297896529314,0.7771771176367345,0.0,0.0,0.0,1.0
1718031522.3506942,map,True,False,4,5,0.0,0.0,1.8984999656677246,-1.7352168560028076,0.0,0.0,0.0,0.03420871744944121,0.9994147048181763,3.5224038523357954,-6.23847851541738,0.7706779560018931,0.0,0.0,0.0,1.0
1718031522.4036472,map,True,False,4,5,0.0,0.0,1.8984999656677246,-1.7352168560028076,0.0,0.0,0.0,0.03420871744944121,0.9994147048181763,3.502289468679632,-6.036665167972051,0.7474376012561009,0.0,0.0,0.0,1.0
1718031522.4992106,map,True,False,4,5,0.0,0.0,1.8984999656677246,-1.7352168560028076,0.0,0.0,0.0,0.03420871744944121,0.9994147048181763,3.502289468679632,-6.036665167972051,0.7474376012561009,0.0,0.0,0.0,1.0
1718031522.5526004,map,True,False,4,5,0.0,0.0,1.8984999656677246,-1.7352168560028076,0.0,0.0,0.0,0.03420871744944121,0.9994147048181763,3.502289468679632,-6.036665167972051,0.7474376012561009,0.0,0.0,0.0,1.0
1718031522.6026812,map,True,False,4,5,0.0,0.0,1.8984999656677246,-1.7352168560028076,0.0,0.0,0.0,0.03420871744944121,0.9994147048181763,3.502289468679632,-6.036665167972051,0.7474376012561009,0.0,0.0,0.0,1.0
1718031522.6509428,map,True,False,4,5,0.0,0.0,1.8984999656677246,-1.7352168560028076,0.0,0.0,0.0,0.03420871744944121,0.9994147048181763,3.502289468679632,-6.036665167972051,0.7474376012561009,0.0,0.0,0.0,1.0
1718031522.7014961,map,True,True,4,4,0.5922520728754596,0.5922520728754596,1.8984999656677246,-1.7352168560028076,0.0,0.0,0.0,0.03420871744944121,0.9994147048181763,3.524098346542585,-5.575202827733117,0.7405210412794431,0.0,0.0,0.0,1.0
1718031522.8015203,map,True,True,4,4,0.5922520728754596,0.5922520728754596,1.8984999656677246,-1.7352168560028076,0.0,0.0,0.0,0.03420871744944121,0.9994147048181763,3.524098346542585,-5.575202827733117,0.7405210412794431,0.0,0.0,0.0,1.0
1718031522.8523417,map,True,False,4,4,0.5922520728754596,0.5922520728754596,1.8984999656677246,-1.7352168560028076,0.0,0.0,0.0,0.03420871744944121,0.9994147048181763,3.524098346542585,-5.575202827733117,0.7405210412794431,0.0,0.0,0.0,1.0
1718031523.0027542,map,True,False,3,4,0.0,0.0,2.010267734527588,-1.755447268486023,0.0,0.0,0.0,0.03419433121063826,0.9994151968443552,3.583615279948569,-5.40955367043199,0.715661657091011,0.0,0.0,0.0,1.0
1718031523.1021333,map,True,False,3,4,0.0,0.0,2.010267734527588,-1.755447268486023,0.0,0.0,0.0,0.03419433121063826,0.9994151968443552,3.559779472059252,-5.275093287948488,0.7143805741815903,0.0,0.0,0.0,1.0
1718031523.1576107,map,True,False,3,4,0.0,0.0,2.010267734527588,-1.755447268486023,0.0,0.0,0.0,0.03419433121063826,0.9994151968443552,3.559779472059252,-5.275093287948488,0.7143805741815903,0.0,0.0,0.0,1.0
1718031523.203393,map,True,False,3,4,0.0,0.0,2.010267734527588,-1.755447268486023,0.0,0.0,0.0,0.03419433121063826,0.9994151968443552,3.559779472059252,-5.275093287948488,0.7143805741815903,0.0,0.0,0.0,1.0
1718031523.2541647,map,True,False,3,4,0.0,0.0,2.010267734527588,-1.755447268486023,0.0,0.0,0.0,0.03419433121063826,0.9994151968443552,3.559779472059252,-5.275093287948488,0.7143805741815903,0.0,0.0,0.0,1.0
1718031523.3039875,map,True,False,3,4,0.0,0.0,2.010267734527588,-1.755447268486023,0.0,0.0,0.0,0.03419433121063826,0.9994151968443552,3.559779472059252,-5.275093287948488,0.7143805741815903,0.0,0.0,0.0,1.0
1718031523.3570244,map,True,False,3,4,0.0,0.0,2.010267734527588,-1.755447268486023,0.0,0.0,0.0,0.03419433121063826,0.9994151968443552,3.627913463771509,-5.257987862042513,0.7246966093577392,0.0,0.0,0.0,1.0
1718031523.4057071,map,True,False,3,4,0.0,0.0,2.010267734527588,-1.755447268486023,0.0,0.0,0.0,0.03419433121063826,0.9994151968443552,3.627913463771509,-5.257987862042513,0.7246966093577392,0.0,0.0,0.0,1.0
1718031523.5048227,map,True,False,3,4,0.0,0.0,2.1324353218078613,-1.7787774801254272,0.0,0.0,0.0,0.033724604520809484,0.9994311651988437,3.627913463771509,-5.257987862042513,0.7246966093577392,0.0,0.0,0.0,1.0
1718031523.5550864,map,True,False,3,4,0.0,0.0,2.1324353218078613,-1.7787774801254272,0.0,0.0,0.0,0.033724604520809484,0.9994311651988437,3.627913463771509,-5.257987862042513,0.7246966093577392,0.0,0.0,0.0,1.0
1718031523.605084,map,True,False,3,4,0.0,0.0,2.1324353218078613,-1.7787774801254272,0.0,0.0,0.0,0.033724604520809484,0.9994311651988437,3.627913463771509,-5.257987862042513,0.7246966093577392,0.0,0.0,0.0,1.0
1718031523.6556904,map,True,False,3,4,0.0,0.0,2.1324353218078613,-1.7787774801254272,0.0,0.0,0.0,0.033724604520809484,0.9994311651988437,3.627913463771509,-5.257987862042513,0.7246966093577392,0.0,0.0,0.0,1.0
1718031523.7060359,map,True,True,3,3,0.6616527499769684,0.6616527499769684,2.1324353218078613,-1.7787774801254272,0.0,0.0,0.0,0.033724604520809484,0.9994311651988437,3.633330981106933,-4.798998444145006,0.7190310536185328,0.0,0.0,0.0,1.0
1718031523.7574506,map,True,True,3,3,0.6616527499769684,0.6616527499769684,2.1324353218078613,-1.7787774801254272,0.0,0.0,0.0,0.033724604520809484,0.9994311651988437,3.633330981106933,-4.798998444145006,0.7190310536185328,0.0,0.0,0.0,1.0
1718031523.8567035,map,True,True,3,3,0.6616527499769684,0.6616527499769684,2.1324353218078613,-1.7787774801254272,0.0,0.0,0.0,0.033724604520809484,0.9994311651988437,3.633330981106933,-4.798998444145006,0.7190310536185328,0.0,0.0,0.0,1.0
1718031524.0094512,map,True,False,3,3,0.6616527499769684,0.6616527499769684,2.1324353218078613,-1.7787774801254272,0.0,0.0,0.0,0.033724604520809484,0.9994311651988437,3.682557033856187,-4.547030586402057,0.7028381600600694,0.0,0.0,0.0,1.0
1718031524.1077483,map,True,True,3,3,0.6616527499769684,0.6616527499769684,2.2015042304992676,-1.800628900527954,0.0,0.0,0.0,0.03445622384907162,0.9994062061459501,3.7066443535954745,-4.547042555439025,0.6687040578761069,0.0,0.0,0.0,1.0
1718031524.207677,map,True,True,3,3,0.6616527499769684,0.6616527499769684,2.2015042304992676,-1.800628900527954,0.0,0.0,0.0,0.03445622384907162,0.9994062061459501,3.7066443535954745,-4.547042555439025,0.6687040578761069,0.0,0.0,0.0,1.0
1718031524.2586222,map,True,False,3,3,0.6616527499769684,0.6616527499769684,2.2015042304992676,-1.800628900527954,0.0,0.0,0.0,0.03445622384907162,0.9994062061459501,3.7066443535954745,-4.547042555439025,0.6687040578761069,0.0,0.0,0.0,1.0
1718031524.308737,map,True,True,3,3,0.6616527499769684,0.6616527499769684,2.2015042304992676,-1.800628900527954,0.0,0.0,0.0,0.03445622384907162,0.9994062061459501,3.7066443535954745,-4.547042555439025,0.6687040578761069,0.0,0.0,0.0,1.0
1718031524.3710902,map,True,False,3,3,0.6616527499769684,0.6616527499769684,2.2015042304992676,-1.800628900527954,0.0,0.0,0.0,0.03445622384907162,0.9994062061459501,3.7032024008669313,-4.3441642892327765,0.6853884129833333,0.0,0.0,0.0,1.0
1718031524.423197,map,True,True,3,3,0.6616527499769684,0.6616527499769684,2.2015042304992676,-1.800628900527954,0.0,0.0,0.0,0.03445622384907162,0.9994062061459501,3.704701027362622,-4.316438481510608,0.6970812633223792,0.0,0.0,0.0,1.0
1718031524.5131454,map,True,False,3,3,0.6616527499769684,0.6616527499769684,2.2015042304992676,-1.800628900527954,0.0,0.0,0.0,0.03445622384907162,0.9994062061459501,3.704701027362622,-4.316438481510608,0.6970812633223792,0.0,0.0,0.0,1.0
1718031524.5652533,map,True,True,3,3,0.6616527499769684,0.6616527499769684,2.2015042304992676,-1.800628900527954,0.0,0.0,0.0,0.03445622384907162,0.9994062061459501,3.704701027362622,-4.316438481510608,0.6970812633223792,0.0,0.0,0.0,1.0
1718031524.6147234,map,True,False,3,3,0.6616527499769684,0.6616527499769684,2.2015042304992676,-1.800628900527954,0.0,0.0,0.0,0.03445622384907162,0.9994062061459501,3.704701027362622,-4.316438481510608,0.6970812633223792,0.0,0.0,0.0,1.0
1718031524.665031,map,True,True,3,3,0.6616527499769684,0.6616527499769684,2.2015042304992676,-1.800628900527954,0.0,0.0,0.0,0.03445622384907162,0.9994062061459501,3.704701027362622,-4.316438481510608,0.6970812633223792,0.0,0.0,0.0,1.0
1718031524.7643597,map,True,True,3,3,0.6616527499769684,0.6616527499769684,2.2015042304992676,-1.800628900527954,0.0,0.0,0.0,0.03445622384907162,0.9994062061459501,3.737972541460764,-4.089474487428044,0.6955009548168357,0.0,0.0,0.0,1.0
1718031524.814582,map,True,True,3,3,0.6616527499769684,0.6616527499769684,2.3289995193481445,-1.831125259399414,0.0,0.0,0.0,0.034345430547295996,0.9994100231024164,3.737972541460764,-4.089474487428044,0.6955009548168357,0.0,0.0,0.0,1.0
1718031524.8649907,map,True,True,3,3,0.6616527499769684,0.6616527499769684,2.3289995193481445,-1.831125259399414,0.0,0.0,0.0,0.034345430547295996,0.9994100231024164,3.737972541460764,-4.089474487428044,0.6955009548168357,0.0,0.0,0.0,1.0
1718031525.0675533,map,True,False,3,2,0.0,0.0,2.3289995193481445,-1.831125259399414,0.0,0.0,0.0,0.034345430547295996,0.9994100231024164,3.7391069654024065,-3.688445227889507,0.7230291648349968,0.0,0.0,0.0,1.0
1718031525.1647573,map,True,False,3,2,0.0,0.0,2.3289995193481445,-1.831125259399414,0.0,0.0,0.0,0.034345430547295996,0.9994100231024164,3.7391069654024065,-3.688445227889507,0.7230291648349968,0.0,0.0,0.0,1.0
1718031525.2171893,map,True,False,3,2,0.0,0.0,2.3289995193481445,-1.831125259399414,0.0,0.0,0.0,0.034345430547295996,0.9994100231024164,3.7391069654024065,-3.688445227889507,0.7230291648349968,0.0,0.0,0.0,1.0
1718031525.2676206,map,True,False,3,2,0.0,0.0,2.3289995193481445,-1.831125259399414,0.0,0.0,0.0,0.034345430547295996,0.9994100231024164,3.7391069654024065,-3.688445227889507,0.7230291648349968,0.0,0.0,0.0,1.0
1718031525.318858,map,True,False,3,2,0.0,0.0,2.3289995193481445,-1.831125259399414,0.0,0.0,0.0,0.034345430547295996,0.9994100231024164,3.7391069654024065,-3.688445227889507,0.7230291648349968,0.0,0.0,0.0,1.0
1718031525.3681154,map,True,False,3,2,0.0,0.0,2.3289995193481445,-1.831125259399414,0.0,0.0,0.0,0.034345430547295996,0.9994100231024164,3.77958280938653,-3.5356523737721837,0.6833840064113724,0.0,0.0,0.0,1.0
1718031525.4190946,map,True,False,3,2,0.0,0.0,2.3289995193481445,-1.831125259399414,0.0,0.0,0.0,0.034345430547295996,0.9994100231024164,3.77958280938653,-3.5356523737721837,0.6833840064113724,0.0,0.0,0.0,1.0
1718031525.4690585,map,True,False,3,2,0.0,0.0,2.3289995193481445,-1.831125259399414,0.0,0.0,0.0,0.034345430547295996,0.9994100231024164,3.77958280938653,-3.5356523737721837,0.6833840064113724,0.0,0.0,0.0,1.0
1718031525.519774,map,True,False,3,2,0.0,0.0,2.3289995193481445,-1.831125259399414,0.0,0.0,0.0,0.034345430547295996,0.9994100231024164,3.77958280938653,-3.5356523737721837,0.6833840064113724,0.0,0.0,0.0,1.0
1718031525.6201491,map,True,True,2,2,0.49874686716791977,0.49874686716791977,2.426173686981201,-1.8474385738372803,0.0,0.0,0.0,0.03435953737320497,0.9994095310736905,3.77958280938653,-3.5356523737721837,0.6833840064113724,0.0,0.0,0.0,1.0
1718031525.671064,map,True,True,2,2,0.49874686716791977,0.49874686716791977,2.426173686981201,-1.8474385738372803,0.0,0.0,0.0,0.03435953737320497,0.9994095310736905,3.7845403862649323,-3.311095382721957,0.685392970074812,0.0,0.0,0.0,1.0
1718031525.770788,map,True,True,2,2,0.49874686716791977,0.49874686716791977,2.426173686981201,-1.8474385738372803,0.0,0.0,0.0,0.03435953737320497,0.9994095310736905,3.7845614876413833,-3.2650517836222934,0.6852152608743078,0.0,0.0,0.0,1.0
1718031525.8209047,map,True,True,2,2,0.49874686716791977,0.49874686716791977,2.426173686981201,-1.8474385738372803,0.0,0.0,0.0,0.03435953737320497,0.9994095310736905,3.7845614876413833,-3.2650517836222934,0.6852152608743078,0.0,0.0,0.0,1.0
1718031526.0217376,map,True,False,2,2,0.49874686716791977,0.49874686716791977,2.495222568511963,-1.8517264127731323,0.0,0.0,0.0,0.033903524294579726,0.999425111865731,3.8165919408383573,-3.1318150856469007,0.6824871642817044,0.0,0.0,0.0,1.0
1718031526.120046,map,True,True,2,2,0.49874686716791977,0.49874686716791977,2.495222568511963,-1.8517264127731323,0.0,0.0,0.0,0.033903524294579726,0.999425111865731,3.8165919408383573,-3.1318150856469007,0.6824871642817044,0.0,0.0,0.0,1.0
1718031526.1709702,map,True,True,2,2,0.49874686716791977,0.49874686716791977,2.495222568511963,-1.8517264127731323,0.0,0.0,0.0,0.033903524294579726,0.999425111865731,3.8165919408383573,-3.1318150856469007,0.6824871642817044,0.0,0.0,0.0,1.0
1718031526.2277682,map,True,True,2,2,0.49874686716791977,0.49874686716791977,2.495222568511963,-1.8517264127731323,0.0,0.0,0.0,0.033903524294579726,0.999425111865731,3.8165919408383573,-3.1318150856469007,0.6824871642817044,0.0,0.0,0.0,1.0
1718031526.3216388,map,True,False,2,2,0.49874686716791977,0.49874686716791977,2.495222568511963,-1.8517264127731323,0.0,0.0,0.0,0.033903524294579726,0.999425111865731,3.8165919408383573,-3.1318150856469007,0.6824871642817044,0.0,0.0,0.0,1.0
1718031526.3713677,map,True,True,2,2,0.49874686716791977,0.49874686716791977,2.495222568511963,-1.8517264127731323,0.0,0.0,0.0,0.033903524294579726,0.999425111865731,3.831072419701482,-3.066879943749382,0.682396724429252,0.0,0.0,0.0,1.0
1718031526.4717443,map,True,True,2,2,0.49874686716791977,0.49874686716791977,2.550662040710449,-1.8654917478561401,0.0,0.0,0.0,0.03406452717510052,0.9994196399788793,3.831072419701482,-3.066879943749382,0.682396724429252,0.0,0.0,0.0,1.0
1718031526.5222409,map,True,False,2,2,0.49874686716791977,0.49874686716791977,2.550662040710449,-1.8654917478561401,0.0,0.0,0.0,0.03406452717510052,0.9994196399788793,3.831072419701482,-3.066879943749382,0.682396724429252,0.0,0.0,0.0,1.0
1718031526.5722811,map,True,False,2,2,0.49874686716791977,0.49874686716791977,2.550662040710449,-1.8654917478561401,0.0,0.0,0.0,0.03406452717510052,0.9994196399788793,3.831072419701482,-3.066879943749382,0.682396724429252,0.0,0.0,0.0,1.0
1718031526.6736312,map,True,False,2,2,0.49874686716791977,0.49874686716791977,2.550662040710449,-1.8654917478561401,0.0,0.0,0.0,0.03406452717510052,0.9994196399788793,3.8596722297939303,-3.098699331890426,0.6824703258814215,0.0,0.0,0.0,1.0
1718031526.7230947,map,True,True,2,2,0.49874686716791977,0.49874686716791977,2.550662040710449,-1.8654917478561401,0.0,0.0,0.0,0.03406452717510052,0.9994196399788793,3.816280499779271,-3.1333234396533234,0.6826764835517452,0.0,0.0,0.0,1.0
1718031526.7807522,map,True,True,2,2,0.49874686716791977,0.49874686716791977,2.550662040710449,-1.8654917478561401,0.0,0.0,0.0,0.03406452717510052,0.9994196399788793,3.816280499779271,-3.1333234396533234,0.6826764835517452,0.0,0.0,0.0,1.0
1718031526.8278515,map,True,True,2,2,0.49874686716791977,0.49874686716791977,2.550662040710449,-1.8654917478561401,0.0,0.0,0.0,0.03406452717510052,0.9994196399788793,3.816280499779271,-3.1333234396533234,0.6826764835517452,0.0,0.0,0.0,1.0
1718031527.0298772,map,True,False,2,2,0.49874686716791977,0.49874686716791977,2.550662040710449,-1.8654917478561401,0.0,0.0,0.0,0.03406452717510052,0.9994196399788793,3.8626001348599166,-3.181363461744863,0.6848978418614547,0.0,0.0,0.0,1.0
1718031527.130245,map,True,True,2,2,0.49874686716791977,0.49874686716791977,2.550662040710449,-1.8654917478561401,0.0,0.0,0.0,0.03406452717510052,0.9994196399788793,3.8593269413303526,-3.1848168767938083,0.6849171375212858,0.0,0.0,0.0,1.0
1718031527.1798337,map,True,True,2,2,0.49874686716791977,0.49874686716791977,2.593323230743408,-1.8722060918807983,0.0,0.0,0.0,0.034092470898284856,0.9994186857503115,3.8593269413303526,-3.1848168767938083,0.6849171375212858,0.0,0.0,0.0,1.0
1718031527.2290735,map,True,False,2,2,0.49874686716791977,0.49874686716791977,2.593323230743408,-1.8722060918807983,0.0,0.0,0.0,0.034092470898284856,0.9994186857503115,3.8593269413303526,-3.1848168767938083,0.6849171375212858,0.0,0.0,0.0,1.0
1718031527.2830412,map,True,False,2,2,0.49874686716791977,0.49874686716791977,2.593323230743408,-1.8722060918807983,0.0,0.0,0.0,0.034092470898284856,0.9994186857503115,3.8593269413303526,-3.1848168767938083,0.6849171375212858,0.0,0.0,0.0,1.0
1718031527.331248,map,True,True,2,2,0.49874686716791977,0.49874686716791977,2.593323230743408,-1.8722060918807983,0.0,0.0,0.0,0.034092470898284856,0.9994186857503115,3.8593269413303526,-3.1848168767938083,0.6849171375212858,0.0,0.0,0.0,1.0
1718031527.3801186,map,True,True,2,2,0.49874686716791977,0.49874686716791977,2.593323230743408,-1.8722060918807983,0.0,0.0,0.0,0.034092470898284856,0.9994186857503115,3.8593269413303526,-3.1848168767938083,0.6849171375212858,0.0,0.0,0.0,1.0
1718031527.4347126,map,True,False,2,2,0.49874686716791977,0.49874686716791977,2.593323230743408,-1.8722060918807983,0.0,0.0,0.0,0.034092470898284856,0.9994186857503115,3.8954564184264897,-3.196975952016828,0.6849301927311712,0.0,0.0,0.0,1.0
1718031527.4877028,map,True,True,2,2,0.49874686716791977,0.49874686716791977,2.593323230743408,-1.8722060918807983,0.0,0.0,0.0,0.034092470898284856,0.9994186857503115,3.8923914658802587,-3.202160150283449,0.6849611862750218,0.0,0.0,0.0,1.0
1718031527.5353055,map,True,True,2,2,0.49874686716791977,0.49874686716791977,2.593323230743408,-1.8722060918807983,0.0,0.0,0.0,0.034092470898284856,0.9994186857503115,3.8969978139418067,-3.1959652332647375,0.6849288861284517,0.0,0.0,0.0,1.0
1718031527.5863657,map,True,False,2,2,0.49874686716791977,0.49874686716791977,2.593323230743408,-1.8722060918807983,0.0,0.0,0.0,0.034092470898284856,0.9994186857503115,3.8891043607570475,-3.197745459012547,0.6849501093559489,0.0,0.0,0.0,1.0
1718031527.637522,map,True,False,2,2,0.49874686716791977,0.49874686716791977,2.593323230743408,-1.8722060918807983,0.0,0.0,0.0,0.034092470898284856,0.9994186857503115,3.8869454776173047,-3.205292555574345,0.6849831837213882,0.0,0.0,0.0,1.0
1718031527.7374034,map,True,False,2,2,0.49874686716791977,0.49874686716791977,2.593323230743408,-1.8722060918807983,0.0,0.0,0.0,0.034092470898284856,0.9994186857503115,3.8885064923325494,-3.2105734205624508,0.6850094254245992,0.0,0.0,0.0,1.0
1718031527.788196,map,True,False,2,2,0.49874686716791977,0.49874686716791977,2.593323230743408,-1.8722060918807983,0.0,0.0,0.0,0.034092470898284856,0.9994186857503115,3.8885064923325494,-3.2105734205624508,0.6850094254245992,0.0,0.0,0.0,1.0
1718031528.189381,map,True,True,2,2,0.49874686716791977,0.49874686716791977,2.701996326446533,-1.9057483673095703,0.0,0.0,0.0,0.0346970862985251,0.9993978714129956,3.9608508552322412,-3.220919831986543,0.6850252528355864,0.0,0.0,0.0,1.0
1718031528.2410638,map,True,True,2,2,0.49874686716791977,0.49874686716791977,2.701996326446533,-1.9057483673095703,0.0,0.0,0.0,0.0346970862985251,0.9993978714129956,3.950902881716693,-3.2138006537866954,0.6850158320101983,0.0,0.0,0.0,1.0
1718031528.3061485,map,True,False,2,2,0.49874686716791977,0.49874686716791977,2.701996326446533,-1.9057483673095703,0.0,0.0,0.0,0.0346970862985251,0.9993978714129956,3.9552019508859075,-3.2229792144915046,0.6850434729213809,0.0,0.0,0.0,1.0
1718031528.3516514,map,True,True,2,2,0.49874686716791977,0.49874686716791977,2.701996326446533,-1.9057483673095703,0.0,0.0,0.0,0.0346970862985251,0.9993978714129956,3.9552019508859075,-3.2229792144915046,0.6850434729213809,0.0,0.0,0.0,1.0
1718031528.4051807,map,True,False,2,2,0.49874686716791977,0.49874686716791977,2.701996326446533,-1.9057483673095703,0.0,0.0,0.0,0.0346970862985251,0.9993978714129956,3.9552019508859075,-3.2229792144915046,0.6850434729213809,0.0,0.0,0.0,1.0
1718031528.5002313,map,True,True,2,2,0.49874686716791977,0.49874686716791977,2.701996326446533,-1.9057483673095703,0.0,0.0,0.0,0.0346970862985251,0.9993978714129956,3.9552019508859075,-3.2229792144915046,0.6850434729213809,0.0,0.0,0.0,1.0
1718031528.5998588,map,True,True,2,2,0.49874686716791977,0.49874686716791977,2.7640562057495117,-1.9217785596847534,0.0,0.0,0.0,0.035204469665384285,0.9993801281900623,3.971489245348576,-3.2049555054357546,0.6849989387029891,0.0,0.0,0.0,1.0
1718031528.6499927,map,True,False,2,2,0.49874686716791977,0.49874686716791977,2.7640562057495117,-1.9217785596847534,0.0,0.0,0.0,0.035204469665384285,0.9993801281900623,3.971489245348576,-3.2049555054357546,0.6849989387029891,0.0,0.0,0.0,1.0
1718031528.7498593,map,True,False,2,2,0.49874686716791977,0.49874686716791977,2.7640562057495117,-1.9217785596847534,0.0,0.0,0.0,0.035204469665384285,0.9993801281900623,3.971489245348576,-3.2049555054357546,0.6849989387029891,0.0,0.0,0.0,1.0
1718031528.8504145,map,True,True,2,2,0.49874686716791977,0.49874686716791977,2.7640562057495117,-1.9217785596847534,0.0,0.0,0.0,0.035204469665384285,0.9993801281900623,3.971489245348576,-3.2049555054357546,0.6849989387029891,0.0,0.0,0.0,1.0
1718031528.901406,map,True,True,2,2,0.49874686716791977,0.49874686716791977,2.7640562057495117,-1.9217785596847534,0.0,0.0,0.0,0.035204469665384285,0.9993801281900623,4.0124075845113065,-3.223286654181603,0.6850746879427354,0.0,0.0,0.0,1.0
1718031528.957234,map,True,True,2,2,0.49874686716791977,0.49874686716791977,2.7640562057495117,-1.9217785596847534,0.0,0.0,0.0,0.035204469665384285,0.9993801281900623,4.0124075845113065,-3.223286654181603,0.6850746879427354,0.0,0.0,0.0,1.0
1718031529.0057473,map,True,False,2,2,0.49874686716791977,0.49874686716791977,2.7640562057495117,-1.9217785596847534,0.0,0.0,0.0,0.035204469665384285,0.9993801281900623,4.0124075845113065,-3.223286654181603,0.6850746879427354,0.0,0.0,0.0,1.0
1718031529.108452,map,True,False,1,2,0.0,0.0,2.905247688293457,-1.9353547096252441,0.0,0.0,0.0,0.034202992363780126,0.9994149135565847,4.0124075845113065,-3.223286654181603,0.6850746879427354,0.0,0.0,0.0,1.0
1718031529.155888,map,True,False,1,2,0.0,0.0,2.905247688293457,-1.9353547096252441,0.0,0.0,0.0,0.034202992363780126,0.9994149135565847,4.0124075845113065,-3.223286654181603,0.6850746879427354,0.0,0.0,0.0,1.0
1718031529.2067883,map,True,False,1,2,0.0,0.0,2.905247688293457,-1.9353547096252441,0.0,0.0,0.0,0.034202992363780126,0.9994149135565847,4.0124075845113065,-3.223286654181603,0.6850746879427354,0.0,0.0,0.0,1.0
1718031529.2590613,map,True,False,1,2,0.0,0.0,2.905247688293457,-1.9353547096252441,0.0,0.0,0.0,0.034202992363780126,0.9994149135565847,4.0366518900238235,-3.2483809634100766,0.685169158157973,0.0,0.0,0.0,1.0
1718031529.3070896,map,True,False,1,2,0.0,0.0,2.905247688293457,-1.9353547096252441,0.0,0.0,0.0,0.034202992363780126,0.9994149135565847,4.044359951709341,-3.247954125101038,0.6851534517966172,0.0,0.0,0.0,1.0
1718031529.3591654,map,True,False,1,2,0.0,0.0,2.905247688293457,-1.9353547096252441,0.0,0.0,0.0,0.034202992363780126,0.9994149135565847,4.044359951709341,-3.247954125101038,0.6851534517966172,0.0,0.0,0.0,1.0
1718031529.4581099,map,True,False,1,2,0.0,0.0,2.905247688293457,-1.9353547096252441,0.0,0.0,0.0,0.034202992363780126,0.9994149135565847,4.044359951709341,-3.247954125101038,0.6851534517966172,0.0,0.0,0.0,1.0
1718031529.557577,map,True,False,1,2,0.0,0.0,2.9224228858947754,-1.9452968835830688,0.0,0.0,0.0,0.034633272193852004,0.9994000930212397,4.044359951709341,-3.247954125101038,0.6851534517966172,0.0,0.0,0.0,1.0
1718031529.6087344,map,True,False,1,2,0.0,0.0,2.9224228858947754,-1.9452968835830688,0.0,0.0,0.0,0.034633272193852004,0.9994000930212397,4.04923633600414,-3.193840360872679,0.6830131892873788,0.0,0.0,0.0,1.0
1718031529.7078428,map,True,False,1,2,0.0,0.0,2.9224228858947754,-1.9452968835830688,0.0,0.0,0.0,0.034633272193852004,0.9994000930212397,4.042432176883659,-3.1863800531025595,0.6830129662456557,0.0,0.0,0.0,1.0
1718031529.8086333,map,True,False,1,2,0.0,0.0,2.9224228858947754,-1.9452968835830688,0.0,0.0,0.0,0.034633272193852004,0.9994000930212397,4.042432176883659,-3.1863800531025595,0.6830129662456557,0.0,0.0,0.0,1.0
1718031529.860257,map,True,False,1,2,0.0,0.0,2.9224228858947754,-1.9452968835830688,0.0,0.0,0.0,0.034633272193852004,0.9994000930212397,4.042432176883659,-3.1863800531025595,0.6830129662456557,0.0,0.0,0.0,1.0
1718031529.9604683,map,True,False,1,2,0.0,0.0,2.9224228858947754,-1.9452968835830688,0.0,0.0,0.0,0.034633272193852004,0.9994000930212397,4.101180411770727,-3.2547368185383907,0.6832135332890052,0.0,0.0,0.0,1.0
1718031530.060726,map,True,False,1,2,0.0,0.0,2.9224228858947754,-1.9452968835830688,0.0,0.0,0.0,0.034633272193852004,0.9994000930212397,4.101180411770727,-3.2547368185383907,0.6832135332890052,0.0,0.0,0.0,1.0
1718031530.1110766,map,True,False,1,2,0.0,0.0,2.9224228858947754,-1.9452968835830688,0.0,0.0,0.0,0.034633272193852004,0.9994000930212397,4.101180411770727,-3.2547368185383907,0.6832135332890052,0.0,0.0,0.0,1.0
1718031530.210881,map,True,False,1,2,0.0,0.0,3.040684223175049,-1.9612990617752075,0.0,0.0,0.0,0.03230532773726943,0.9994780400150397,4.101180411770727,-3.2547368185383907,0.6832135332890052,0.0,0.0,0.0,1.0
1718031530.2616022,map,True,False,1,2,0.0,0.0,3.040684223175049,-1.9612990617752075,0.0,0.0,0.0,0.03230532773726943,0.9994780400150397,4.101180411770727,-3.2547368185383907,0.6832135332890052,0.0,0.0,0.0,1.0
1718031530.3119774,map,True,False,1,2,0.0,0.0,3.040684223175049,-1.9612990617752075,0.0,0.0,0.0,0.03230532773726943,0.9994780400150397,4.116892724704268,-3.2160955723122298,0.7063451946648996,0.0,0.0,0.0,1.0
1718031530.4125144,map,True,False,1,2,0.0,0.0,3.040684223175049,-1.9612990617752075,0.0,0.0,0.0,0.03230532773726943,0.9994780400150397,4.116892724704268,-3.2160955723122298,0.7063451946648996,0.0,0.0,0.0,1.0
1718031530.5115395,map,True,False,1,2,0.0,0.0,3.040684223175049,-1.9612990617752075,0.0,0.0,0.0,0.03230532773726943,0.9994780400150397,4.116892724704268,-3.2160955723122298,0.7063451946648996,0.0,0.0,0.0,1.0
1718031530.5623748,map,True,False,1,2,0.0,0.0,3.040684223175049,-1.9612990617752075,0.0,0.0,0.0,0.03230532773726943,0.9994780400150397,4.116892724704268,-3.2160955723122298,0.7063451946648996,0.0,0.0,0.0,1.0
1718031530.661514,map,True,False,1,2,0.0,0.0,3.040684223175049,-1.9612990617752075,0.0,0.0,0.0,0.03230532773726943,0.9994780400150397,4.116892724704268,-3.2160955723122298,0.7063451946648996,0.0,0.0,0.0,1.0
1718031530.7051198,map,True,False,1,2,0.0,0.0,3.144821882247925,-1.9627169370651245,0.0,0.0,0.0,0.032237174879605354,0.9994802465361777,4.116892724704268,-3.2160955723122298,0.7063451946648996,0.0,0.0,0.0,1.0
1718031530.7131577,map,True,False,1,2,0.0,0.0,3.144821882247925,-1.9627169370651245,0.0,0.0,0.0,0.032237174879605354,0.9994802465361777,4.116892724704268,-3.2160955723122298,0.7063451946648996,0.0,0.0,0.0,1.0
1718031530.7165747,map,True,False,1,2,0.0,0.0,3.144821882247925,-1.9627169370651245,0.0,0.0,0.0,0.032237174879605354,0.9994802465361777,4.116892724704268,-3.2160955723122298,0.7063451946648996,0.0,0.0,0.0,1.0
1718031530.721158,map,True,False,1,2,0.0,0.0,3.144821882247925,-1.9627169370651245,0.0,0.0,0.0,0.032237174879605354,0.9994802465361777,4.116892724704268,-3.2160955723122298,0.7063451946648996,0.0,0.0,0.0,1.0
1718031530.7247531,map,True,False,1,2,0.0,0.0,3.144821882247925,-1.9627169370651245,0.0,0.0,0.0,0.032237174879605354,0.9994802465361777,4.116892724704268,-3.2160955723122298,0.7063451946648996,0.0,0.0,0.0,1.0
1718031530.729771,map,True,False,1,2,0.0,0.0,3.144821882247925,-1.9627169370651245,0.0,0.0,0.0,0.032237174879605354,0.9994802465361777,4.116892724704268,-3.2160955723122298,0.7063451946648996,0.0,0.0,0.0,1.0
1718031530.7317784,map,True,False,1,2,0.0,0.0,3.144821882247925,-1.9627169370651245,0.0,0.0,0.0,0.032237174879605354,0.9994802465361777,4.116892724704268,-3.2160955723122298,0.7063451946648996,0.0,0.0,0.0,1.0
1718031530.736085,map,True,False,1,2,0.0,0.0,3.144821882247925,-1.9627169370651245,0.0,0.0,0.0,0.032237174879605354,0.9994802465361777,4.116892724704268,-3.2160955723122298,0.7063451946648996,0.0,0.0,0.0,1.0
1718031530.7401798,map,True,False,1,2,0.0,0.0,3.144821882247925,-1.9627169370651245,0.0,0.0,0.0,0.032237174879605354,0.9994802465361777,4.116892724704268,-3.2160955723122298,0.7063451946648996,0.0,0.0,0.0,1.0
1718031530.7447457,map,True,False,1,2,0.0,0.0,3.144821882247925,-1.9627169370651245,0.0,0.0,0.0,0.032237174879605354,0.9994802465361777,4.116892724704268,-3.2160955723122298,0.7063451946648996,0.0,0.0,0.0,1.0
1718031530.7477322,map,True,False,1,2,0.0,0.0,3.144821882247925,-1.9627169370651245,0.0,0.0,0.0,0.032237174879605354,0.9994802465361777,4.116892724704268,-3.2160955723122298,0.7063451946648996,0.0,0.0,0.0,1.0
1718031530.7521574,map,True,False,1,2,0.0,0.0,3.144821882247925,-1.9627169370651245,0.0,0.0,0.0,0.032237174879605354,0.9994802465361777,4.116892724704268,-3.2160955723122298,0.7063451946648996,0.0,0.0,0.0,1.0
1718031530.7600944,map,True,False,1,2,0.0,0.0,3.144821882247925,-1.9627169370651245,0.0,0.0,0.0,0.032237174879605354,0.9994802465361777,4.116892724704268,-3.2160955723122298,0.7063451946648996,0.0,0.0,0.0,1.0
1718031530.7624133,map,True,False,1,2,0.0,0.0,3.144821882247925,-1.9627169370651245,0.0,0.0,0.0,0.032237174879605354,0.9994802465361777,4.116892724704268,-3.2160955723122298,0.7063451946648996,0.0,0.0,0.0,1.0
1718031530.7643433,map,True,False,1,2,0.0,0.0,3.144821882247925,-1.9627169370651245,0.0,0.0,0.0,0.032237174879605354,0.9994802465361777,4.116892724704268,-3.2160955723122298,0.7063451946648996,0.0,0.0,0.0,1.0
1718031530.7755914,map,True,False,1,2,0.0,0.0,3.144821882247925,-1.9627169370651245,0.0,0.0,0.0,0.032237174879605354,0.9994802465361777,4.116892724704268,-3.2160955723122298,0.7063451946648996,0.0,0.0,0.0,1.0
1718031530.776865,map,True,False,1,2,0.0,0.0,3.144821882247925,-1.9627169370651245,0.0,0.0,0.0,0.032237174879605354,0.9994802465361777,4.116892724704268,-3.2160955723122298,0.7063451946648996,0.0,0.0,0.0,1.0
1718031530.7819943,map,True,False,1,2,0.0,0.0,3.144821882247925,-1.9627169370651245,0.0,0.0,0.0,0.032237174879605354,0.9994802465361777,4.116892724704268,-3.2160955723122298,0.7063451946648996,0.0,0.0,0.0,1.0
1718031530.7831707,map,True,False,1,2,0.0,0.0,3.144821882247925,-1.9627169370651245,0.0,0.0,0.0,0.032237174879605354,0.9994802465361777,4.116892724704268,-3.2160955723122298,0.7063451946648996,0.0,0.0,0.0,1.0
1718031530.784407,map,True,False,1,2,0.0,0.0,3.144821882247925,-1.9627169370651245,0.0,0.0,0.0,0.032237174879605354,0.9994802465361777,4.116892724704268,-3.2160955723122298,0.7063451946648996,0.0,0.0,0.0,1.0
1718031530.7885854,map,True,False,1,2,0.0,0.0,3.144821882247925,-1.9627169370651245,0.0,0.0,0.0,0.032237174879605354,0.9994802465361777,4.116892724704268,-3.2160955723122298,0.7063451946648996,0.0,0.0,0.0,1.0
1718031530.7954,map,True,False,1,2,0.0,0.0,3.144821882247925,-1.9627169370651245,0.0,0.0,0.0,0.032237174879605354,0.9994802465361777,4.116892724704268,-3.2160955723122298,0.7063451946648996,0.0,0.0,0.0,1.0
1718031530.797038,map,True,False,1,2,0.0,0.0,3.144821882247925,-1.9627169370651245,0.0,0.0,0.0,0.032237174879605354,0.9994802465361777,4.116892724704268,-3.2160955723122298,0.7063451946648996,0.0,0.0,0.0,1.0
1718031530.8023417,map,True,False,1,2,0.0,0.0,3.144821882247925,-1.9627169370651245,0.0,0.0,0.0,0.032237174879605354,0.9994802465361777,4.116892724704268,-3.2160955723122298,0.7063451946648996,0.0,0.0,0.0,1.0
1718031530.8057878,map,True,False,1,2,0.0,0.0,3.144821882247925,-1.9627169370651245,0.0,0.0,0.0,0.032237174879605354,0.9994802465361777,4.116892724704268,-3.2160955723122298,0.7063451946648996,0.0,0.0,0.0,1.0
1718031530.808854,map,True,False,1,2,0.0,0.0,3.144821882247925,-1.9627169370651245,0.0,0.0,0.0,0.032237174879605354,0.9994802465361777,4.116892724704268,-3.2160955723122298,0.7063451946648996,0.0,0.0,0.0,1.0
1718031530.8628905,map,True,False,1,2,0.0,0.0,3.144821882247925,-1.9627169370651245,0.0,0.0,0.0,0.032237174879605354,0.9994802465361777,4.116892724704268,-3.2160955723122298,0.7063451946648996,0.0,0.0,0.0,1.0
