car_pos_meter , car_pos_cell, car_speed, ped_pos_meter, ped_pos_cell, ped_speed
-5.125, 5, 2, 3.198438, 4, 2
-5.104175, 5, 2, 3.193198, 4, 2
-5.08335, 5, 2, 3.19047, 4, 2
-5.062525, 5, 2, 3.185622, 4, 2
-5.0417, 5, 2, 3.180426, 4, 2
-5.020875, 5, 2, 3.175343, 4, 2
-5.000051, 5, 2, 3.170212, 4, 2
-4.979226, 4, 1, 3.167843, 4, 2
-4.976351, 4, 1, 3.16282, 4, 2
-4.973476, 4, 1, 3.157907, 4, 2
-4.970601, 4, 1, 3.152733, 4, 2
-4.967726, 4, 2, 3.147496, 4, 2
-4.946901, 4, 1, 3.145016, 4, 2
-4.944026, 4, 2, 3.139692, 4, 2
-4.923202, 4, 2, 3.134409, 4, 2
-4.902377, 4, 1, 3.129128, 4, 2
-4.899502, 4, 2, 3.123643, 4, 2
-4.878677, 4, 1, 3.118448, 4, 2
-4.875802, 4, 1, 3.115479, 4, 2
-4.872927, 4, 1, 3.109698, 4, 2
-4.870052, 4, 2, 3.104315, 4, 2
-4.849227, 4, 2, 3.099052, 4, 2
-4.828403, 4, 1, 3.093405, 4, 2
-4.825528, 4, 1, 3.090586, 4, 2
-4.822653, 4, 1, 3.085351, 4, 2
-4.819778, 4, 1, 3.080006, 4, 2
-4.816903, 4, 2, 3.074742, 3, 2
-4.796078, 4, 2, 3.069305, 3, 2
-4.775253, 4, 2, 3.066467, 3, 2
-4.754428, 4, 2, 3.060948, 3, 2
-4.733603, 4, 2, 3.055352, 3, 2
-4.629479, 4, 2, 3.029088, 3, 2
-3.588233, 3, 1, 2.786992, 3, 2
-3.444479, 3, 1, 2.550077, 3, 2
-3.300725, 3, 2, 2.285634, 2, 2
-2.259479, 2, 1, 2.016387, 2, 2
-2.115725, 2, 2, 1.638801, 2, 2
-1.074474, 1, 2, 1.265754, 1, 2
-0.03322291, 0, 2, 0.7364173, 0, 2
1.008028, -1, 2, 0.3671937, 0, 2
2.049279, -2, 2, 0.0803175, 0, 2
3.090524, -3, 2, 0.06769609, 0, 2
4.13177, -4, 2, 0.155266, 0, 2
5.173015, -5, 2, -0.09915257, 0, 2
6.214261, -6, 2, -0.2766814, 0, 2
7.255506, -7, 2, -0.3373356, 0, 2
8.296758, -8, 2, -0.352344, 0, 2
9.338027, -9, 2, -0.3488803, 0, 2
10.3793, -10, 2, -0.3436413, 0, 2
11.42057, -11, 2, -0.3389134, 0, 2
