timestamp_sec,frame_id,game_played,yielding,player1discrete,player2discrete,player1yieldprob,player2yieldprob,player1_pose_x,player1_pose_y,player1_pose_z,player1_pose_orient_x,player1_pose_orient_y,player1_pose_orient_z,player1_pose_orient_w,player2_pose_x,player2_pose_y,player2_pose_z,player2_pose_orient_x,player2_pose_orient_y,player2_pose_orient_z,player2_pose_orient_w
1718033759.3390868,map,True,True,7,7,0.5884586641783778,0.5884586641783778,0.7422587871551514,-1.0027427673339844,0.0,0.0,0.0,0.005451316908051522,0.9999851434319309,2.182240295992985,-8.391412288254715,0.8363616047220702,0.0,0.0,0.0,1.0
1718033759.3394585,map,True,True,7,7,0.5884586641783778,0.5884586641783778,0.7422587871551514,-1.0027427673339844,0.0,0.0,0.0,0.005451316908051522,0.9999851434319309,2.182240295992985,-8.391412288254715,0.8363616047220702,0.0,0.0,0.0,1.0
1718033759.3430967,map,True,False,7,7,0.5884586641783778,0.5884586641783778,0.7422587871551514,-1.0027427673339844,0.0,0.0,0.0,0.005451316908051522,0.9999851434319309,2.182240295992985,-8.391412288254715,0.8363616047220702,0.0,0.0,0.0,1.0
1718033759.347,map,True,True,7,7,0.5884586641783778,0.5884586641783778,0.7422587871551514,-1.0027427673339844,0.0,0.0,0.0,0.005451316908051522,0.9999851434319309,2.182240295992985,-8.391412288254715,0.8363616047220702,0.0,0.0,0.0,1.0
1718033759.3939977,map,True,False,7,7,0.5884586641783778,0.5884586641783778,0.7422587871551514,-1.0027427673339844,0.0,0.0,0.0,0.005451316908051522,0.9999851434319309,2.182240295992985,-8.391412288254715,0.8363616047220702,0.0,0.0,0.0,1.0
1718033759.4452972,map,True,True,7,7,0.5884586641783778,0.5884586641783778,0.7422587871551514,-1.0027427673339844,0.0,0.0,0.0,0.005451316908051522,0.9999851434319309,2.182240295992985,-8.391412288254715,0.8363616047220702,0.0,0.0,0.0,1.0
1718033759.4957945,map,True,False,7,7,0.5884586641783778,0.5884586641783778,0.7422587871551514,-1.0027427673339844,0.0,0.0,0.0,0.005451316908051522,0.9999851434319309,2.182240295992985,-8.391412288254715,0.8363616047220702,0.0,0.0,0.0,1.0
1718033759.5963728,map,True,True,7,7,0.5884586641783778,0.5884586641783778,0.7422587871551514,-1.0027427673339844,0.0,0.0,0.0,0.005451316908051522,0.9999851434319309,2.182240295992985,-8.391412288254715,0.8363616047220702,0.0,0.0,0.0,1.0
1718033759.695675,map,True,False,7,7,0.5884586641783778,0.5884586641783778,0.7422587871551514,-1.0027427673339844,0.0,0.0,0.0,0.005451316908051522,0.9999851434319309,2.169378930419338,-7.905053911985017,0.8667349445137752,0.0,0.0,0.0,1.0
1718033759.7463803,map,True,False,7,7,0.5884586641783778,0.5884586641783778,0.7422587871551514,-1.0027427673339844,0.0,0.0,0.0,0.005451316908051522,0.9999851434319309,2.169378930419338,-7.905053911985017,0.8667349445137752,0.0,0.0,0.0,1.0
1718033759.8456016,map,True,True,7,7,0.5884586641783778,0.5884586641783778,0.7422587871551514,-1.0027427673339844,0.0,0.0,0.0,0.005451316908051522,0.9999851434319309,2.169378930419338,-7.905053911985017,0.8667349445137752,0.0,0.0,0.0,1.0
1718033759.997468,map,True,False,7,7,0.5884586641783778,0.5884586641783778,0.7425816059112549,-1.0020443201065063,0.0,0.0,0.0,0.005303185526167566,0.9999859332048956,2.20439977014193,-7.918135246298898,0.8572529004198268,0.0,0.0,0.0,1.0
1718033760.0471087,map,True,False,7,7,0.5884586641783778,0.5884586641783778,0.7425816059112549,-1.0020443201065063,0.0,0.0,0.0,0.005303185526167566,0.9999859332048956,2.2403586113751883,-8.11994148542685,0.8623028079363179,0.0,0.0,0.0,1.0
1718033760.1463683,map,True,True,7,7,0.5884586641783778,0.5884586641783778,0.7425816059112549,-1.0020443201065063,0.0,0.0,0.0,0.005303185526167566,0.9999859332048956,2.2403586113751883,-8.11994148542685,0.8623028079363179,0.0,0.0,0.0,1.0
1718033760.2469501,map,True,False,7,7,0.5884586641783778,0.5884586641783778,0.7425816059112549,-1.0020443201065063,0.0,0.0,0.0,0.005303185526167566,0.9999859332048956,2.2403586113751883,-8.11994148542685,0.8623028079363179,0.0,0.0,0.0,1.0
1718033760.3481715,map,True,True,7,7,0.5884586641783778,0.5884586641783778,0.7425816059112549,-1.0020443201065063,0.0,0.0,0.0,0.005303185526167566,0.9999859332048956,2.287718700287413,-8.113919812935203,0.8413547279467057,0.0,0.0,0.0,1.0
1718033760.3984637,map,True,False,7,7,0.5884586641783778,0.5884586641783778,0.7425816059112549,-1.0020443201065063,0.0,0.0,0.0,0.005303185526167566,0.9999859332048956,2.3039655604014797,-8.284445159283,0.8558971194340634,0.0,0.0,0.0,1.0
1718033760.495944,map,True,False,7,7,0.5884586641783778,0.5884586641783778,0.7425816059112549,-1.0020443201065063,0.0,0.0,0.0,0.005303185526167566,0.9999859332048956,2.3039655604014797,-8.284445159283,0.8558971194340634,0.0,0.0,0.0,1.0
1718033760.5468953,map,True,True,7,7,0.5884586641783778,0.5884586641783778,0.7425816059112549,-1.0020443201065063,0.0,0.0,0.0,0.005303185526167566,0.9999859332048956,2.3039655604014797,-8.284445159283,0.8558971194340634,0.0,0.0,0.0,1.0
1718033760.6454499,map,True,False,7,6,0.0,0.0,0.7425816059112549,-1.0020443201065063,0.0,0.0,0.0,0.005303185526167566,0.9999859332048956,2.3119314685203616,-7.89901272182322,0.8564448849809223,0.0,0.0,0.0,1.0
1718033760.700111,map,True,False,7,6,0.0,0.0,0.7425816059112549,-1.0020443201065063,0.0,0.0,0.0,0.005303185526167566,0.9999859332048956,2.3556365107499206,-7.802497603322507,0.8746390798315764,0.0,0.0,0.0,1.0
1718033760.7972128,map,True,False,7,6,0.0,0.0,0.7425816059112549,-1.0020443201065063,0.0,0.0,0.0,0.005303185526167566,0.9999859332048956,2.2924535341937804,-7.711075114180554,0.8517073120327823,0.0,0.0,0.0,1.0
1718033760.8473659,map,True,False,7,6,0.0,0.0,0.7425816059112549,-1.0020443201065063,0.0,0.0,0.0,0.005303185526167566,0.9999859332048956,2.2924535341937804,-7.711075114180554,0.8517073120327823,0.0,0.0,0.0,1.0
1718033760.9977403,map,True,False,7,6,0.0,0.0,0.7942719459533691,-0.9945204257965088,0.0,0.0,0.0,0.00408358554270037,0.9999916553149145,2.3847679791952108,-7.618797725556977,0.8694017707619913,0.0,0.0,0.0,1.0
1718033761.09721,map,True,False,7,6,0.0,0.0,0.7942719459533691,-0.9945204257965088,0.0,0.0,0.0,0.00408358554270037,0.9999916553149145,2.4142816741021966,-7.7276883537695245,0.8628134047281305,0.0,0.0,0.0,1.0
1718033761.1964722,map,True,False,7,6,0.0,0.0,0.7942719459533691,-0.9945204257965088,0.0,0.0,0.0,0.00408358554270037,0.9999916553149145,2.4142816741021966,-7.7276883537695245,0.8628134047281305,0.0,0.0,0.0,1.0
1718033761.296633,map,True,False,7,6,0.0,0.0,0.7942719459533691,-0.9945204257965088,0.0,0.0,0.0,0.00408358554270037,0.9999916553149145,2.4142816741021966,-7.7276883537695245,0.8628134047281305,0.0,0.0,0.0,1.0
1718033761.3965516,map,True,False,7,6,0.0,0.0,0.7942719459533691,-0.9945204257965088,0.0,0.0,0.0,0.00408358554270037,0.9999916553149145,2.4852139021572475,-7.200375500691896,0.8218314938259232,0.0,0.0,0.0,1.0
1718033761.4469478,map,True,False,7,6,0.0,0.0,0.7942719459533691,-0.9945204257965088,0.0,0.0,0.0,0.00408358554270037,0.9999916553149145,2.4852139021572475,-7.200375500691896,0.8218314938259232,0.0,0.0,0.0,1.0
1718033761.4975467,map,True,False,7,6,0.0,0.0,0.7942719459533691,-0.9945204257965088,0.0,0.0,0.0,0.00408358554270037,0.9999916553149145,2.4852139021572475,-7.200375500691896,0.8218314938259232,0.0,0.0,0.0,1.0
1718033761.5474217,map,True,False,7,6,0.0,0.0,0.7942719459533691,-0.9945204257965088,0.0,0.0,0.0,0.00408358554270037,0.9999916553149145,2.4852139021572475,-7.200375500691896,0.8218314938259232,0.0,0.0,0.0,1.0
1718033761.5979142,map,True,False,7,6,0.0,0.0,0.8993089199066162,-1.036130428314209,0.0,0.0,0.0,0.004186445275554156,0.9999912380788324,2.4852139021572475,-7.200375500691896,0.8218314938259232,0.0,0.0,0.0,1.0
1718033761.6475353,map,True,False,7,6,0.0,0.0,0.8993089199066162,-1.036130428314209,0.0,0.0,0.0,0.004186445275554156,0.9999912380788324,2.578788952378286,-7.358377617422045,0.8064808664742399,0.0,0.0,0.0,1.0
1718033761.6980357,map,True,False,7,6,0.0,0.0,0.8993089199066162,-1.036130428314209,0.0,0.0,0.0,0.004186445275554156,0.9999912380788324,2.551460385485793,-6.946988805238848,0.7806720618552795,0.0,0.0,0.0,1.0
1718033761.7992322,map,True,False,7,6,0.0,0.0,0.8993089199066162,-1.036130428314209,0.0,0.0,0.0,0.004186445275554156,0.9999912380788324,2.551460385485793,-6.946988805238848,0.7806720618552795,0.0,0.0,0.0,1.0
1718033761.8477793,map,True,False,7,6,0.0,0.0,0.8993089199066162,-1.036130428314209,0.0,0.0,0.0,0.004186445275554156,0.9999912380788324,2.551460385485793,-6.946988805238848,0.7806720618552795,0.0,0.0,0.0,1.0
1718033762.0121791,map,True,False,7,6,0.0,0.0,0.8993089199066162,-1.036130428314209,0.0,0.0,0.0,0.004186445275554156,0.9999912380788324,2.6119528960764935,-7.02374398381132,0.7993029466550605,0.0,0.0,0.0,1.0
1718033762.0989335,map,True,False,7,6,0.0,0.0,0.8993089199066162,-1.036130428314209,0.0,0.0,0.0,0.004186445275554156,0.9999912380788324,2.6119528960764935,-7.02374398381132,0.7993029466550605,0.0,0.0,0.0,1.0
1718033762.1492043,map,True,False,7,6,0.0,0.0,0.8993089199066162,-1.036130428314209,0.0,0.0,0.0,0.004186445275554156,0.9999912380788324,2.6119528960764935,-7.02374398381132,0.7993029466550605,0.0,0.0,0.0,1.0
1718033762.2494395,map,True,True,6,6,0.5957621508060097,0.5957621508060098,0.9673030376434326,-1.1001613140106201,0.0,0.0,0.0,0.0057009654276645215,0.9999837427009877,2.6119528960764935,-7.02374398381132,0.7993029466550605,0.0,0.0,0.0,1.0
1718033762.3010364,map,True,False,6,6,0.5957621508060097,0.5957621508060098,0.9673030376434326,-1.1001613140106201,0.0,0.0,0.0,0.0057009654276645215,0.9999837427009877,2.6119528960764935,-7.02374398381132,0.7993029466550605,0.0,0.0,0.0,1.0
1718033762.350119,map,True,False,6,5,0.0,0.0,0.9673030376434326,-1.1001613140106201,0.0,0.0,0.0,0.0057009654276645215,0.9999837427009877,2.7224579805442115,-6.746427456389212,0.7771483655278124,0.0,0.0,0.0,1.0
1718033762.450355,map,True,False,6,5,0.0,0.0,0.9673030376434326,-1.1001613140106201,0.0,0.0,0.0,0.0057009654276645215,0.9999837427009877,2.7224579805442115,-6.746427456389212,0.7771483655278124,0.0,0.0,0.0,1.0
1718033762.5005383,map,True,False,6,5,0.0,0.0,0.9673030376434326,-1.1001613140106201,0.0,0.0,0.0,0.0057009654276645215,0.9999837427009877,2.7224579805442115,-6.746427456389212,0.7771483655278124,0.0,0.0,0.0,1.0
1718033762.550943,map,True,False,6,5,0.0,0.0,0.9673030376434326,-1.1001613140106201,0.0,0.0,0.0,0.0057009654276645215,0.9999837427009877,2.7224579805442115,-6.746427456389212,0.7771483655278124,0.0,0.0,0.0,1.0
1718033762.6008675,map,True,False,6,5,0.0,0.0,0.9673030376434326,-1.1001613140106201,0.0,0.0,0.0,0.0057009654276645215,0.9999837427009877,2.7224579805442115,-6.746427456389212,0.7771483655278124,0.0,0.0,0.0,1.0
1718033762.7050827,map,True,False,6,5,0.0,0.0,0.9673030376434326,-1.1001613140106201,0.0,0.0,0.0,0.0057009654276645215,0.9999837427009877,2.775611240037671,-6.654755801951399,0.7928098188711492,0.0,0.0,0.0,1.0
1718033762.7527215,map,True,False,6,5,0.0,0.0,0.9673030376434326,-1.1001613140106201,0.0,0.0,0.0,0.0057009654276645215,0.9999837427009877,2.7739809741321855,-6.541638071632791,0.7906456139310625,0.0,0.0,0.0,1.0
1718033762.803536,map,True,False,6,5,0.0,0.0,0.9673030376434326,-1.1001613140106201,0.0,0.0,0.0,0.0057009654276645215,0.9999837427009877,2.7739809741321855,-6.541638071632791,0.7906456139310625,0.0,0.0,0.0,1.0
1718033762.8517842,map,True,False,6,5,0.0,0.0,0.9673030376434326,-1.1001613140106201,0.0,0.0,0.0,0.0057009654276645215,0.9999837427009877,2.7739809741321855,-6.541638071632791,0.7906456139310625,0.0,0.0,0.0,1.0
1718033763.0532544,map,True,False,6,5,0.0,0.0,1.0524687767028809,-1.1651077270507812,0.0,0.0,0.0,0.004400375079477632,0.9999903141983166,2.8740679561909737,-6.454767824231839,0.763149812507502,0.0,0.0,0.0,1.0
1718033763.1528797,map,True,False,6,5,0.0,0.0,1.0524687767028809,-1.1651077270507812,0.0,0.0,0.0,0.004400375079477632,0.9999903141983166,2.8448895840482233,-6.230092523690813,0.7441998228010083,0.0,0.0,0.0,1.0
1718033763.2025974,map,True,False,6,5,0.0,0.0,1.0524687767028809,-1.1651077270507812,0.0,0.0,0.0,0.004400375079477632,0.9999903141983166,2.8448895840482233,-6.230092523690813,0.7441998228010083,0.0,0.0,0.0,1.0
1718033763.2527559,map,True,False,6,5,0.0,0.0,1.0524687767028809,-1.1651077270507812,0.0,0.0,0.0,0.004400375079477632,0.9999903141983166,2.8448895840482233,-6.230092523690813,0.7441998228010083,0.0,0.0,0.0,1.0
1718033763.3025498,map,True,False,6,5,0.0,0.0,1.0524687767028809,-1.1651077270507812,0.0,0.0,0.0,0.004400375079477632,0.9999903141983166,2.8448895840482233,-6.230092523690813,0.7441998228010083,0.0,0.0,0.0,1.0
1718033763.4036193,map,True,False,6,5,0.0,0.0,1.0524687767028809,-1.1651077270507812,0.0,0.0,0.0,0.004400375079477632,0.9999903141983166,2.852332329979424,-6.133057032198198,0.7572124804921173,0.0,0.0,0.0,1.0
1718033763.5023685,map,True,False,6,5,0.0,0.0,1.1778452396392822,-1.152649164199829,0.0,0.0,0.0,0.0036158802900707627,0.9999934583688395,2.852332329979424,-6.133057032198198,0.7572124804921173,0.0,0.0,0.0,1.0
1718033763.552585,map,True,False,6,5,0.0,0.0,1.1778452396392822,-1.152649164199829,0.0,0.0,0.0,0.0036158802900707627,0.9999934583688395,2.852332329979424,-6.133057032198198,0.7572124804921173,0.0,0.0,0.0,1.0
1718033763.6523082,map,True,False,6,5,0.0,0.0,1.1778452396392822,-1.152649164199829,0.0,0.0,0.0,0.0036158802900707627,0.9999934583688395,2.852332329979424,-6.133057032198198,0.7572124804921173,0.0,0.0,0.0,1.0
1718033763.7030354,map,True,False,6,5,0.0,0.0,1.1778452396392822,-1.152649164199829,0.0,0.0,0.0,0.0036158802900707627,0.9999934583688395,2.852332329979424,-6.133057032198198,0.7572124804921173,0.0,0.0,0.0,1.0
1718033763.7536094,map,True,False,6,4,0.0,0.0,1.1778452396392822,-1.152649164199829,0.0,0.0,0.0,0.0036158802900707627,0.9999934583688395,2.9880055852467744,-5.879664183710924,0.746766840709348,0.0,0.0,0.0,1.0
1718033763.803977,map,True,False,6,4,0.0,0.0,1.1778452396392822,-1.152649164199829,0.0,0.0,0.0,0.0036158802900707627,0.9999934583688395,2.9913898993089685,-5.824586222529961,0.7388821654858293,0.0,0.0,0.0,1.0
1718033763.8553686,map,True,False,6,4,0.0,0.0,1.1778452396392822,-1.152649164199829,0.0,0.0,0.0,0.0036158802900707627,0.9999934583688395,2.9913898993089685,-5.824586222529961,0.7388821654858293,0.0,0.0,0.0,1.0
1718033764.154203,map,True,False,6,4,0.0,0.0,1.2568953037261963,-1.2269444465637207,0.0,0.0,0.0,0.0057990240507439506,0.999983191348908,3.054658190912769,-5.659244088319227,0.7367326796945206,0.0,0.0,0.0,1.0
1718033764.2047253,map,True,False,6,4,0.0,0.0,1.2568953037261963,-1.2269444465637207,0.0,0.0,0.0,0.0057990240507439506,0.999983191348908,3.054658190912769,-5.659244088319227,0.7367326796945206,0.0,0.0,0.0,1.0
1718033764.2584279,map,True,False,6,4,0.0,0.0,1.2568953037261963,-1.2269444465637207,0.0,0.0,0.0,0.0057990240507439506,0.999983191348908,3.054658190912769,-5.659244088319227,0.7367326796945206,0.0,0.0,0.0,1.0
1718033764.3050182,map,True,False,6,4,0.0,0.0,1.2568953037261963,-1.2269444465637207,0.0,0.0,0.0,0.0057990240507439506,0.999983191348908,3.054658190912769,-5.659244088319227,0.7367326796945206,0.0,0.0,0.0,1.0
1718033764.4061,map,True,False,6,4,0.0,0.0,1.2568953037261963,-1.2269444465637207,0.0,0.0,0.0,0.0057990240507439506,0.999983191348908,3.054658190912769,-5.659244088319227,0.7367326796945206,0.0,0.0,0.0,1.0
1718033764.4552662,map,True,False,6,4,0.0,0.0,1.2568953037261963,-1.2269444465637207,0.0,0.0,0.0,0.0057990240507439506,0.999983191348908,3.1338819494987056,-5.50801398739633,0.7078501813331723,0.0,0.0,0.0,1.0
1718033764.5057757,map,True,False,6,4,0.0,0.0,1.2568953037261963,-1.2269444465637207,0.0,0.0,0.0,0.0057990240507439506,0.999983191348908,3.1338819494987056,-5.50801398739633,0.7078501813331723,0.0,0.0,0.0,1.0
1718033764.6075463,map,True,False,6,4,0.0,0.0,1.2568953037261963,-1.2269444465637207,0.0,0.0,0.0,0.0057990240507439506,0.999983191348908,3.1338819494987056,-5.50801398739633,0.7078501813331723,0.0,0.0,0.0,1.0
1718033764.6567273,map,True,False,6,4,0.0,0.0,1.2568953037261963,-1.2269444465637207,0.0,0.0,0.0,0.0057990240507439506,0.999983191348908,3.1338819494987056,-5.50801398739633,0.7078501813331723,0.0,0.0,0.0,1.0
1718033764.707367,map,True,False,5,4,0.0,0.0,1.3729174137115479,-1.2521411180496216,0.0,0.0,0.0,0.004956032466826206,0.9999877213677939,3.1338819494987056,-5.50801398739633,0.7078501813331723,0.0,0.0,0.0,1.0
1718033764.7566345,map,True,False,5,4,0.0,0.0,1.3729174137115479,-1.2521411180496216,0.0,0.0,0.0,0.004956032466826206,0.9999877213677939,3.234339648232277,-5.401867698114229,0.7136191602285948,0.0,0.0,0.0,1.0
1718033764.8084652,map,True,False,5,4,0.0,0.0,1.3729174137115479,-1.2521411180496216,0.0,0.0,0.0,0.004956032466826206,0.9999877213677939,3.217386324669479,-5.356021519163935,0.7197244426912373,0.0,0.0,0.0,1.0
1718033764.8597562,map,True,False,5,4,0.0,0.0,1.3729174137115479,-1.2521411180496216,0.0,0.0,0.0,0.004956032466826206,0.9999877213677939,3.217386324669479,-5.356021519163935,0.7197244426912373,0.0,0.0,0.0,1.0
1718033765.1103606,map,True,False,5,4,0.0,0.0,1.3729174137115479,-1.2521411180496216,0.0,0.0,0.0,0.004956032466826206,0.9999877213677939,3.3095558233645215,-5.071973240803533,0.7170650571934395,0.0,0.0,0.0,1.0
1718033765.210876,map,True,False,5,4,0.0,0.0,1.3729174137115479,-1.2521411180496216,0.0,0.0,0.0,0.004956032466826206,0.9999877213677939,3.3095558233645215,-5.071973240803533,0.7170650571934395,0.0,0.0,0.0,1.0
1718033765.3102727,map,True,False,5,4,0.0,0.0,1.3729174137115479,-1.2521411180496216,0.0,0.0,0.0,0.004956032466826206,0.9999877213677939,3.3095558233645215,-5.071973240803533,0.7170650571934395,0.0,0.0,0.0,1.0
1718033765.4113803,map,True,False,5,4,0.0,0.0,1.4631454944610596,-1.2879916429519653,0.0,0.0,0.0,0.005427241133953815,0.9999852775443652,3.3095558233645215,-5.071973240803533,0.7170650571934395,0.0,0.0,0.0,1.0
1718033765.4613454,map,True,False,5,3,0.0,0.0,1.4631454944610596,-1.2879916429519653,0.0,0.0,0.0,0.005427241133953815,0.9999852775443652,3.35615867285993,-4.833117336645515,0.7145870936878306,0.0,0.0,0.0,1.0
1718033765.5125332,map,True,False,5,3,0.0,0.0,1.4631454944610596,-1.2879916429519653,0.0,0.0,0.0,0.005427241133953815,0.9999852775443652,3.3730717564271675,-4.832269750776705,0.7203303699784879,0.0,0.0,0.0,1.0
1718033765.5644994,map,True,False,5,3,0.0,0.0,1.4631454944610596,-1.2879916429519653,0.0,0.0,0.0,0.005427241133953815,0.9999852775443652,3.3730717564271675,-4.832269750776705,0.7203303699784879,0.0,0.0,0.0,1.0
1718033765.6619012,map,True,False,5,3,0.0,0.0,1.4631454944610596,-1.2879916429519653,0.0,0.0,0.0,0.005427241133953815,0.9999852775443652,3.3730717564271675,-4.832269750776705,0.7203303699784879,0.0,0.0,0.0,1.0
1718033765.7614253,map,True,False,5,3,0.0,0.0,1.4631454944610596,-1.2879916429519653,0.0,0.0,0.0,0.005427241133953815,0.9999852775443652,3.3730717564271675,-4.832269750776705,0.7203303699784879,0.0,0.0,0.0,1.0
1718033765.8130841,map,True,False,5,3,0.0,0.0,1.4631454944610596,-1.2879916429519653,0.0,0.0,0.0,0.005427241133953815,0.9999852775443652,3.4322159451458214,-4.758858478235645,0.7137608880424197,0.0,0.0,0.0,1.0
1718033765.8644593,map,True,False,5,3,0.0,0.0,1.4631454944610596,-1.2879916429519653,0.0,0.0,0.0,0.005427241133953815,0.9999852775443652,3.4322159451458214,-4.758858478235645,0.7137608880424197,0.0,0.0,0.0,1.0
1718033766.1158583,map,True,False,5,3,0.0,0.0,1.4631454944610596,-1.2879916429519653,0.0,0.0,0.0,0.005427241133953815,0.9999852775443652,3.4499696873544794,-4.569980519962456,0.6587897412508917,0.0,0.0,0.0,1.0
1718033766.213131,map,True,False,5,3,0.0,0.0,1.5775930881500244,-1.339058756828308,0.0,0.0,0.0,0.00591532524157433,0.9999825058837364,3.4324627590460155,-4.445871295602116,0.6799818863522756,0.0,0.0,0.0,1.0
1718033766.2640858,map,True,False,5,3,0.0,0.0,1.5775930881500244,-1.339058756828308,0.0,0.0,0.0,0.00591532524157433,0.9999825058837364,3.4324627590460155,-4.445871295602116,0.6799818863522756,0.0,0.0,0.0,1.0
1718033766.3641675,map,True,False,5,3,0.0,0.0,1.5775930881500244,-1.339058756828308,0.0,0.0,0.0,0.00591532524157433,0.9999825058837364,3.4324627590460155,-4.445871295602116,0.6799818863522756,0.0,0.0,0.0,1.0
1718033766.46434,map,True,False,5,3,0.0,0.0,1.5775930881500244,-1.339058756828308,0.0,0.0,0.0,0.00591532524157433,0.9999825058837364,3.4451574641305203,-4.356437628114813,0.7045990464534285,0.0,0.0,0.0,1.0
1718033766.514342,map,True,False,5,3,0.0,0.0,1.5775930881500244,-1.339058756828308,0.0,0.0,0.0,0.00591532524157433,0.9999825058837364,3.456772390552555,-4.32901074657664,0.7092874291315264,0.0,0.0,0.0,1.0
1718033766.564307,map,True,False,5,3,0.0,0.0,1.5775930881500244,-1.339058756828308,0.0,0.0,0.0,0.00591532524157433,0.9999825058837364,3.456772390552555,-4.32901074657664,0.7092874291315264,0.0,0.0,0.0,1.0
1718033766.6143594,map,True,False,5,3,0.0,0.0,1.5775930881500244,-1.339058756828308,0.0,0.0,0.0,0.00591532524157433,0.9999825058837364,3.456772390552555,-4.32901074657664,0.7092874291315264,0.0,0.0,0.0,1.0
1718033766.6648154,map,True,False,5,3,0.0,0.0,1.5775930881500244,-1.339058756828308,0.0,0.0,0.0,0.00591532524157433,0.9999825058837364,3.456772390552555,-4.32901074657664,0.7092874291315264,0.0,0.0,0.0,1.0
1718033766.7149563,map,True,False,4,3,0.0,0.0,1.7092583179473877,-1.3509520292282104,0.0,0.0,0.0,0.006028585212858316,0.9999818353195269,3.456772390552555,-4.32901074657664,0.7092874291315264,0.0,0.0,0.0,1.0
1718033766.8145611,map,True,False,4,3,0.0,0.0,1.7092583179473877,-1.3509520292282104,0.0,0.0,0.0,0.006028585212858316,0.9999818353195269,3.5555324231765795,-4.16992311562766,0.6842474111904332,0.0,0.0,0.0,1.0
1718033766.8659074,map,True,False,4,3,0.0,0.0,1.7092583179473877,-1.3509520292282104,0.0,0.0,0.0,0.006028585212858316,0.9999818353195269,3.5555324231765795,-4.16992311562766,0.6842474111904332,0.0,0.0,0.0,1.0
1718033767.1264164,map,True,False,4,3,0.0,0.0,1.7092583179473877,-1.3509520292282104,0.0,0.0,0.0,0.006028585212858316,0.9999818353195269,3.550627814890002,-3.947335866362489,0.69695244314028,0.0,0.0,0.0,1.0
1718033767.2227645,map,True,False,4,2,0.0,0.0,1.7092583179473877,-1.3509520292282104,0.0,0.0,0.0,0.006028585212858316,0.9999818353195269,3.5423077517931842,-3.8980672864021875,0.6966343166114144,0.0,0.0,0.0,1.0
1718033767.272854,map,True,False,4,2,0.0,0.0,1.7092583179473877,-1.3509520292282104,0.0,0.0,0.0,0.006028585212858316,0.9999818353195269,3.5423077517931842,-3.8980672864021875,0.6966343166114144,0.0,0.0,0.0,1.0
1718033767.3243399,map,True,False,4,2,0.0,0.0,1.7880465984344482,-1.3856583833694458,0.0,0.0,0.0,0.007046643027708066,0.9999751743572948,3.5423077517931842,-3.8980672864021875,0.6966343166114144,0.0,0.0,0.0,1.0
1718033767.3736374,map,True,False,4,2,0.0,0.0,1.7880465984344482,-1.3856583833694458,0.0,0.0,0.0,0.007046643027708066,0.9999751743572948,3.5423077517931842,-3.8980672864021875,0.6966343166114144,0.0,0.0,0.0,1.0
1718033767.4728463,map,True,False,4,2,0.0,0.0,1.7880465984344482,-1.3856583833694458,0.0,0.0,0.0,0.007046643027708066,0.9999751743572948,3.5423077517931842,-3.8980672864021875,0.6966343166114144,0.0,0.0,0.0,1.0
1718033767.524141,map,True,False,4,2,0.0,0.0,1.7880465984344482,-1.3856583833694458,0.0,0.0,0.0,0.007046643027708066,0.9999751743572948,3.5365246493583467,-3.6710682486185573,0.6522877924837087,0.0,0.0,0.0,1.0
1718033767.5740182,map,True,False,4,2,0.0,0.0,1.7880465984344482,-1.3856583833694458,0.0,0.0,0.0,0.007046643027708066,0.9999751743572948,3.5226426352370277,-3.633377462084046,0.6374525898277983,0.0,0.0,0.0,1.0
1718033767.6250298,map,True,False,4,2,0.0,0.0,1.7880465984344482,-1.3856583833694458,0.0,0.0,0.0,0.007046643027708066,0.9999751743572948,3.5226426352370277,-3.633377462084046,0.6374525898277983,0.0,0.0,0.0,1.0
1718033767.6751661,map,True,False,4,2,0.0,0.0,1.7880465984344482,-1.3856583833694458,0.0,0.0,0.0,0.007046643027708066,0.9999751743572948,3.5226426352370277,-3.633377462084046,0.6374525898277983,0.0,0.0,0.0,1.0
1718033767.7248874,map,True,False,4,2,0.0,0.0,1.7880465984344482,-1.3856583833694458,0.0,0.0,0.0,0.007046643027708066,0.9999751743572948,3.5226426352370277,-3.633377462084046,0.6374525898277983,0.0,0.0,0.0,1.0
1718033767.8263142,map,True,False,4,2,0.0,0.0,1.7880465984344482,-1.3856583833694458,0.0,0.0,0.0,0.007046643027708066,0.9999751743572948,3.5226426352370277,-3.633377462084046,0.6374525898277983,0.0,0.0,0.0,1.0
1718033767.8769894,map,True,False,4,2,0.0,0.0,1.7880465984344482,-1.3856583833694458,0.0,0.0,0.0,0.007046643027708066,0.9999751743572948,3.5203640060380694,-3.5124084109137845,0.6474201700988907,0.0,0.0,0.0,1.0
1718033767.9272265,map,True,False,4,2,0.0,0.0,1.7880465984344482,-1.3856583833694458,0.0,0.0,0.0,0.007046643027708066,0.9999751743572948,3.481031696772896,-3.4641578343611736,0.686654854320888,0.0,0.0,0.0,1.0
1718033767.9795809,map,True,False,4,2,0.0,0.0,1.7880465984344482,-1.3856583833694458,0.0,0.0,0.0,0.007046643027708066,0.9999751743572948,3.481031696772896,-3.4641578343611736,0.686654854320888,0.0,0.0,0.0,1.0
1718033768.0775867,map,True,False,4,2,0.0,0.0,1.8772046566009521,-1.3864935636520386,0.0,0.0,0.0,0.006566195769424942,0.999978437787288,3.481031696772896,-3.4641578343611736,0.686654854320888,0.0,0.0,0.0,1.0
1718033768.1292918,map,True,False,4,2,0.0,0.0,1.8772046566009521,-1.3864935636520386,0.0,0.0,0.0,0.006566195769424942,0.999978437787288,3.481031696772896,-3.4641578343611736,0.686654854320888,0.0,0.0,0.0,1.0
1718033768.2280414,map,True,False,4,2,0.0,0.0,1.8772046566009521,-1.3864935636520386,0.0,0.0,0.0,0.006566195769424942,0.999978437787288,3.5112054079003956,-3.4490441686911844,0.6899954907529313,0.0,0.0,0.0,1.0
1718033768.281065,map,True,False,4,2,0.0,0.0,1.8772046566009521,-1.3864935636520386,0.0,0.0,0.0,0.006566195769424942,0.999978437787288,3.5486483395330213,-3.403546797482459,0.686329008665107,0.0,0.0,0.0,1.0
1718033768.3341477,map,True,False,4,2,0.0,0.0,1.8772046566009521,-1.3864935636520386,0.0,0.0,0.0,0.006566195769424942,0.999978437787288,3.5486483395330213,-3.403546797482459,0.686329008665107,0.0,0.0,0.0,1.0
1718033768.4276006,map,True,False,4,2,0.0,0.0,1.8772046566009521,-1.3864935636520386,0.0,0.0,0.0,0.006566195769424942,0.999978437787288,3.5486483395330213,-3.403546797482459,0.686329008665107,0.0,0.0,0.0,1.0
1718033768.4788256,map,True,False,4,2,0.0,0.0,1.8772046566009521,-1.3864935636520386,0.0,0.0,0.0,0.006566195769424942,0.999978437787288,3.5486483395330213,-3.403546797482459,0.686329008665107,0.0,0.0,0.0,1.0
1718033768.579227,map,True,False,4,2,0.0,0.0,1.8772046566009521,-1.3864935636520386,0.0,0.0,0.0,0.006566195769424942,0.999978437787288,3.5727684092530976,-3.2863371857550803,0.6859973339761941,0.0,0.0,0.0,1.0
1718033768.629808,map,True,False,4,2,0.0,0.0,1.8772046566009521,-1.3864935636520386,0.0,0.0,0.0,0.006566195769424942,0.999978437787288,3.5727684092530976,-3.2863371857550803,0.6859973339761941,0.0,0.0,0.0,1.0
1718033768.6804461,map,True,False,4,2,0.0,0.0,1.974902629852295,-1.4393775463104248,0.0,0.0,0.0,0.010070837429594049,0.9999492900627085,3.5727684092530976,-3.2863371857550803,0.6859973339761941,0.0,0.0,0.0,1.0
1718033768.780151,map,True,False,4,2,0.0,0.0,1.974902629852295,-1.4393775463104248,0.0,0.0,0.0,0.010070837429594049,0.9999492900627085,3.5727684092530976,-3.2863371857550803,0.6859973339761941,0.0,0.0,0.0,1.0
1718033768.8292263,map,True,False,4,2,0.0,0.0,1.974902629852295,-1.4393775463104248,0.0,0.0,0.0,0.010070837429594049,0.9999492900627085,3.5727684092530976,-3.2863371857550803,0.6859973339761941,0.0,0.0,0.0,1.0
1718033768.8793297,map,True,False,4,2,0.0,0.0,1.974902629852295,-1.4393775463104248,0.0,0.0,0.0,0.010070837429594049,0.9999492900627085,3.567938076510167,-3.1247732210993453,0.6854475316493416,0.0,0.0,0.0,1.0
1718033768.929879,map,True,False,4,2,0.0,0.0,1.974902629852295,-1.4393775463104248,0.0,0.0,0.0,0.010070837429594049,0.9999492900627085,3.611280059378192,-3.0862851531415862,0.67940949795611,0.0,0.0,0.0,1.0
1718033769.030065,map,True,False,4,2,0.0,0.0,1.974902629852295,-1.4393775463104248,0.0,0.0,0.0,0.010070837429594049,0.9999492900627085,3.611280059378192,-3.0862851531415862,0.67940949795611,0.0,0.0,0.0,1.0
1718033769.1285608,map,True,False,4,2,0.0,0.0,1.974902629852295,-1.4393775463104248,0.0,0.0,0.0,0.010070837429594049,0.9999492900627085,3.611280059378192,-3.0862851531415862,0.67940949795611,0.0,0.0,0.0,1.0
1718033769.2293794,map,True,False,4,2,0.0,0.0,2.076009511947632,-1.4690868854522705,0.0,0.0,0.0,0.010463736129089204,0.9999452516350821,3.657609287980425,-2.9879014665609436,0.6847627764263494,0.0,0.0,0.0,1.0
1718033769.3289423,map,True,False,4,2,0.0,0.0,2.076009511947632,-1.4690868854522705,0.0,0.0,0.0,0.010463736129089204,0.9999452516350821,3.65752671068052,-2.96213818990467,0.6846659553743689,0.0,0.0,0.0,1.0
1718033769.4293594,map,True,False,4,2,0.0,0.0,2.076009511947632,-1.4690868854522705,0.0,0.0,0.0,0.010463736129089204,0.9999452516350821,3.65752671068052,-2.96213818990467,0.6846659553743689,0.0,0.0,0.0,1.0
1718033769.5286627,map,True,False,4,2,0.0,0.0,2.076009511947632,-1.4690868854522705,0.0,0.0,0.0,0.010463736129089204,0.9999452516350821,3.65752671068052,-2.96213818990467,0.6846659553743689,0.0,0.0,0.0,1.0
1718033769.579987,map,True,False,4,2,0.0,0.0,2.076009511947632,-1.4690868854522705,0.0,0.0,0.0,0.010463736129089204,0.9999452516350821,3.6808325979016314,-2.871320230666142,0.6843091579852939,0.0,0.0,0.0,1.0
1718033769.6301272,map,True,False,4,1,0.0,0.0,2.076009511947632,-1.4690868854522705,0.0,0.0,0.0,0.010463736129089204,0.9999452516350821,3.6760696494048983,-2.827846312063051,0.6841548456152898,0.0,0.0,0.0,1.0
1718033769.7291007,map,True,False,4,1,0.0,0.0,2.076009511947632,-1.4690868854522705,0.0,0.0,0.0,0.010463736129089204,0.9999452516350821,3.6760696494048983,-2.827846312063051,0.6841548456152898,0.0,0.0,0.0,1.0
1718033769.7805452,map,True,False,3,1,0.0,0.0,2.153698444366455,-1.5162107944488525,0.0,0.0,0.0,0.011771489706988008,0.9999307071997026,3.6760696494048983,-2.827846312063051,0.6841548456152898,0.0,0.0,0.0,1.0
1718033769.8294864,map,True,False,3,1,0.0,0.0,2.153698444366455,-1.5162107944488525,0.0,0.0,0.0,0.011771489706988008,0.9999307071997026,3.6760696494048983,-2.827846312063051,0.6841548456152898,0.0,0.0,0.0,1.0
1718033769.8820775,map,True,False,3,1,0.0,0.0,2.153698444366455,-1.5162107944488525,0.0,0.0,0.0,0.011771489706988008,0.9999307071997026,3.7078045982446897,-2.799970618773865,0.6840155862832615,0.0,0.0,0.0,1.0
1718033769.9334424,map,True,False,3,1,0.0,0.0,2.153698444366455,-1.5162107944488525,0.0,0.0,0.0,0.011771489706988008,0.9999307071997026,3.688187137997736,-2.7862418795728336,0.6816967850396141,0.0,0.0,0.0,1.0
1718033770.0319989,map,True,False,3,1,0.0,0.0,2.153698444366455,-1.5162107944488525,0.0,0.0,0.0,0.011771489706988008,0.9999307071997026,3.688187137997736,-2.7862418795728336,0.6816967850396141,0.0,0.0,0.0,1.0
1718033770.130497,map,True,False,3,1,0.0,0.0,2.153698444366455,-1.5162107944488525,0.0,0.0,0.0,0.011771489706988008,0.9999307071997026,3.688187137997736,-2.7862418795728336,0.6816967850396141,0.0,0.0,0.0,1.0
1718033770.1813786,map,True,False,3,1,0.0,0.0,2.153698444366455,-1.5162107944488525,0.0,0.0,0.0,0.011771489706988008,0.9999307071997026,3.688187137997736,-2.7862418795728336,0.6816967850396141,0.0,0.0,0.0,1.0
1718033770.2828405,map,True,False,3,2,0.0,0.0,2.2458958625793457,-1.5425071716308594,0.0,0.0,0.0,0.0118711472024506,0.9999295299256986,3.755416478211278,-2.8828381655579256,0.6818352974803936,0.0,0.0,0.0,1.0
1718033770.3309786,map,True,False,3,2,0.0,0.0,2.2458958625793457,-1.5425071716308594,0.0,0.0,0.0,0.0118711472024506,0.9999295299256986,3.755416478211278,-2.8828381655579256,0.6818352974803936,0.0,0.0,0.0,1.0
1718033770.3817194,map,True,False,3,2,0.0,0.0,2.2458958625793457,-1.5425071716308594,0.0,0.0,0.0,0.0118711472024506,0.9999295299256986,3.755416478211278,-2.8828381655579256,0.6818352974803936,0.0,0.0,0.0,1.0
1718033770.4312897,map,True,False,3,2,0.0,0.0,2.2458958625793457,-1.5425071716308594,0.0,0.0,0.0,0.0118711472024506,0.9999295299256986,3.755416478211278,-2.8828381655579256,0.6818352974803936,0.0,0.0,0.0,1.0
1718033770.4829462,map,True,False,3,2,0.0,0.0,2.2458958625793457,-1.5425071716308594,0.0,0.0,0.0,0.0118711472024506,0.9999295299256986,3.755416478211278,-2.8828381655579256,0.6818352974803936,0.0,0.0,0.0,1.0
1718033770.5818346,map,True,False,3,2,0.0,0.0,2.2458958625793457,-1.5425071716308594,0.0,0.0,0.0,0.0118711472024506,0.9999295299256986,3.790687918301852,-2.92212133332599,0.6820075685745196,0.0,0.0,0.0,1.0
1718033770.631808,map,True,False,3,2,0.0,0.0,2.2458958625793457,-1.5425071716308594,0.0,0.0,0.0,0.0118711472024506,0.9999295299256986,3.790687918301852,-2.92212133332599,0.6820075685745196,0.0,0.0,0.0,1.0
1718033770.7316387,map,True,False,3,2,0.0,0.0,2.33469820022583,-1.553275465965271,0.0,0.0,0.0,0.011610077904941094,0.9999325997765252,3.790687918301852,-2.92212133332599,0.6820075685745196,0.0,0.0,0.0,1.0
1718033770.8316507,map,True,False,3,2,0.0,0.0,2.33469820022583,-1.553275465965271,0.0,0.0,0.0,0.011610077904941094,0.9999325997765252,3.790687918301852,-2.92212133332599,0.6820075685745196,0.0,0.0,0.0,1.0
1718033770.932382,map,True,False,3,2,0.0,0.0,2.33469820022583,-1.553275465965271,0.0,0.0,0.0,0.011610077904941094,0.9999325997765252,3.798344691334603,-2.9477920197542593,0.6845072992555468,0.0,0.0,0.0,1.0
1718033770.9858296,map,True,False,3,2,0.0,0.0,2.33469820022583,-1.553275465965271,0.0,0.0,0.0,0.011610077904941094,0.9999325997765252,3.798344691334603,-2.9477920197542593,0.6845072992555468,0.0,0.0,0.0,1.0
1718033771.0350184,map,True,False,3,2,0.0,0.0,2.33469820022583,-1.553275465965271,0.0,0.0,0.0,0.011610077904941094,0.9999325997765252,3.798344691334603,-2.9477920197542593,0.6845072992555468,0.0,0.0,0.0,1.0
1718033771.1338384,map,True,False,3,2,0.0,0.0,2.4202802181243896,-1.5916744470596313,0.0,0.0,0.0,0.012474311603822424,0.9999221980108322,3.798344691334603,-2.9477920197542593,0.6845072992555468,0.0,0.0,0.0,1.0
1718033771.2358918,map,True,False,3,2,0.0,0.0,2.4202802181243896,-1.5916744470596313,0.0,0.0,0.0,0.012474311603822424,0.9999221980108322,3.7648266874734837,-2.935870058414993,0.6823401374527716,0.0,0.0,0.0,1.0
1718033771.2864094,map,True,False,3,2,0.0,0.0,2.4202802181243896,-1.5916744470596313,0.0,0.0,0.0,0.012474311603822424,0.9999221980108322,3.748037723334221,-2.926874206344934,0.6823663359805268,0.0,0.0,0.0,1.0
1718033771.3389564,map,True,False,3,2,0.0,0.0,2.4202802181243896,-1.5916744470596313,0.0,0.0,0.0,0.012474311603822424,0.9999221980108322,3.748037723334221,-2.926874206344934,0.6823663359805268,0.0,0.0,0.0,1.0
1718033771.3889644,map,True,False,3,2,0.0,0.0,2.4202802181243896,-1.5916744470596313,0.0,0.0,0.0,0.012474311603822424,0.9999221980108322,3.748037723334221,-2.926874206344934,0.6823663359805268,0.0,0.0,0.0,1.0
1718033771.4379554,map,True,False,3,2,0.0,0.0,2.4202802181243896,-1.5916744470596313,0.0,0.0,0.0,0.012474311603822424,0.9999221980108322,3.748037723334221,-2.926874206344934,0.6823663359805268,0.0,0.0,0.0,1.0
1718033771.4877264,map,True,False,3,2,0.0,0.0,2.4202802181243896,-1.5916744470596313,0.0,0.0,0.0,0.012474311603822424,0.9999221980108322,3.748037723334221,-2.926874206344934,0.6823663359805268,0.0,0.0,0.0,1.0
1718033771.587799,map,True,False,3,2,0.0,0.0,2.4202802181243896,-1.5916744470596313,0.0,0.0,0.0,0.012474311603822424,0.9999221980108322,3.7438094121430994,-2.9352277617651974,0.6824744514919034,0.0,0.0,0.0,1.0
1718033771.6381323,map,True,False,3,2,0.0,0.0,2.4202802181243896,-1.5916744470596313,0.0,0.0,0.0,0.012474311603822424,0.9999221980108322,3.7438094121430994,-2.9352277617651974,0.6824744514919034,0.0,0.0,0.0,1.0
1718033771.7378292,map,True,True,2,2,0.49874686716791977,0.49874686716791977,2.491851329803467,-1.6084903478622437,0.0,0.0,0.0,0.014277266882102919,0.9998980708626596,3.7438094121430994,-2.9352277617651974,0.6824744514919034,0.0,0.0,0.0,1.0
1718033771.7884598,map,True,True,2,2,0.49874686716791977,0.49874686716791977,2.491851329803467,-1.6084903478622437,0.0,0.0,0.0,0.014277266882102919,0.9998980708626596,3.7438094121430994,-2.9352277617651974,0.6824744514919034,0.0,0.0,0.0,1.0
1718033771.8455698,map,True,False,2,2,0.49874686716791977,0.49874686716791977,2.491851329803467,-1.6084903478622437,0.0,0.0,0.0,0.014277266882102919,0.9998980708626596,3.7438094121430994,-2.9352277617651974,0.6824744514919034,0.0,0.0,0.0,1.0
1718033771.8966663,map,True,False,2,2,0.49874686716791977,0.49874686716791977,2.491851329803467,-1.6084903478622437,0.0,0.0,0.0,0.014277266882102919,0.9998980708626596,3.753760105313888,-2.9544765696934805,0.6826447589781237,0.0,0.0,0.0,1.0
1718033771.9470928,map,True,False,2,2,0.49874686716791977,0.49874686716791977,2.491851329803467,-1.6084903478622437,0.0,0.0,0.0,0.014277266882102919,0.9998980708626596,3.7481778297234793,-2.9573643630139443,0.6826675745848467,0.0,0.0,0.0,1.0
1718033771.9969323,map,True,True,2,2,0.49874686716791977,0.49874686716791977,2.491851329803467,-1.6084903478622437,0.0,0.0,0.0,0.014277266882102919,0.9998980708626596,3.7481778297234793,-2.9573643630139443,0.6826675745848467,0.0,0.0,0.0,1.0
1718033772.047917,map,True,False,2,2,0.49874686716791977,0.49874686716791977,2.491851329803467,-1.6084903478622437,0.0,0.0,0.0,0.014277266882102919,0.9998980708626596,3.7481778297234793,-2.9573643630139443,0.6826675745848467,0.0,0.0,0.0,1.0
1718033772.1481385,map,True,True,2,2,0.49874686716791977,0.49874686716791977,2.5774307250976562,-1.6438549757003784,0.0,0.0,0.0,0.014434958763272679,0.9998958056527016,3.7481778297234793,-2.9573643630139443,0.6826675745848467,0.0,0.0,0.0,1.0
1718033772.1979027,map,True,True,2,2,0.49874686716791977,0.49874686716791977,2.5774307250976562,-1.6438549757003784,0.0,0.0,0.0,0.014434958763272679,0.9998958056527016,3.7481778297234793,-2.9573643630139443,0.6826675745848467,0.0,0.0,0.0,1.0
1718033772.298311,map,True,True,2,2,0.49874686716791977,0.49874686716791977,2.5774307250976562,-1.6438549757003784,0.0,0.0,0.0,0.014434958763272679,0.9998958056527016,3.759243342766007,-2.9432415338930773,0.6847644859077107,0.0,0.0,0.0,1.0
1718033772.398074,map,True,True,2,2,0.49874686716791977,0.49874686716791977,2.5774307250976562,-1.6438549757003784,0.0,0.0,0.0,0.014434958763272679,0.9998958056527016,3.759243342766007,-2.9432415338930773,0.6847644859077107,0.0,0.0,0.0,1.0
1718033772.4987516,map,True,True,2,2,0.49874686716791977,0.49874686716791977,2.5774307250976562,-1.6438549757003784,0.0,0.0,0.0,0.014434958763272679,0.9998958056527016,3.759243342766007,-2.9432415338930773,0.6847644859077107,0.0,0.0,0.0,1.0
1718033772.5486717,map,True,True,2,2,0.49874686716791977,0.49874686716791977,2.5774307250976562,-1.6438549757003784,0.0,0.0,0.0,0.014434958763272679,0.9998958056527016,3.759243342766007,-2.9432415338930773,0.6847644859077107,0.0,0.0,0.0,1.0
1718033772.5976737,map,True,True,2,2,0.49874686716791977,0.49874686716791977,2.5774307250976562,-1.6438549757003784,0.0,0.0,0.0,0.014434958763272679,0.9998958056527016,3.7851073328776126,-2.951301132912081,0.6826921120056316,0.0,0.0,0.0,1.0
1718033772.6497154,map,True,False,2,2,0.49874686716791977,0.49874686716791977,2.5774307250976562,-1.6438549757003784,0.0,0.0,0.0,0.014434958763272679,0.9998958056527016,3.7851073328776126,-2.951301132912081,0.6826921120056316,0.0,0.0,0.0,1.0
1718033772.6998239,map,True,True,2,2,0.49874686716791977,0.49874686716791977,2.5774307250976562,-1.6438549757003784,0.0,0.0,0.0,0.014434958763272679,0.9998958056527016,3.7851073328776126,-2.951301132912081,0.6826921120056316,0.0,0.0,0.0,1.0
1718033772.7981136,map,True,False,2,2,0.49874686716791977,0.49874686716791977,2.6451406478881836,-1.6728150844573975,0.0,0.0,0.0,0.014789528903189833,0.9998906343975809,3.7851073328776126,-2.951301132912081,0.6826921120056316,0.0,0.0,0.0,1.0
1718033772.8489137,map,True,True,2,2,0.49874686716791977,0.49874686716791977,2.6451406478881836,-1.6728150844573975,0.0,0.0,0.0,0.014789528903189833,0.9998906343975809,3.7851073328776126,-2.951301132912081,0.6826921120056316,0.0,0.0,0.0,1.0
1718033772.899853,map,True,False,2,2,0.49874686716791977,0.49874686716791977,2.6451406478881836,-1.6728150844573975,0.0,0.0,0.0,0.014789528903189833,0.9998906343975809,3.811833834751608,-2.9551791121803475,0.6827059630643993,0.0,0.0,0.0,1.0
1718033772.9496932,map,True,False,2,2,0.49874686716791977,0.49874686716791977,2.6451406478881836,-1.6728150844573975,0.0,0.0,0.0,0.014789528903189833,0.9998906343975809,3.8085261250571443,-2.9578427776110114,0.6847440153029435,0.0,0.0,0.0,1.0
1718033773.0001867,map,True,True,2,2,0.49874686716791977,0.49874686716791977,2.6451406478881836,-1.6728150844573975,0.0,0.0,0.0,0.014789528903189833,0.9998906343975809,3.8085261250571443,-2.9578427776110114,0.6847440153029435,0.0,0.0,0.0,1.0
1718033773.0994794,map,True,True,2,2,0.49874686716791977,0.49874686716791977,2.6451406478881836,-1.6728150844573975,0.0,0.0,0.0,0.014789528903189833,0.9998906343975809,3.8085261250571443,-2.9578427776110114,0.6847440153029435,0.0,0.0,0.0,1.0
1718033773.1504552,map,True,False,2,2,0.49874686716791977,0.49874686716791977,2.6451406478881836,-1.6728150844573975,0.0,0.0,0.0,0.014789528903189833,0.9998906343975809,3.8085261250571443,-2.9578427776110114,0.6847440153029435,0.0,0.0,0.0,1.0
1718033773.2502563,map,True,True,2,2,0.49874686716791977,0.49874686716791977,2.7068240642547607,-1.6950099468231201,0.0,0.0,0.0,0.015730026718385005,0.9998762829068091,3.820473895380515,-2.954816756015476,0.682715256602507,0.0,0.0,0.0,1.0
1718033773.3513663,map,True,True,2,2,0.49874686716791977,0.49874686716791977,2.7068240642547607,-1.6950099468231201,0.0,0.0,0.0,0.015730026718385005,0.9998762829068091,3.820473895380515,-2.954816756015476,0.682715256602507,0.0,0.0,0.0,1.0
1718033773.400554,map,True,True,2,2,0.49874686716791977,0.49874686716791977,2.7068240642547607,-1.6950099468231201,0.0,0.0,0.0,0.015730026718385005,0.9998762829068091,3.820473895380515,-2.954816756015476,0.682715256602507,0.0,0.0,0.0,1.0
1718033773.4514463,map,True,True,2,2,0.49874686716791977,0.49874686716791977,2.7068240642547607,-1.6950099468231201,0.0,0.0,0.0,0.015730026718385005,0.9998762829068091,3.820473895380515,-2.954816756015476,0.682715256602507,0.0,0.0,0.0,1.0
1718033773.5016072,map,True,True,2,2,0.49874686716791977,0.49874686716791977,2.7068240642547607,-1.6950099468231201,0.0,0.0,0.0,0.015730026718385005,0.9998762829068091,3.820473895380515,-2.954816756015476,0.682715256602507,0.0,0.0,0.0,1.0
1718033773.555459,map,True,False,2,2,0.49874686716791977,0.49874686716791977,2.7068240642547607,-1.6950099468231201,0.0,0.0,0.0,0.015730026718385005,0.9998762829068091,3.820473895380515,-2.954816756015476,0.682715256602507,0.0,0.0,0.0,1.0
1718033773.603579,map,True,False,2,2,0.49874686716791977,0.49874686716791977,2.7068240642547607,-1.6950099468231201,0.0,0.0,0.0,0.015730026718385005,0.9998762829068091,3.828775331668904,-2.9541499845192876,0.6847055619828406,0.0,0.0,0.0,1.0
1718033773.653116,map,True,True,2,2,0.49874686716791977,0.49874686716791977,2.7068240642547607,-1.6950099468231201,0.0,0.0,0.0,0.015730026718385005,0.9998762829068091,3.828775331668904,-2.9541499845192876,0.6847055619828406,0.0,0.0,0.0,1.0
1718033773.751928,map,True,False,2,2,0.49874686716791977,0.49874686716791977,2.7068240642547607,-1.6950099468231201,0.0,0.0,0.0,0.015730026718385005,0.9998762829068091,3.828775331668904,-2.9541499845192876,0.6847055619828406,0.0,0.0,0.0,1.0
1718033773.8019779,map,True,True,2,2,0.49874686716791977,0.49874686716791977,2.7068240642547607,-1.6950099468231201,0.0,0.0,0.0,0.015730026718385005,0.9998762829068091,3.828775331668904,-2.9541499845192876,0.6847055619828406,0.0,0.0,0.0,1.0
1718033773.8519802,map,True,False,2,2,0.49874686716791977,0.49874686716791977,2.746974229812622,-1.7511051893234253,0.0,0.0,0.0,0.017261951757246208,0.9998510070909404,3.828775331668904,-2.9541499845192876,0.6847055619828406,0.0,0.0,0.0,1.0
1718033773.903096,map,True,True,2,2,0.49874686716791977,0.49874686716791977,2.746974229812622,-1.7511051893234253,0.0,0.0,0.0,0.017261951757246208,0.9998510070909404,3.8547762464144677,-2.9573295184518384,0.6847327391576271,0.0,0.0,0.0,1.0
1718033774.0075839,map,True,False,2,2,0.49874686716791977,0.49874686716791977,2.746974229812622,-1.7511051893234253,0.0,0.0,0.0,0.017261951757246208,0.9998510070909404,3.8539473186307265,-2.962589359634577,0.6847543113255822,0.0,0.0,0.0,1.0
1718033774.0533717,map,True,True,2,2,0.49874686716791977,0.49874686716791977,2.746974229812622,-1.7511051893234253,0.0,0.0,0.0,0.017261951757246208,0.9998510070909404,3.8539473186307265,-2.962589359634577,0.6847543113255822,0.0,0.0,0.0,1.0
1718033774.1525023,map,True,True,2,2,0.49874686716791977,0.49874686716791977,2.746974229812622,-1.7511051893234253,0.0,0.0,0.0,0.017261951757246208,0.9998510070909404,3.8539473186307265,-2.962589359634577,0.6847543113255822,0.0,0.0,0.0,1.0
1718033774.2025323,map,True,True,2,2,0.49874686716791977,0.49874686716791977,2.746974229812622,-1.7511051893234253,0.0,0.0,0.0,0.017261951757246208,0.9998510070909404,3.8539473186307265,-2.962589359634577,0.6847543113255822,0.0,0.0,0.0,1.0
1718033774.303733,map,True,False,2,2,0.49874686716791977,0.49874686716791977,2.7966840267181396,-1.7574517726898193,0.0,0.0,0.0,0.017882025084956586,0.9998400977560262,3.862012434076429,-2.988392135943405,0.6846929280051902,0.0,0.0,0.0,1.0
1718033774.3552346,map,True,False,2,2,0.49874686716791977,0.49874686716791977,2.7966840267181396,-1.7574517726898193,0.0,0.0,0.0,0.017882025084956586,0.9998400977560262,3.862012434076429,-2.988392135943405,0.6846929280051902,0.0,0.0,0.0,1.0
1718033774.4088147,map,True,True,2,2,0.49874686716791977,0.49874686716791977,2.7966840267181396,-1.7574517726898193,0.0,0.0,0.0,0.017882025084956586,0.9998400977560262,3.862012434076429,-2.988392135943405,0.6846929280051902,0.0,0.0,0.0,1.0
1718033774.506691,map,True,False,2,2,0.49874686716791977,0.49874686716791977,2.7966840267181396,-1.7574517726898193,0.0,0.0,0.0,0.017882025084956586,0.9998400977560262,3.862012434076429,-2.988392135943405,0.6846929280051902,0.0,0.0,0.0,1.0
1718033774.6086173,map,True,True,2,2,0.49874686716791977,0.49874686716791977,2.7966840267181396,-1.7574517726898193,0.0,0.0,0.0,0.017882025084956586,0.9998400977560262,3.8787773355821624,-2.9732150564756097,0.6846447073744678,0.0,0.0,0.0,1.0
1718033774.6583617,map,True,True,2,2,0.49874686716791977,0.49874686716791977,2.7966840267181396,-1.7574517726898193,0.0,0.0,0.0,0.017882025084956586,0.9998400977560262,3.875427101392547,-2.974160064697891,0.6846548371073099,0.0,0.0,0.0,1.0
1718033774.706886,map,True,False,2,2,0.49874686716791977,0.49874686716791977,2.7966840267181396,-1.7574517726898193,0.0,0.0,0.0,0.017882025084956586,0.9998400977560262,3.875427101392547,-2.974160064697891,0.6846548371073099,0.0,0.0,0.0,1.0
1718033774.806987,map,True,False,2,2,0.49874686716791977,0.49874686716791977,2.8073527812957764,-1.7849457263946533,0.0,0.0,0.0,0.01915960803204253,0.9998164306475606,3.875427101392547,-2.974160064697891,0.6846548371073099,0.0,0.0,0.0,1.0
1718033774.8579595,map,True,False,2,2,0.49874686716791977,0.49874686716791977,2.8073527812957764,-1.7849457263946533,0.0,0.0,0.0,0.01915960803204253,0.9998164306475606,3.875427101392547,-2.974160064697891,0.6846548371073099,0.0,0.0,0.0,1.0
1718033774.960463,map,True,True,2,2,0.49874686716791977,0.49874686716791977,2.8073527812957764,-1.7849457263946533,0.0,0.0,0.0,0.01915960803204253,0.9998164306475606,3.90548922064994,-2.9955567193067685,0.6865243661140461,0.0,0.0,0.0,1.0
1718033775.0576837,map,True,False,2,2,0.49874686716791977,0.49874686716791977,2.8073527812957764,-1.7849457263946533,0.0,0.0,0.0,0.01915960803204253,0.9998164306475606,3.90548922064994,-2.9955567193067685,0.6865243661140461,0.0,0.0,0.0,1.0
1718033775.107708,map,True,False,2,2,0.49874686716791977,0.49874686716791977,2.8073527812957764,-1.7849457263946533,0.0,0.0,0.0,0.01915960803204253,0.9998164306475606,3.90548922064994,-2.9955567193067685,0.6865243661140461,0.0,0.0,0.0,1.0
1718033775.1578887,map,True,False,2,2,0.49874686716791977,0.49874686716791977,2.8073527812957764,-1.7849457263946533,0.0,0.0,0.0,0.01915960803204253,0.9998164306475606,3.90548922064994,-2.9955567193067685,0.6865243661140461,0.0,0.0,0.0,1.0
1718033775.2083974,map,True,False,2,2,0.49874686716791977,0.49874686716791977,2.8073527812957764,-1.7849457263946533,0.0,0.0,0.0,0.01915960803204253,0.9998164306475606,3.90548922064994,-2.9955567193067685,0.6865243661140461,0.0,0.0,0.0,1.0
1718033775.3089938,map,True,True,2,2,0.49874686716791977,0.49874686716791977,2.8073527812957764,-1.7849457263946533,0.0,0.0,0.0,0.01915960803204253,0.9998164306475606,3.9285467704412302,-3.0192845452545454,0.6846783104959672,0.0,0.0,0.0,1.0
1718033775.4077883,map,True,False,1,2,0.0,0.0,2.8857884407043457,-1.8260176181793213,0.0,0.0,0.0,0.02095912540620476,0.9997803327571539,3.9285467704412302,-3.0192845452545454,0.6846783104959672,0.0,0.0,0.0,1.0
1718033775.4577997,map,True,False,1,2,0.0,0.0,2.8857884407043457,-1.8260176181793213,0.0,0.0,0.0,0.02095912540620476,0.9997803327571539,3.9285467704412302,-3.0192845452545454,0.6846783104959672,0.0,0.0,0.0,1.0
1718033775.508505,map,True,False,1,2,0.0,0.0,2.8857884407043457,-1.8260176181793213,0.0,0.0,0.0,0.02095912540620476,0.9997803327571539,3.9285467704412302,-3.0192845452545454,0.6846783104959672,0.0,0.0,0.0,1.0
1718033775.6195173,map,True,False,1,2,0.0,0.0,2.8857884407043457,-1.8260176181793213,0.0,0.0,0.0,0.02095912540620476,0.9997803327571539,3.9608465920646947,-3.1109103196303423,0.686963516084148,0.0,0.0,0.0,1.0
1718033775.7086227,map,True,False,1,2,0.0,0.0,2.8857884407043457,-1.8260176181793213,0.0,0.0,0.0,0.02095912540620476,0.9997803327571539,3.9692192271478377,-3.083193162298083,0.7038155352154178,0.0,0.0,0.0,1.0
1718033775.8083184,map,True,False,1,2,0.0,0.0,2.8857884407043457,-1.8260176181793213,0.0,0.0,0.0,0.02095912540620476,0.9997803327571539,3.9692192271478377,-3.083193162298083,0.7038155352154178,0.0,0.0,0.0,1.0
1718033775.8580835,map,True,False,1,2,0.0,0.0,2.8857884407043457,-1.8260176181793213,0.0,0.0,0.0,0.02095912540620476,0.9997803327571539,3.9692192271478377,-3.083193162298083,0.7038155352154178,0.0,0.0,0.0,1.0
1718033776.0097382,map,True,False,1,2,0.0,0.0,2.9543895721435547,-1.8904284238815308,0.0,0.0,0.0,0.02273347075377523,0.9997415655695601,4.009038585860593,-3.190454422646219,0.8491970682395288,0.0,0.0,0.0,1.0
1718033776.0118968,map,True,False,1,2,0.0,0.0,2.9543895721435547,-1.8904284238815308,0.0,0.0,0.0,0.02273347075377523,0.9997415655695601,4.009038585860593,-3.190454422646219,0.8491970682395288,0.0,0.0,0.0,1.0
1718033776.0180569,map,True,False,1,2,0.0,0.0,2.9543895721435547,-1.8904284238815308,0.0,0.0,0.0,0.02273347075377523,0.9997415655695601,4.009038585860593,-3.190454422646219,0.8491970682395288,0.0,0.0,0.0,1.0
1718033776.0201526,map,True,False,1,2,0.0,0.0,2.9543895721435547,-1.8904284238815308,0.0,0.0,0.0,0.02273347075377523,0.9997415655695601,4.009038585860593,-3.190454422646219,0.8491970682395288,0.0,0.0,0.0,1.0
1718033776.0231352,map,True,False,1,2,0.0,0.0,2.9543895721435547,-1.8904284238815308,0.0,0.0,0.0,0.02273347075377523,0.9997415655695601,4.009038585860593,-3.190454422646219,0.8491970682395288,0.0,0.0,0.0,1.0
1718033776.027433,map,True,False,1,2,0.0,0.0,2.9543895721435547,-1.8904284238815308,0.0,0.0,0.0,0.02273347075377523,0.9997415655695601,4.009038585860593,-3.190454422646219,0.8491970682395288,0.0,0.0,0.0,1.0
1718033776.0319047,map,True,False,1,2,0.0,0.0,2.9543895721435547,-1.8904284238815308,0.0,0.0,0.0,0.02273347075377523,0.9997415655695601,4.009038585860593,-3.190454422646219,0.8491970682395288,0.0,0.0,0.0,1.0
1718033776.0351918,map,True,False,1,2,0.0,0.0,2.9543895721435547,-1.8904284238815308,0.0,0.0,0.0,0.02273347075377523,0.9997415655695601,4.009038585860593,-3.190454422646219,0.8491970682395288,0.0,0.0,0.0,1.0
1718033776.0400546,map,True,False,1,2,0.0,0.0,2.9543895721435547,-1.8904284238815308,0.0,0.0,0.0,0.02273347075377523,0.9997415655695601,4.009038585860593,-3.190454422646219,0.8491970682395288,0.0,0.0,0.0,1.0
1718033776.0445218,map,True,False,1,2,0.0,0.0,2.9543895721435547,-1.8904284238815308,0.0,0.0,0.0,0.02273347075377523,0.9997415655695601,4.009038585860593,-3.190454422646219,0.8491970682395288,0.0,0.0,0.0,1.0
1718033776.0471919,map,True,False,1,2,0.0,0.0,2.9543895721435547,-1.8904284238815308,0.0,0.0,0.0,0.02273347075377523,0.9997415655695601,4.009038585860593,-3.190454422646219,0.8491970682395288,0.0,0.0,0.0,1.0
1718033776.1465394,map,True,False,1,2,0.0,0.0,2.9543895721435547,-1.8904284238815308,0.0,0.0,0.0,0.02273347075377523,0.9997415655695601,4.009038585860593,-3.190454422646219,0.8491970682395288,0.0,0.0,0.0,1.0
1718033776.1968644,map,True,False,1,2,0.0,0.0,2.9543895721435547,-1.8904284238815308,0.0,0.0,0.0,0.02273347075377523,0.9997415655695601,4.009038585860593,-3.190454422646219,0.8491970682395288,0.0,0.0,0.0,1.0
1718033776.2967958,map,True,False,1,2,0.0,0.0,2.9543895721435547,-1.8904284238815308,0.0,0.0,0.0,0.02273347075377523,0.9997415655695601,4.009038585860593,-3.190454422646219,0.8491970682395288,0.0,0.0,0.0,1.0
1718033776.3467395,map,True,False,1,2,0.0,0.0,2.9543895721435547,-1.8904284238815308,0.0,0.0,0.0,0.02273347075377523,0.9997415655695601,4.009038585860593,-3.190454422646219,0.8491970682395288,0.0,0.0,0.0,1.0
1718033776.3964767,map,True,False,1,2,0.0,0.0,2.9543895721435547,-1.8904284238815308,0.0,0.0,0.0,0.02273347075377523,0.9997415655695601,4.009038585860593,-3.190454422646219,0.8491970682395288,0.0,0.0,0.0,1.0
1718033776.44671,map,True,False,1,2,0.0,0.0,2.9543895721435547,-1.8904284238815308,0.0,0.0,0.0,0.02273347075377523,0.9997415655695601,4.009038585860593,-3.190454422646219,0.8491970682395288,0.0,0.0,0.0,1.0
1718033776.456258,map,True,False,1,2,0.0,0.0,2.9543895721435547,-1.8904284238815308,0.0,0.0,0.0,0.02273347075377523,0.9997415655695601,4.009038585860593,-3.190454422646219,0.8491970682395288,0.0,0.0,0.0,1.0
1718033776.4596224,map,True,False,1,2,0.0,0.0,2.9543895721435547,-1.8904284238815308,0.0,0.0,0.0,0.02273347075377523,0.9997415655695601,4.009038585860593,-3.190454422646219,0.8491970682395288,0.0,0.0,0.0,1.0
1718033776.5101972,map,True,False,1,2,0.0,0.0,3.0292418003082275,-1.8838051557540894,0.0,0.0,0.0,0.022155265391005697,0.9997545477517342,4.009038585860593,-3.190454422646219,0.8491970682395288,0.0,0.0,0.0,1.0
1718033776.5480196,map,True,False,1,2,0.0,0.0,3.0292418003082275,-1.8838051557540894,0.0,0.0,0.0,0.022155265391005697,0.9997545477517342,4.009038585860593,-3.190454422646219,0.8491970682395288,0.0,0.0,0.0,1.0
