car_pos_meter , car_pos_cell, car_speed, ped_pos_meter, ped_pos_cell, ped_speed
-41, 40, 2, 4.07203, 40, 1

-40.8334, 39, 2, 4.07203, 40, 1

-40.6668, 39, 2, 4.072207, 40, 1

-40.5002, 39, 2, 4.072207, 40, 1

-40.3336, 39, 2, 4.072207, 40, 1

-40.167, 39, 2, 4.072207, 40, 1

-40.0004, 39, 2, 4.072207, 40, 1

-39.83381, 38, 2, 4.139903, 41, 2

-39.66721, 38, 2, 4.139903, 41, 1

-39.50061, 38, 2, 4.13771, 41, 1

-39.33401, 38, 2, 4.136357, 41, 1

-39.16741, 38, 2, 4.13552, 41, 1

-39.00081, 38, 2, 4.134468, 41, 1

-38.83421, 37, 2, 4.133411, 41, 1

-38.66761, 37, 2, 4.1328, 41, 1

-38.50101, 37, 2, 4.131074, 41, 1

-38.33441, 37, 2, 4.130388, 41, 1

-38.16781, 37, 2, 4.12913, 41, 1

-38.00121, 37, 2, 4.128065, 41, 1

-37.83461, 36, 2, 4.126777, 41, 1

-37.66801, 36, 2, 4.12605, 41, 1

-37.50142, 36, 2, 4.124436, 41, 1

-37.33482, 36, 2, 4.122808, 41, 1

-37.16822, 36, 2, 4.120771, 41, 1

-37.00162, 36, 2, 4.118246, 41, 1

-36.83502, 35, 2, 4.11701, 41, 1

-36.66842, 35, 2, 4.114042, 41, 1

-36.50182, 35, 2, 4.110849, 41, 1

-36.33522, 35, 2, 4.107617, 41, 1

-36.16862, 35, 2, 4.103881, 41, 1

-36.00202, 35, 2, 4.102122, 41, 1

-35.83542, 34, 2, 4.09802, 40, 1

-35.66882, 34, 2, 4.093672, 40, 1

-35.50222, 34, 2, 4.088984, 40, 1

-35.33562, 34, 2, 4.086288, 40, 1

-35.16903, 34, 2, 4.080914, 40, 1

-35.00243, 34, 2, 4.076393, 40, 1

-34.83583, 33, 2, 4.072351, 40, 1

-34.66923, 33, 2, 4.068151, 40, 1

-34.50263, 33, 2, 4.063668, 40, 1

-34.33603, 33, 2, 4.061029, 40, 1

-34.16943, 33, 2, 4.055403, 40, 1

-34.00283, 33, 2, 4.049558, 40, 1

-33.83623, 32, 2, 4.044559, 40, 1

-33.66963, 32, 2, 4.042302, 40, 1

-33.50303, 32, 2, 4.038167, 40, 1

-33.33643, 32, 2, 4.034855, 40, 1

-33.16983, 32, 2, 4.031723, 40, 1

-33.00323, 32, 2, 4.028594, 40, 1

-32.83664, 31, 2, 4.025905, 40, 1

-32.67004, 31, 2, 4.024565, 40, 1

-32.50344, 31, 2, 4.021776, 40, 1

-32.33684, 31, 2, 4.01893, 40, 1

-32.17024, 31, 2, 4.01564, 40, 1

-32.00364, 31, 2, 4.012172, 40, 1

-31.83704, 30, 2, 4.009892, 40, 1

-31.67044, 30, 2, 4.005426, 40, 1

-31.50384, 30, 2, 3.999839, 39, 1

-31.33724, 30, 2, 3.990492, 39, 1

-31.17064, 30, 2, 3.987297, 39, 1

-31.00404, 30, 2, 3.983829, 39, 1

-30.83744, 29, 2, 3.976409, 39, 1

-30.67085, 29, 2, 3.968221, 39, 1

-30.50425, 29, 2, 3.95892, 39, 1

-30.33765, 29, 2, 3.949098, 39, 1

-30.17105, 29, 2, 3.943877, 39, 1

-30.00445, 29, 2, 3.932697, 39, 1

-29.83785, 28, 2, 3.920762, 39, 1

-29.67125, 28, 2, 3.901583, 39, 1

-29.50465, 28, 2, 3.895099, 38, 1

-29.33805, 28, 2, 3.888108, 38, 1

-29.17145, 28, 2, 3.873996, 38, 1

-29.00485, 28, 2, 3.859591, 38, 1

-28.83825, 27, 2, 3.845099, 38, 1

-28.67165, 27, 2, 3.830398, 38, 1

-28.50505, 27, 2, 3.822626, 38, 1

-28.33846, 27, 2, 3.806967, 38, 1

-28.17186, 27, 2, 3.789816, 37, 1

-28.00526, 27, 2, 3.771351, 37, 1

-27.83866, 26, 2, 3.751167, 37, 1

-27.67206, 26, 2, 3.740655, 37, 1

-27.50546, 26, 2, 3.718441, 37, 2

-27.33886, 26, 2, 3.695373, 36, 2

-27.17226, 26, 2, 3.671916, 36, 2

-27.00566, 26, 2, 3.649135, 36, 2

-26.83906, 25, 2, 3.637446, 36, 1

-26.67246, 25, 2, 3.615548, 36, 1

-26.50586, 25, 2, 3.594371, 35, 1

-26.33926, 25, 2, 3.574345, 35, 1

-26.17266, 25, 2, 3.547418, 35, 2

-26.00607, 25, 2, 3.547418, 35, 1

-25.83947, 24, 2, 3.530549, 35, 1

-25.67287, 24, 2, 3.514637, 35, 1

-25.50627, 24, 2, 3.498009, 34, 1

-25.33967, 24, 2, 3.481698, 34, 1

-25.17307, 24, 2, 3.473382, 34, 1

-25.00647, 24, 2, 3.45537, 34, 1

-24.83987, 23, 2, 3.436214, 34, 1

-24.67327, 23, 2, 3.416781, 34, 1

-24.50667, 23, 2, 3.387178, 33, 2

-24.34007, 23, 2, 3.387178, 33, 1

-24.17347, 23, 2, 3.367287, 33, 1

-24.00687, 23, 2, 3.347324, 33, 1

-23.84027, 22, 2, 3.327383, 33, 1

-23.67368, 22, 2, 3.307078, 33, 1

-23.50708, 22, 2, 3.296672, 32, 1

-23.34048, 22, 2, 3.276233, 32, 1

-23.17388, 22, 2, 3.255655, 32, 1

-23.00728, 22, 2, 3.235118, 32, 1

-22.84068, 21, 2, 3.224794, 32, 1

-22.67408, 21, 2, 3.20352, 32, 1

-22.50748, 21, 2, 3.183134, 31, 1

-22.34088, 21, 2, 3.163312, 31, 1

-22.17428, 21, 2, 3.144369, 31, 1

-22.00768, 21, 2, 3.126487, 31, 1

-21.84108, 20, 2, 3.117964, 31, 1

-21.67448, 20, 2, 3.10143, 31, 1

-21.50788, 20, 2, 3.085151, 30, 1

-21.34129, 20, 2, 3.070646, 30, 1

-21.17469, 20, 2, 3.05166, 30, 1

-21.00809, 20, 2, 3.05166, 30, 1

-20.84149, 19, 2, 3.03974, 30, 1

-20.67489, 19, 2, 3.027935, 30, 1

-20.50829, 19, 2, 3.01577, 30, 1

-20.34169, 19, 2, 3.003516, 30, 1

-20.17509, 19, 2, 2.997004, 29, 1

-20.00849, 19, 2, 2.982961, 29, 1

-19.84189, 18, 2, 2.968433, 29, 1

-19.67529, 18, 2, 2.953774, 29, 1

-19.50869, 18, 2, 2.946398, 29, 1

-19.34209, 18, 2, 2.931402, 29, 1

-19.1755, 18, 2, 2.915685, 29, 1

-19.0089, 18, 2, 2.899725, 28, 1

-18.8423, 17, 2, 2.884276, 28, 1

-18.6757, 17, 2, 2.868423, 28, 1

-18.5091, 17, 2, 2.860541, 28, 1

-18.3425, 17, 2, 2.844543, 28, 1

-18.1759, 17, 2, 2.828237, 28, 1

-18.0093, 17, 2, 2.812001, 28, 1

-17.8427, 16, 2, 2.795212, 27, 1

-17.6761, 16, 2, 2.786898, 27, 1

-17.5095, 16, 2, 2.770231, 27, 1

-17.3429, 16, 2, 2.75369, 27, 1

-17.1763, 16, 2, 2.737454, 27, 1

-17.0097, 16, 2, 2.721656, 27, 1

-16.84311, 15, 2, 2.713903, 27, 1

-16.67651, 15, 2, 2.698322, 26, 1

-16.50991, 15, 2, 2.683178, 26, 1

-16.34331, 15, 2, 2.66819, 26, 1

-16.17671, 15, 2, 2.653564, 26, 1

-16.01011, 15, 2, 2.646173, 26, 1

-15.84351, 14, 2, 2.631706, 26, 1

-15.67691, 14, 2, 2.617454, 26, 1

-15.51031, 14, 2, 2.603665, 26, 1

-15.34371, 14, 2, 2.589831, 25, 1

-15.17711, 14, 2, 2.583293, 25, 1

-15.01051, 14, 2, 2.57024, 25, 1

-14.84391, 13, 2, 2.557119, 25, 1

-14.67731, 13, 2, 2.544816, 25, 1

-14.51071, 13, 2, 2.532864, 25, 1

-14.34411, 13, 2, 2.527245, 25, 1

-14.17751, 13, 2, 2.515815, 25, 1

-14.01091, 13, 2, 2.504906, 25, 1

-13.84431, 12, 2, 2.494558, 24, 1

-13.6777, 12, 2, 2.485243, 24, 1

-13.5111, 12, 2, 2.480776, 24, 1

-13.3445, 12, 2, 2.472445, 24, 1

-13.1779, 12, 2, 2.464723, 24, 1

-13.0113, 12, 2, 2.456972, 24, 1

-12.8447, 11, 2, 2.449444, 24, 1

-12.6781, 11, 2, 2.446132, 24, 1

-12.5115, 11, 2, 2.439149, 24, 1

-12.3449, 11, 2, 2.432039, 24, 1

-12.1783, 11, 2, 2.424889, 24, 1

-12.0117, 11, 2, 2.41801, 24, 1

-11.8451, 10, 2, 2.410598, 24, 1

-11.6785, 10, 2, 2.407063, 24, 1

-11.5119, 10, 2, 2.399446, 23, 1

-11.3453, 10, 2, 2.392585, 23, 1

-11.1787, 10, 2, 2.385714, 23, 1

-11.0121, 10, 2, 2.382511, 23, 1

-10.8455, 9, 2, 2.376403, 23, 1

-10.6789, 9, 2, 2.368192, 23, 1

-10.5123, 9, 2, 2.365701, 23, 1

-10.3457, 9, 2, 2.360843, 23, 1

-10.1791, 9, 2, 2.358967, 23, 1

-10.0125, 9, 2, 2.3546, 23, 1

-9.8459, 8, 2, 2.350441, 23, 1

-9.679299, 8, 2, 2.346712, 23, 1

-9.512699, 8, 2, 2.342647, 23, 1

-9.346099, 8, 2, 2.340754, 23, 1

-9.179499, 8, 2, 2.336553, 23, 1

-9.012898, 8, 2, 2.332962, 23, 1

-8.846298, 7, 2, 2.329422, 23, 1

-8.679698, 7, 2, 2.325908, 23, 1

-8.513098, 7, 2, 2.324294, 23, 1

-8.346498, 7, 2, 2.320546, 23, 1

-8.179897, 7, 2, 2.317369, 23, 1

-8.013297, 7, 2, 2.314526, 23, 1

-7.846697, 6, 2, 2.312013, 23, 1

-7.680097, 6, 2, 2.310862, 23, 1

-7.513496, 6, 2, 2.308097, 23, 1

-7.346896, 6, 2, 2.305596, 23, 1

-7.180296, 6, 2, 2.303137, 23, 1

-7.013696, 6, 2, 2.30043, 23, 1

-6.847095, 5, 2, 2.29931, 22, 1

-6.680495, 5, 2, 2.29704, 22, 1

-6.513895, 5, 2, 2.294568, 22, 1

-6.347295, 5, 2, 2.292068, 22, 1

-6.180695, 5, 2, 2.290052, 22, 1

-6.014094, 5, 2, 2.289072, 22, 1

-5.847494, 4, 2, 2.286976, 22, 1

-5.680894, 4, 2, 2.28527, 22, 1

-5.514294, 4, 2, 2.283497, 22, 1

-5.347693, 4, 2, 2.282784, 22, 1

-5.181093, 4, 2, 2.282079, 22, 1

-5.014493, 4, 2, 2.280351, 22, 1

-4.847893, 3, 2, 2.2791, 22, 1

-4.681293, 3, 2, 2.277793, 22, 1

-4.514692, 3, 2, 2.276374, 22, 1

-4.348092, 3, 2, 2.275627, 22, 1

-4.181492, 3, 2, 2.274297, 22, 1

-4.014892, 3, 2, 2.2731, 22, 1

-3.848292, 2, 2, 2.2731, 22, 1

-3.681692, 2, 2, 2.2731, 22, 1

-3.515092, 2, 2, 2.2731, 22, 1

-3.348492, 2, 2, 2.2731, 22, 1

-3.181892, 2, 2, 2.26544, 22, 1

-3.015292, 2, 2, 2.263588, 22, 1

-2.848692, 1, 2, 2.260813, 22, 1

-2.682092, 1, 2, 2.259767, 22, 1

-2.515492, 1, 2, 2.256923, 22, 1

-2.348892, 1, 2, 2.254737, 22, 1

-2.182292, 1, 2, 2.25247, 22, 1

-2.015692, 1, 2, 2.250317, 22, 1

-1.849092, 0, 2, 2.248398, 22, 1

-1.682492, 0, 2, 2.247399, 22, 1

-1.515892, 0, 2, 2.245484, 22, 1

-1.349292, 0, 2, 2.242825, 22, 1

-1.182692, 0, 2, 2.240331, 22, 1

-1.016092, 0, 2, 2.237598, 22, 1

-0.8494918, -1, 2, 2.236245, 22, 1

-0.6828918, -1, 2, 2.233502, 22, 1

-0.5162919, -1, 2, 2.231233, 22, 1

-0.3496919, -1, 2, 2.229312, 22, 1

-0.1830919, -1, 2, 2.227868, 22, 1

-0.01649189, -1, 2, 2.227313, 22, 1

0.1501081, -1, 2, 2.226706, 22, 1

0.3167081, -1, 2, 2.227287, 22, 1

0.4833081, -1, 2, 2.227621, 22, 1

0.6499081, -1, 2, 2.228363, 22, 1

0.8165081, -1, 2, 2.22875, 22, 1

0.983108, -1, 2, 2.229492, 22, 1

1.149708, -2, 2, 2.230965, 22, 1

1.316308, -2, 2, 2.232891, 22, 1

1.482908, -2, 2, 2.233932, 22, 1

1.649508, -2, 2, 2.23603, 22, 1

1.816108, -2, 2, 2.238227, 22, 1

1.982708, -2, 2, 2.241697, 22, 1

2.149308, -3, 2, 2.242706, 22, 1

2.315908, -3, 2, 2.244757, 22, 1

2.482508, -3, 2, 2.245523, 22, 1

2.649108, -3, 2, 2.249767, 22, 1

2.815708, -3, 2, 2.251482, 22, 1

2.982308, -3, 2, 2.25152, 22, 1

3.148908, -4, 2, 2.251168, 22, 1

3.315508, -4, 2, 2.248841, 22, 1

3.482108, -4, 2, 2.247123, 22, 1

3.648708, -4, 2, 2.242823, 22, 1

3.815308, -4, 2, 2.238091, 22, 1

3.981908, -4, 2, 2.235459, 22, 1

4.148508, -5, 2, 2.230352, 22, 1

4.315108, -5, 2, 2.225023, 22, 1

4.481709, -5, 2, 2.219609, 22, 1

4.648309, -5, 2, 2.214311, 22, 1

4.814909, -5, 2, 2.211996, 22, 1

4.981509, -5, 2, 2.206474, 22, 1

5.148109, -6, 2, 2.200883, 22, 1

5.31471, -6, 2, 2.195284, 21, 1

5.48131, -6, 2, 2.18567, 21, 1

5.64791, -6, 2, 2.182531, 21, 1

5.81451, -6, 2, 2.179317, 21, 1

5.981111, -6, 2, 2.172611, 21, 1

6.147711, -7, 2, 2.165981, 21, 1

6.314311, -7, 2, 2.15699, 21, 1

6.480911, -7, 2, 2.153443, 21, 1

6.647511, -7, 2, 2.142988, 21, 1

6.814112, -7, 2, 2.134962, 21, 1

6.980712, -7, 2, 2.124903, 21, 1

7.147312, -8, 2, 2.111339, 21, 1

7.313912, -8, 2, 2.111339, 21, 1

7.480513, -8, 2, 2.101388, 21, 1

7.647113, -8, 2, 2.0917, 20, 1

7.813713, -8, 2, 2.081505, 20, 1

7.980313, -8, 2, 2.070158, 20, 1

8.146914, -9, 2, 2.058408, 20, 1

8.313514, -9, 2, 2.052573, 20, 1

8.480114, -9, 2, 2.039946, 20, 1

8.646714, -9, 2, 2.026996, 20, 1

8.813314, -9, 2, 2.013122, 20, 1

8.979915, -9, 2, 1.998621, 19, 1

9.146515, -10, 2, 1.990823, 19, 1

9.313115, -10, 2, 1.975733, 19, 1

9.479715, -10, 2, 1.959846, 19, 1

9.646316, -10, 2, 1.94318, 19, 1

9.812916, -10, 2, 1.92623, 19, 1

9.979516, -10, 2, 1.918002, 19, 1

10.14612, -11, 2, 1.900619, 19, 1

10.31272, -11, 2, 1.883847, 18, 1

10.47932, -11, 2, 1.867822, 18, 1

10.64592, -11, 2, 1.852757, 18, 1

10.81252, -11, 2, 1.844899, 18, 1

10.97912, -11, 2, 1.829744, 18, 1

11.14572, -12, 2, 1.813681, 18, 1

11.31232, -12, 2, 1.805159, 18, 1

11.47892, -12, 2, 1.780671, 17, 2

11.64552, -12, 2, 1.772769, 17, 1

11.81212, -12, 2, 1.756943, 17, 1

11.97872, -12, 2, 1.741276, 17, 1

12.14532, -13, 2, 1.725636, 17, 1

12.31192, -13, 2, 1.709321, 17, 1

12.47852, -13, 2, 1.701448, 17, 1

12.64512, -13, 2, 1.684599, 16, 1

12.81172, -13, 2, 1.667667, 16, 1

12.97832, -13, 2, 1.650597, 16, 1

13.14492, -14, 2, 1.633204, 16, 1

13.31152, -14, 2, 1.624615, 16, 1

13.47812, -14, 2, 1.606057, 16, 1

13.64472, -14, 2, 1.587463, 15, 1

13.81132, -14, 2, 1.568356, 15, 1

13.97792, -14, 2, 1.558685, 15, 1

14.14452, -15, 2, 1.529429, 15, 2

14.31112, -15, 2, 1.519938, 15, 1

14.47772, -15, 2, 1.500363, 15, 1

14.64432, -15, 2, 1.479444, 14, 1

14.81092, -15, 2, 1.469068, 14, 1

14.97752, -15, 2, 1.447999, 14, 1

15.14412, -16, 2, 1.427298, 14, 1

15.31072, -16, 2, 1.406037, 14, 1

15.47732, -16, 2, 1.384057, 13, 1

15.64392, -16, 2, 1.372051, 13, 1

15.81052, -16, 2, 1.338457, 13, 2

15.97712, -16, 2, 1.327621, 13, 1

16.14372, -17, 2, 1.305838, 13, 1

16.31032, -17, 2, 1.285051, 12, 1

16.47692, -17, 2, 1.264768, 12, 1

16.64352, -17, 2, 1.254535, 12, 1

16.81012, -17, 2, 1.233548, 12, 1

16.97672, -17, 2, 1.213682, 12, 1

17.14332, -18, 2, 1.193894, 11, 1

17.30992, -18, 2, 1.173934, 11, 1

17.47652, -18, 2, 1.164408, 11, 1

17.64312, -18, 2, 1.14508, 11, 1

17.80972, -18, 2, 1.125376, 11, 1

17.97632, -18, 2, 1.106306, 11, 1

18.14292, -19, 2, 1.087706, 10, 1

18.30951, -19, 2, 1.078878, 10, 1

18.47611, -19, 2, 1.061209, 10, 1

18.64271, -19, 2, 1.042721, 10, 1

18.80931, -19, 2, 1.023896, 10, 1

18.97591, -19, 2, 1.00449, 10, 1

19.14251, -20, 2, 0.9944222, 9, 1

19.30911, -20, 2, 0.9646485, 9, 2

19.47571, -20, 2, 0.9549379, 9, 1

19.64231, -20, 2, 0.935636, 9, 1

19.80891, -20, 2, 0.9158957, 9, 1

19.97551, -20, 2, 0.906394, 9, 1

20.14211, -21, 2, 0.8854103, 8, 1

20.30871, -21, 2, 0.8639469, 8, 1

20.47531, -21, 2, 0.8436282, 8, 1

20.6419, -21, 2, 0.8223028, 8, 1

20.8085, -21, 2, 0.8121963, 8, 1

20.9751, -21, 2, 0.7811058, 7, 2

21.1417, -22, 2, 0.7701426, 7, 1

21.3083, -22, 2, 0.7497482, 7, 1

21.4749, -22, 2, 0.7285738, 7, 1

21.6415, -22, 2, 0.7180476, 7, 1

21.8081, -22, 2, 0.6971908, 6, 1

21.9747, -22, 2, 0.6768849, 6, 1

22.1413, -23, 2, 0.6568713, 6, 1

22.3079, -23, 2, 0.6370468, 6, 1

22.4745, -23, 2, 0.6270914, 6, 1

22.6411, -23, 2, 0.607307, 6, 1

22.8077, -23, 2, 0.5878596, 5, 1

22.97429, -23, 2, 0.5687394, 5, 1

23.14089, -24, 2, 0.5486281, 5, 1

23.30749, -24, 2, 0.5387156, 5, 1

23.47409, -24, 2, 0.5183473, 5, 1

23.64069, -24, 2, 0.4981027, 4, 1

23.80729, -24, 2, 0.4776006, 4, 1

23.97389, -24, 2, 0.4662948, 4, 1

24.14049, -25, 2, 0.4455183, 4, 1

24.30709, -25, 2, 0.4236417, 4, 1

24.47369, -25, 2, 0.4023521, 4, 1

24.64029, -25, 2, 0.38118, 3, 1

24.80689, -25, 2, 0.3599031, 3, 1

24.97349, -25, 2, 0.3488576, 3, 1

25.14009, -26, 2, 0.3260717, 3, 2

25.30668, -26, 2, 0.303333, 3, 2

25.47328, -26, 2, 0.2815454, 2, 1

25.63988, -26, 2, 0.2595253, 2, 2

25.80648, -26, 2, 0.248122, 2, 1

25.97308, -26, 2, 0.2257032, 2, 2

26.13968, -27, 2, 0.1918366, 1, 2

26.30628, -27, 2, 0.1805775, 1, 1

26.47288, -27, 2, 0.1694357, 1, 1

26.63948, -27, 2, 0.1478264, 1, 1

26.80608, -27, 2, 0.1260641, 1, 1

26.97268, -27, 2, 0.1153288, 1, 1

27.13928, -28, 2, 0.09453416, 0, 1

27.30588, -28, 2, 0.07367325, 0, 1

27.47248, -28, 2, 0.05443716, 0, 1

27.63907, -28, 2, 0.04441381, 0, 1

27.80567, -28, 2, 0.02444315, 0, 1

27.97227, -28, 2, -0.005321503, 0, 2

28.13887, -29, 2, -0.01529026, 0, 1

28.30547, -29, 2, -0.04465628, 0, 2

28.47207, -29, 2, -0.05448961, 0, 1

28.63867, -29, 2, -0.07454729, 0, 1

28.80527, -29, 2, -0.09439754, 0, 1

28.97187, -29, 2, -0.1142504, -1, 1

29.13847, -30, 2, -0.1245177, -1, 1

29.30507, -30, 2, -0.1447062, -1, 1

29.47167, -30, 2, -0.1648164, -1, 1

29.63827, -30, 2, -0.1939058, -1, 2

29.80486, -30, 2, -0.2034571, -2, 1

29.97146, -30, 2, -0.2237077, -2, 1

30.13806, -31, 2, -0.2338915, -2, 1

30.30466, -31, 2, -0.2545671, -2, 1

30.47126, -31, 2, -0.2740638, -2, 1

30.63786, -31, 2, -0.2941215, -2, 1

30.80446, -31, 2, -0.3148661, -3, 1

30.97106, -31, 2, -0.3245642, -3, 1

31.13766, -32, 2, -0.3438206, -3, 1

31.30426, -32, 2, -0.3645256, -3, 1

31.47086, -32, 2, -0.3841369, -3, 1

31.63746, -32, 2, -0.40416, -4, 1

31.80406, -32, 2, -0.4152162, -4, 1

31.97066, -32, 2, -0.4342327, -4, 1

32.13726, -33, 2, -0.4545221, -4, 1

32.30386, -33, 2, -0.4729385, -4, 1

32.47046, -33, 2, -0.4828272, -4, 1

32.63705, -33, 2, -0.501061, -5, 1

32.80365, -33, 2, -0.5214298, -5, 1

32.97025, -33, 2, -0.5407162, -5, 1

33.13685, -34, 2, -0.557775, -5, 1

33.30345, -34, 2, -0.567421, -5, 1

33.47005, -34, 2, -0.5848498, -5, 1

33.63665, -34, 2, -0.6028819, -6, 1

33.80325, -34, 2, -0.6210713, -6, 1

33.96985, -34, 2, -0.6382556, -6, 1

34.13645, -35, 2, -0.6478038, -6, 1

34.30305, -35, 2, -0.6658287, -6, 1

34.46965, -35, 2, -0.6836786, -6, 1

34.63625, -35, 2, -0.7015829, -7, 1

34.80285, -35, 2, -0.7100844, -7, 1

34.96944, -35, 2, -0.7271247, -7, 1

35.13604, -36, 2, -0.7436242, -7, 1

35.30264, -36, 2, -0.7593551, -7, 1

35.46924, -36, 2, -0.7751374, -7, 1

35.63584, -36, 2, -0.7907319, -7, 1

35.80244, -36, 2, -0.8058934, -8, 1

35.96904, -36, 2, -0.8136392, -8, 1

36.13564, -37, 2, -0.8212132, -8, 1

36.30224, -37, 2, -0.8435616, -8, 2

36.46884, -37, 2, -0.858932, -8, 1

36.63544, -37, 2, -0.8744202, -8, 1

36.80204, -37, 2, -0.8822765, -8, 1

36.96864, -37, 2, -0.8979449, -8, 1

37.13523, -38, 2, -0.9125156, -9, 1

37.30183, -38, 2, -0.9271445, -9, 1

37.46843, -38, 2, -0.9342818, -9, 1

37.63503, -38, 2, -0.9488158, -9, 1

37.80163, -38, 2, -0.9633842, -9, 1

37.96823, -38, 2, -0.9777336, -9, 1

38.13483, -39, 2, -0.9928203, -9, 1

38.30143, -39, 2, -1.015464, -10, 2

38.46803, -39, 2, -1.015464, -10, 1

38.63463, -39, 2, -1.030031, -10, 1

38.80123, -39, 2, -1.044772, -10, 1

38.96783, -39, 2, -1.059884, -10, 1

39.13443, -40, 2, -1.067145, -10, 1

39.30103, -40, 2, -1.082026, -10, 1

39.46762, -40, 2, -1.096927, -10, 1

39.63422, -40, 2, -1.111425, -11, 1

39.80082, -40, 2, -1.126165, -11, 1

39.96742, -40, 2, -1.133157, -11, 1

40.13402, -41, 2, -1.147098, -11, 1

40.30062, -41, 2, -1.1612, -11, 1

40.46722, -41, 2, -1.175621, -11, 1

40.63382, -41, 2, -1.190816, -11, 1

40.80042, -41, 2, -1.197966, -11, 1

40.96702, -41, 2, -1.212298, -12, 1

41.13362, -42, 2, -1.226794, -12, 1

41.30022, -42, 2, -1.240748, -12, 1

41.46682, -42, 2, -1.254128, -12, 1

41.63342, -42, 2, -1.260543, -12, 1

41.80001, -42, 2, -1.272714, -12, 1

41.96661, -42, 2, -1.284801, -12, 1

42.13321, -43, 2, -1.297204, -12, 1

42.29981, -43, 2, -1.309247, -13, 1

42.46641, -43, 2, -1.314735, -13, 1

42.63301, -43, 2, -1.325605, -13, 1

42.79961, -43, 2, -1.33619, -13, 1

42.96621, -43, 2, -1.346165, -13, 1

43.13281, -44, 2, -1.356777, -13, 1

43.29941, -44, 2, -1.361727, -13, 1

43.46601, -44, 2, -1.377272, -13, 1

43.63261, -44, 2, -1.382952, -13, 1

43.79921, -44, 2, -1.393416, -13, 1

43.96581, -44, 2, -1.403869, -14, 1

44.1324, -45, 2, -1.413895, -14, 1

44.299, -45, 2, -1.418877, -14, 1

44.4656, -45, 2, -1.429121, -14, 1

44.6322, -45, 2, -1.43943, -14, 1

44.7988, -45, 2, -1.449809, -14, 1

44.9654, -45, 2, -1.459839, -14, 1

45.132, -46, 2, -1.464382, -14, 1

45.2986, -46, 2, -1.4745, -14, 1

45.4652, -46, 2, -1.484686, -14, 1

45.6318, -46, 2, -1.495141, -14, 1

45.7984, -46, 2, -1.505359, -15, 1

45.965, -46, 2, -1.510767, -15, 1

46.1316, -47, 2, -1.521637, -15, 1

46.29819, -47, 2, -1.532842, -15, 1

46.46479, -47, 2, -1.544791, -15, 1

46.63139, -47, 2, -1.556393, -15, 1

46.79799, -47, 2, -1.562753, -15, 1

46.96459, -47, 2, -1.575589, -15, 1

47.13119, -48, 2, -1.587767, -15, 1

47.29779, -48, 2, -1.600404, -16, 1

47.46439, -48, 2, -1.606284, -16, 1

47.63099, -48, 2, -1.618673, -16, 1

47.79759, -48, 2, -1.630674, -16, 1

47.96419, -48, 2, -1.642751, -16, 1

48.13079, -49, 2, -1.655312, -16, 1

48.29739, -49, 2, -1.666816, -16, 1

48.46399, -49, 2, -1.672513, -16, 1

48.63058, -49, 2, -1.682475, -16, 1

48.79718, -49, 2, -1.692327, -16, 1

48.96378, -49, 2, -1.701551, -17, 1

49.13038, -50, 2, -1.71054, -17, 1

49.29698, -50, 2, -1.713967, -17, 1

49.46358, -50, 2, -1.721628, -17, 1

49.63018, -50, 2, -1.728523, -17, 1

49.79678, -50, 2, -1.734586, -17, 1

49.96338, -50, 2, -1.740619, -17, 1

50.12998, -51, 2, -1.743603, -17, 1

50.29658, -51, 2, -1.749199, -17, 1

50.46318, -51, 2, -1.753587, -17, 1

50.62978, -51, 2, -1.757503, -17, 1

50.79638, -51, 2, -1.762049, -17, 1

50.96297, -51, 2, -1.763531, -17, 1

51.12957, -52, 2, -1.766246, -17, 1

51.29617, -52, 2, -1.769406, -17, 1

51.46277, -52, 2, -1.771565, -17, 1

51.62937, -52, 2, -1.773441, -17, 1

51.79597, -52, 2, -1.773811, -17, 1

51.96257, -52, 2, -1.775279, -17, 1

52.12917, -53, 2, -1.776017, -17, 1

52.29577, -53, 2, -1.777449, -17, 1

52.46237, -53, 2, -1.779022, -17, 1

52.62897, -53, 2, -1.779498, -17, 1

52.79557, -53, 2, -1.780159, -17, 1

52.96217, -53, 2, -1.780873, -17, 1

53.12877, -54, 2, -1.781555, -17, 1

53.29536, -54, 2, -1.782289, -17, 1

53.46196, -54, 2, -1.782686, -17, 1

53.62856, -54, 2, -1.783726, -17, 1

53.79516, -54, 2, -1.785128, -17, 1

53.96176, -54, 2, -1.785631, -17, 1

54.12836, -55, 2, -1.78684, -17, 1

54.29496, -55, 2, -1.787443, -17, 1

54.46156, -55, 2, -1.788631, -17, 1

54.62816, -55, 2, -1.789836, -17, 1

54.79476, -55, 2, -1.791051, -17, 1

54.96136, -55, 2, -1.792422, -17, 1

55.12796, -56, 2, -1.793036, -17, 1

55.29456, -56, 2, -1.794275, -17, 1

55.46115, -56, 2, -1.79534, -17, 1

55.62775, -56, 2, -1.796364, -17, 1

55.79435, -56, 2, -1.797499, -17, 1

55.96095, -56, 2, -1.797751, -17, 1

56.12755, -57, 2, -1.798671, -17, 1

56.29415, -57, 2, -1.799303, -17, 1

56.46075, -57, 2, -1.800012, -18, 1

56.62735, -57, 2, -1.800955, -18, 1

56.79395, -57, 2, -1.80127, -18, 1

56.96055, -57, 2, -1.801946, -18, 1

57.12715, -58, 2, -1.802661, -18, 1

57.29375, -58, 2, -1.803435, -18, 1

57.46035, -58, 2, -1.804038, -18, 1

57.62695, -58, 2, -1.804391, -18, 1

57.79354, -58, 2, -1.804818, -18, 1

57.96014, -58, 2, -1.805176, -18, 1

58.12674, -59, 2, -1.805515, -18, 1

58.29334, -59, 2, -1.80578, -18, 1

58.45994, -59, 2, -1.805999, -18, 1

58.62654, -59, 2, -1.80628, -18, 1

58.79314, -59, 2, -1.806653, -18, 1

58.95974, -59, 2, -1.807178, -18, 1

59.12634, -60, 2, -1.807608, -18, 1

59.29294, -60, 2, -1.807867, -18, 1

59.45954, -60, 2, -1.808268, -18, 1

59.62614, -60, 2, -1.808491, -18, 1

59.79274, -60, 2, -1.808552, -18, 1

59.95934, -60, 2, -1.808531, -18, 1

60.12593, -61, 2, -1.808525, -18, 1

60.29253, -61, 2, -1.808286, -18, 1

60.45913, -61, 2, -1.807908, -18, 1

60.62573, -61, 2, -1.807232, -18, 1

60.79233, -61, 2, -1.80688, -18, 1

60.95893, -61, 2, -1.806684, -18, 1

61.12553, -62, 2, -1.806093, -18, 1

61.29213, -62, 2, -1.805308, -18, 1

61.45873, -62, 2, -1.804348, -18, 1

61.62533, -62, 2, -1.803642, -18, 1

61.79193, -62, 2, -1.803101, -18, 1

61.95853, -62, 2, -1.802367, -18, 1

62.12513, -63, 2, -1.801893, -18, 1

