car_pos_meter , car_pos_cell, car_speed, ped_pos_meter, ped_pos_cell, ped_speed
-10.25, 10, 2, 4.083856, 11, 1
-9.875152, 9, 2, 3.939691, 10, 1
-7.792661, 7, 2, 3.199472, 8, 1
-5.71017, 5, 2, 2.189671, 5, 1
-3.627676, 3, 1, 1.288996, 3, 1
-3.340179, 3, 2, 0.4590397, 1, 1
-1.257677, 1, 2, -0.1496677, 0, 1
0.8248236, 0, 2, -0.7512188, -2, 1
2.907326, -2, 2, -0.7407894, -2, 1
4.989823, -4, 2, -0.8323336, -2, 1
