car_pos_meter , car_pos_cell, car_speed, ped_pos_meter, ped_pos_cell, ped_speed
-25.625, 25, 2, 4.088034, 26, 1
-25.52088, 25, 2, 4.082169, 26, 1
-25.41675, 25, 2, 4.070674, 26, 1
-25.31263, 25, 2, 4.059423, 26, 1
-25.2085, 25, 2, 4.048969, 26, 1
-25.10438, 25, 2, 4.039398, 26, 1
-25.00025, 25, 2, 4.030404, 26, 1
-24.89613, 24, 2, 4.026016, 26, 1
-24.792, 24, 2, 4.017436, 26, 1
-24.68788, 24, 2, 4.009075, 26, 1
-24.58375, 24, 2, 4.001761, 26, 1
-24.47963, 24, 2, 3.998327, 25, 1
-24.37551, 24, 2, 3.992125, 25, 1
-24.27138, 24, 2, 3.986403, 25, 1
-24.16726, 24, 2, 3.981003, 25, 1
-24.06313, 24, 2, 3.975952, 25, 1
-23.95901, 23, 2, 3.973358, 25, 1
-23.85488, 23, 2, 3.968066, 25, 1
-23.75076, 23, 2, 3.962511, 25, 1
-23.64663, 23, 2, 3.956723, 25, 1
-23.54251, 23, 2, 3.950635, 25, 1
-23.43839, 23, 2, 3.944251, 25, 1
-23.33426, 23, 2, 3.940898, 25, 1
-23.23013, 23, 2, 3.934209, 25, 1
-23.12601, 23, 2, 3.927605, 25, 1
-23.02189, 23, 2, 3.921175, 25, 1
-22.91776, 22, 2, 3.918041, 25, 1
-22.81364, 22, 2, 3.911746, 25, 1
-22.70951, 22, 2, 3.905564, 25, 1
-22.60539, 22, 2, 3.899481, 25, 1
-22.50126, 22, 2, 3.893323, 25, 1
-22.39714, 22, 2, 3.890224, 25, 1
-22.29301, 22, 2, 3.883799, 25, 1
-22.18889, 22, 2, 3.877357, 25, 1
-22.08476, 22, 2, 3.870997, 25, 1
-21.98064, 21, 2, 3.864151, 25, 1
-21.87652, 21, 2, 3.860794, 25, 1
-21.77239, 21, 2, 3.853777, 25, 1
-21.66827, 21, 2, 3.846493, 25, 1
-21.56414, 21, 2, 3.838968, 24, 1
-21.46002, 21, 2, 3.831097, 24, 1
-21.35589, 21, 2, 3.826993, 24, 1
-21.25177, 21, 2, 3.818954, 24, 1
-21.14764, 21, 2, 3.8107, 24, 1
-21.04352, 21, 2, 3.802522, 24, 1
-20.9394, 20, 2, 3.794137, 24, 1
-20.83527, 20, 2, 3.789843, 24, 1
-20.73115, 20, 2, 3.781581, 24, 1
-20.62702, 20, 2, 3.77342, 24, 1
-20.5229, 20, 2, 3.765661, 24, 1
-20.41877, 20, 2, 3.758163, 24, 1
-20.31465, 20, 2, 3.754363, 24, 1
-20.21052, 20, 2, 3.746964, 24, 1
-20.1064, 20, 2, 3.739617, 24, 1
-20.00227, 20, 2, 3.73213, 24, 1
-19.89815, 19, 2, 3.724589, 24, 1
-19.79403, 19, 2, 3.720685, 24, 1
-19.6899, 19, 2, 3.713346, 24, 1
-19.58578, 19, 2, 3.706156, 24, 1
-19.48165, 19, 2, 3.698975, 24, 1
-19.37753, 19, 2, 3.692013, 23, 1
-19.2734, 19, 2, 3.688664, 23, 1
-19.16928, 19, 2, 3.682376, 23, 1
-19.06515, 19, 2, 3.676208, 23, 1
-18.96103, 18, 2, 3.670356, 23, 1
-18.8569, 18, 2, 3.664865, 23, 1
-18.75278, 18, 2, 3.66233, 23, 1
-18.64865, 18, 2, 3.657632, 23, 1
-18.54453, 18, 2, 3.652864, 23, 1
-18.44041, 18, 2, 3.64809, 23, 1
-18.33628, 18, 2, 3.6434, 23, 1
-18.23216, 18, 2, 3.641003, 23, 1
-18.12803, 18, 2, 3.636214, 23, 1
-18.02391, 18, 2, 3.631183, 23, 1
-17.91978, 17, 2, 3.626164, 23, 1
-17.81566, 17, 2, 3.621178, 23, 1
-17.71153, 17, 2, 3.618675, 23, 1
-17.60741, 17, 2, 3.613726, 23, 1
-17.50328, 17, 2, 3.60937, 23, 1
-17.39916, 17, 2, 3.605827, 23, 1
-17.29504, 17, 2, 3.602569, 23, 1
-17.19091, 17, 2, 3.599756, 23, 1
-17.08679, 17, 2, 3.598644, 23, 1
-16.98266, 16, 2, 3.59652, 23, 1
-16.87854, 16, 2, 3.594913, 23, 1
-16.77441, 16, 2, 3.593387, 23, 1
-16.67029, 16, 2, 3.592846, 23, 1
-16.56616, 16, 2, 3.591494, 23, 1
-16.46204, 16, 2, 3.590025, 23, 1
-16.35792, 16, 2, 3.588272, 23, 1
-16.25379, 16, 2, 3.586171, 23, 1
-16.14967, 16, 2, 3.583648, 23, 1
-16.04554, 16, 2, 3.58215, 23, 1
-15.94142, 15, 2, 3.578781, 23, 1
-15.83729, 15, 2, 3.575296, 23, 1
-15.73317, 15, 2, 3.571198, 23, 1
-15.62904, 15, 2, 3.569144, 23, 1
-15.52492, 15, 2, 3.563366, 23, 1
-15.42079, 15, 2, 3.561322, 23, 1
-15.31667, 15, 2, 3.55795, 23, 1
-15.21255, 15, 2, 3.554848, 23, 1
-15.10842, 15, 2, 3.551798, 23, 1
-15.0043, 15, 2, 3.549057, 23, 1
-14.90017, 14, 2, 3.547677, 23, 1
-14.79605, 14, 2, 3.545052, 23, 1
-14.69192, 14, 2, 3.542166, 23, 1
-14.5878, 14, 2, 3.539053, 23, 1
-14.48367, 14, 2, 3.535956, 22, 1
-14.37955, 14, 2, 3.534238, 22, 1
-14.27542, 14, 2, 3.531127, 22, 1
-14.1713, 14, 2, 3.52812, 22, 1
-14.06717, 14, 2, 3.525048, 22, 1
-13.96305, 13, 2, 3.522174, 22, 1
-13.85893, 13, 2, 3.520788, 22, 1
-13.7548, 13, 2, 3.518205, 22, 1
-13.65068, 13, 2, 3.515772, 22, 1
-13.54655, 13, 2, 3.513768, 22, 1
-13.44243, 13, 2, 3.512978, 22, 1
-13.3383, 13, 2, 3.511515, 22, 1
-13.23418, 13, 2, 3.51018, 22, 1
-13.13005, 13, 2, 3.50879, 22, 1
-13.02593, 13, 2, 3.507357, 22, 1
-12.92181, 12, 2, 3.506602, 22, 1
-12.81768, 12, 2, 3.505349, 22, 1
-12.71356, 12, 2, 3.504183, 22, 1
-12.60943, 12, 2, 3.502802, 22, 1
-12.50531, 12, 2, 3.501409, 22, 1
-12.40118, 12, 2, 3.500657, 22, 1
-12.29706, 12, 2, 3.499125, 22, 1
-12.19293, 12, 2, 3.497754, 22, 1
-12.08881, 12, 2, 3.495985, 22, 1
-11.98468, 11, 2, 3.493984, 22, 1
-11.88056, 11, 2, 3.492922, 22, 1
-11.77643, 11, 2, 3.491132, 22, 1
-11.67231, 11, 2, 3.489675, 22, 1
-11.56819, 11, 2, 3.488397, 22, 1
-11.46406, 11, 2, 3.487273, 22, 1
-11.35994, 11, 2, 3.486807, 22, 1
-11.25581, 11, 2, 3.485737, 22, 1
-11.15169, 11, 2, 3.485019, 22, 1
-11.04756, 11, 2, 3.484168, 22, 1
-10.94344, 10, 2, 3.48347, 22, 1
-10.83931, 10, 2, 3.483186, 22, 1
-10.73519, 10, 2, 3.482405, 22, 1
-10.63107, 10, 2, 3.481784, 22, 1
-10.52694, 10, 2, 3.480814, 22, 1
-10.42282, 10, 2, 3.480165, 22, 1
-10.31869, 10, 2, 3.479778, 22, 1
-10.21457, 10, 2, 3.47882, 22, 1
-10.11044, 10, 2, 3.477973, 22, 1
-10.00632, 10, 2, 3.476911, 22, 1
-9.902192, 9, 2, 3.47589, 22, 1
-9.798067, 9, 2, 3.475473, 22, 1
-9.693942, 9, 2, 3.474362, 22, 1
-9.589817, 9, 2, 3.473336, 22, 1
-9.485692, 9, 2, 3.471915, 22, 1
-9.381566, 9, 2, 3.470507, 22, 1
-9.277441, 9, 2, 3.469768, 22, 1
-9.173316, 9, 2, 3.468029, 22, 1
-9.069191, 9, 2, 3.466698, 22, 1
-8.965066, 8, 2, 3.465024, 22, 1
-8.860941, 8, 2, 3.463276, 22, 1
-8.756816, 8, 2, 3.462256, 22, 1
-8.652691, 8, 2, 3.460189, 22, 1
-8.548565, 8, 2, 3.458153, 22, 1
-8.44444, 8, 2, 3.455976, 22, 1
-8.340315, 8, 2, 3.453782, 22, 1
-8.23619, 8, 2, 3.45273, 22, 1
-8.132065, 8, 2, 3.450661, 22, 1
-8.02794, 8, 2, 3.44869, 22, 1
-7.923815, 7, 2, 3.446637, 22, 1
-7.819689, 7, 2, 3.444567, 22, 1
-7.715564, 7, 2, 3.443573, 22, 1
-7.611439, 7, 2, 3.441431, 22, 1
-7.507314, 7, 2, 3.43929, 22, 1
-7.403189, 7, 2, 3.437395, 22, 1
-7.299064, 7, 2, 3.436593, 22, 1
-7.194939, 7, 2, 3.434568, 22, 1
-7.090814, 7, 2, 3.432815, 22, 1
-6.986688, 6, 2, 3.431105, 22, 1
-6.882563, 6, 2, 3.429194, 22, 1
-6.778438, 6, 2, 3.427348, 22, 1
-6.674313, 6, 2, 3.426632, 22, 1
-6.570188, 6, 2, 3.424948, 22, 1
-6.466063, 6, 2, 3.42332, 22, 1
-6.361938, 6, 2, 3.421556, 22, 1
-6.257813, 6, 2, 3.419759, 22, 1
-6.153687, 6, 2, 3.419069, 22, 1
-6.049562, 6, 2, 3.417208, 22, 1
-5.945437, 5, 2, 3.415404, 22, 1
-5.841312, 5, 2, 3.413535, 22, 1
-5.737186, 5, 2, 3.411749, 22, 1
-5.633061, 5, 2, 3.410818, 22, 1
-5.528936, 5, 2, 3.409202, 22, 1
-5.424811, 5, 2, 3.40774, 22, 1
-5.320686, 5, 2, 3.406127, 22, 1
-5.216561, 5, 2, 3.404494, 22, 1
-5.112436, 5, 2, 3.403551, 22, 1
-5.008311, 5, 2, 3.401688, 22, 1
-4.904185, 4, 2, 3.400036, 22, 1
-4.80006, 4, 2, 3.398407, 22, 1
-4.695935, 4, 2, 3.396591, 22, 1
-4.59181, 4, 2, 3.395705, 22, 1
-4.487685, 4, 2, 3.39361, 22, 1
-4.38356, 4, 2, 3.39198, 22, 1
-4.279435, 4, 2, 3.389876, 22, 1
-4.17531, 4, 2, 3.387794, 22, 1
-4.071184, 4, 2, 3.386835, 22, 1
-3.967059, 3, 2, 3.384781, 22, 1
-3.862934, 3, 2, 3.382908, 21, 1
-3.758809, 3, 2, 3.380822, 21, 1
-3.654684, 3, 2, 3.378882, 21, 1
-3.550559, 3, 2, 3.377908, 21, 1
-3.446434, 3, 2, 3.375904, 21, 1
-3.342308, 3, 2, 3.373871, 21, 1
-3.238183, 3, 2, 3.371979, 21, 1
-3.134058, 3, 2, 3.369923, 21, 1
-3.029933, 3, 2, 3.368919, 21, 1
-2.925808, 2, 2, 3.366389, 21, 1
-2.821683, 2, 2, 3.364142, 21, 1
-2.717557, 2, 2, 3.361888, 21, 1
-2.613432, 2, 2, 3.359808, 21, 1
-2.509308, 2, 2, 3.358879, 21, 1
-2.405182, 2, 2, 3.356908, 21, 1
-2.301057, 2, 2, 3.355032, 21, 1
-2.196932, 2, 2, 3.352795, 21, 1
-2.092807, 2, 2, 3.350135, 21, 1
-1.988682, 1, 2, 3.348989, 21, 1
-1.884557, 1, 2, 3.346243, 21, 1
-1.780432, 1, 2, 3.343844, 21, 1
-1.676307, 1, 2, 3.340936, 21, 1
-1.572182, 1, 2, 3.338237, 21, 1
-1.468058, 1, 2, 3.336854, 21, 1
-1.363932, 1, 2, 3.333688, 21, 1
-1.259807, 1, 2, 3.331205, 21, 1
-1.155682, 1, 2, 3.328534, 21, 1
-1.051558, 1, 2, 3.325876, 21, 1
-0.9474325, 0, 2, 3.324709, 21, 1
-0.8433075, 0, 2, 3.32218, 21, 1
-0.7391825, 0, 2, 3.320141, 21, 1
-0.6350575, 0, 2, 3.31756, 21, 1
-0.5309325, 0, 2, 3.315199, 21, 1
-0.4268076, 0, 2, 3.314256, 21, 1
-0.3226826, 0, 2, 3.312301, 21, 1
-0.2185576, 0, 2, 3.310626, 21, 1
-0.1144326, 0, 2, 3.309069, 21, 1
-0.01030759, 0, 2, 3.307828, 21, 1
0.09381741, 0, 2, 3.30757, 21, 1
0.1979424, 0, 2, 3.306566, 21, 1
0.3020674, 0, 2, 3.30576, 21, 1
0.4061924, 0, 2, 3.305448, 21, 1
0.5103174, 0, 2, 3.304955, 21, 1
0.6144423, 0, 2, 3.304348, 21, 1
0.7185674, 0, 2, 3.303627, 21, 1
0.8226923, 0, 2, 3.302886, 21, 1
0.9268174, 0, 2, 3.302217, 21, 1
1.030942, -1, 2, 3.301549, 21, 1
1.135067, -1, 2, 3.301125, 21, 1
1.239192, -1, 2, 3.298678, 21, 1
1.343317, -1, 2, 3.296348, 21, 1
1.447442, -1, 2, 3.292971, 21, 1
1.551567, -1, 2, 3.288877, 21, 1
1.655692, -1, 2, 3.286562, 21, 1
1.759817, -1, 2, 3.281374, 21, 1
1.863942, -1, 2, 3.275232, 21, 1
1.968067, -1, 2, 3.268224, 21, 1
2.072192, -2, 2, 3.260651, 21, 1
2.176317, -2, 2, 3.256495, 21, 1
2.280442, -2, 2, 3.248222, 21, 1
2.384567, -2, 2, 3.239821, 21, 1
2.488692, -2, 2, 3.230881, 21, 1
2.592818, -2, 2, 3.221901, 20, 1
2.696943, -2, 2, 3.217357, 20, 1
2.801068, -2, 2, 3.207511, 20, 1
2.905193, -2, 2, 3.197096, 20, 1
3.009318, -3, 2, 3.186322, 20, 1
3.113443, -3, 2, 3.174896, 20, 1
3.217568, -3, 2, 3.169204, 20, 1
3.321693, -3, 2, 3.157198, 20, 1
3.425819, -3, 2, 3.145408, 20, 1
3.529944, -3, 2, 3.133332, 20, 1
3.634069, -3, 2, 3.120977, 20, 1
3.738194, -3, 2, 3.115043, 20, 1
3.842319, -3, 2, 3.101329, 20, 1
3.946444, -3, 2, 3.087961, 20, 1
4.05057, -4, 2, 3.073913, 19, 1
4.154695, -4, 2, 3.058707, 19, 1
4.25882, -4, 2, 3.051374, 19, 1
4.362945, -4, 2, 3.037777, 19, 1
4.46707, -4, 2, 3.025313, 19, 1
4.571195, -4, 2, 3.013216, 19, 1
4.67532, -4, 2, 3.001788, 19, 1
4.779446, -4, 2, 2.97725, 19, 1
4.883571, -4, 2, 2.960551, 19, 1
4.987696, -4, 2, 2.953825, 19, 1
5.091821, -5, 2, 2.939003, 19, 1
5.195946, -5, 2, 2.923835, 19, 1
5.300071, -5, 2, 2.909279, 18, 1
5.404196, -5, 2, 2.894365, 18, 1
5.508321, -5, 2, 2.887254, 18, 1
5.612447, -5, 2, 2.871391, 18, 1
5.716572, -5, 2, 2.855263, 18, 1
5.820697, -5, 2, 2.839445, 18, 1
5.924822, -5, 2, 2.822453, 18, 1
6.028947, -6, 2, 2.813987, 18, 1
6.133072, -6, 2, 2.796743, 18, 1
6.237197, -6, 2, 2.779611, 18, 1
6.341322, -6, 2, 2.761517, 17, 1
6.445448, -6, 2, 2.743117, 17, 1
6.549573, -6, 2, 2.733716, 17, 1
6.653698, -6, 2, 2.714627, 17, 1
6.757823, -6, 2, 2.694302, 17, 1
6.861948, -6, 2, 2.673602, 17, 1
6.966074, -6, 2, 2.662997, 17, 1
7.070199, -7, 2, 2.641743, 17, 1
7.174324, -7, 2, 2.620687, 17, 1
7.278449, -7, 2, 2.601924, 16, 1
7.382574, -7, 2, 2.593071, 16, 1
7.486699, -7, 2, 2.575696, 16, 1
7.590824, -7, 2, 2.55826, 16, 1
7.69495, -7, 2, 2.540846, 16, 1
7.799075, -7, 2, 2.524274, 16, 1
7.9032, -7, 2, 2.515668, 16, 1
8.007325, -8, 2, 2.499625, 16, 1
8.11145, -8, 2, 2.484117, 16, 1
8.215575, -8, 2, 2.468363, 16, 1
8.3197, -8, 2, 2.45303, 15, 1
8.423825, -8, 2, 2.437092, 15, 1
8.52795, -8, 2, 2.429271, 15, 1
8.632075, -8, 2, 2.41291, 15, 1
8.7362, -8, 2, 2.396377, 15, 1
8.840326, -8, 2, 2.379744, 15, 1
8.944451, -8, 2, 2.362511, 15, 1
9.048576, -9, 2, 2.354065, 15, 1
9.152701, -9, 2, 2.336757, 15, 1
9.256826, -9, 2, 2.3193, 15, 1
9.360951, -9, 2, 2.302176, 14, 1
9.465076, -9, 2, 2.293397, 14, 1
9.569201, -9, 2, 2.275784, 14, 1
9.673327, -9, 2, 2.257942, 14, 1
9.777452, -9, 2, 2.239604, 14, 1
9.881577, -9, 2, 2.220966, 14, 1
9.985702, -9, 2, 2.20154, 14, 1
10.08983, -10, 2, 2.191701, 14, 1
10.19395, -10, 2, 2.170727, 14, 1
10.29808, -10, 2, 2.160682, 14, 1
10.4022, -10, 2, 2.129471, 13, 1
10.50632, -10, 2, 2.108254, 13, 1
10.61045, -10, 2, 2.085976, 13, 1
10.71457, -10, 2, 2.074948, 13, 1
10.8187, -10, 2, 2.063834, 13, 1
10.92282, -10, 2, 2.031439, 13, 1
11.02695, -11, 2, 2.011223, 13, 1
11.13107, -11, 2, 1.990909, 12, 1
11.2352, -11, 2, 1.971003, 12, 1
11.33932, -11, 2, 1.960931, 12, 1
11.44345, -11, 2, 1.941183, 12, 1
11.54757, -11, 2, 1.921633, 12, 1
11.65169, -11, 2, 1.902088, 12, 1
11.75582, -11, 2, 1.883068, 12, 1
11.85994, -11, 2, 1.874019, 12, 1
11.96407, -11, 2, 1.854879, 12, 1
12.06819, -12, 2, 1.835183, 11, 1
12.17232, -12, 2, 1.815589, 11, 1
12.27644, -12, 2, 1.79528, 11, 1
12.38057, -12, 2, 1.785311, 11, 1
12.48469, -12, 2, 1.764696, 11, 1
12.58882, -12, 2, 1.744305, 11, 1
12.69294, -12, 2, 1.723873, 11, 1
12.79706, -12, 2, 1.703913, 11, 1
12.90119, -12, 2, 1.694027, 11, 1
13.00531, -13, 2, 1.673766, 10, 1
13.10944, -13, 2, 1.653811, 10, 1
13.21356, -13, 2, 1.633548, 10, 1
13.31769, -13, 2, 1.612239, 10, 1
13.42181, -13, 2, 1.602229, 10, 1
13.52594, -13, 2, 1.57999, 10, 1
13.63006, -13, 2, 1.557539, 10, 1
13.73419, -13, 2, 1.534746, 9, 1
13.83831, -13, 2, 1.523811, 9, 1
13.94243, -13, 2, 1.500421, 9, 1
14.04656, -14, 2, 1.477645, 9, 1
14.15068, -14, 2, 1.457072, 9, 1
14.25481, -14, 2, 1.446959, 9, 1
14.35893, -14, 2, 1.427828, 9, 1
14.46306, -14, 2, 1.408701, 9, 1
14.56718, -14, 2, 1.388544, 9, 1
14.67131, -14, 2, 1.369189, 8, 1
14.77543, -14, 2, 1.359572, 8, 1
14.87956, -14, 2, 1.340479, 8, 1
14.98368, -14, 2, 1.322008, 8, 1
15.0878, -15, 2, 1.303632, 8, 1
15.19193, -15, 2, 1.28555, 8, 1
15.29605, -15, 2, 1.276356, 8, 1
15.40018, -15, 2, 1.258848, 8, 1
15.5043, -15, 2, 1.240842, 8, 1
15.60843, -15, 2, 1.222582, 7, 1
15.71255, -15, 2, 1.204945, 7, 1
15.81668, -15, 2, 1.195704, 7, 1
15.9208, -15, 2, 1.17778, 7, 1
16.02493, -16, 2, 1.159252, 7, 1
16.12905, -16, 2, 1.139797, 7, 1
16.23318, -16, 2, 1.120533, 7, 1
16.3373, -16, 2, 1.110457, 7, 1
16.44142, -16, 2, 1.090845, 7, 1
16.54555, -16, 2, 1.070793, 6, 1
16.64967, -16, 2, 1.049895, 6, 1
16.7538, -16, 2, 1.029394, 6, 1
16.85792, -16, 2, 1.018644, 6, 1
16.96205, -16, 2, 0.9967484, 6, 1
17.06617, -17, 2, 0.9744651, 6, 1
17.1703, -17, 2, 0.9522219, 6, 1
17.27442, -17, 2, 0.929394, 6, 1
17.37854, -17, 2, 0.9180534, 5, 1
17.48267, -17, 2, 0.8951502, 5, 1
17.58679, -17, 2, 0.8720384, 5, 1
17.69092, -17, 2, 0.8496943, 5, 1
17.79504, -17, 2, 0.8278966, 5, 1
17.89917, -17, 2, 0.8173339, 5, 1
18.00329, -18, 2, 0.7971783, 5, 1
18.10742, -18, 2, 0.77706, 5, 1
18.21154, -18, 2, 0.7571559, 4, 1
18.31567, -18, 2, 0.737704, 4, 1
18.41979, -18, 2, 0.7279134, 4, 1
18.52391, -18, 2, 0.7081313, 4, 1
18.62804, -18, 2, 0.6885426, 4, 1
18.73216, -18, 2, 0.669106, 4, 1
18.83629, -18, 2, 0.6500762, 4, 1
18.94041, -18, 2, 0.639672, 4, 1
19.04454, -19, 2, 0.6206777, 4, 1
19.14866, -19, 2, 0.6006222, 3, 1
19.25279, -19, 2, 0.5805192, 3, 1
19.35691, -19, 2, 0.5611415, 3, 1
19.46103, -19, 2, 0.5512767, 3, 1
19.56516, -19, 2, 0.5320344, 3, 1
19.66928, -19, 2, 0.5127387, 3, 1
19.77341, -19, 2, 0.493371, 3, 1
19.87753, -19, 2, 0.4740791, 3, 1
19.98166, -19, 2, 0.4646573, 3, 1
20.08578, -20, 2, 0.4454401, 2, 1
20.18991, -20, 2, 0.4262059, 2, 1
20.29403, -20, 2, 0.4059703, 2, 1
20.39816, -20, 2, 0.3852754, 2, 1
20.50228, -20, 2, 0.3644373, 2, 1
20.60641, -20, 2, 0.3537393, 2, 1
20.71053, -20, 2, 0.3321908, 2, 1
20.81466, -20, 2, 0.309936, 2, 1
20.91878, -20, 2, 0.2876976, 1, 1
21.0229, -21, 2, 0.2768786, 1, 1
21.12703, -21, 2, 0.2551637, 1, 1
21.23115, -21, 2, 0.2340457, 1, 1
21.33528, -21, 2, 0.2144752, 1, 1
21.4394, -21, 2, 0.1950407, 1, 1
21.54353, -21, 2, 0.1851702, 1, 1
21.64765, -21, 2, 0.1662905, 1, 1
21.75178, -21, 2, 0.1472957, 0, 1
21.8559, -21, 2, 0.128458, 0, 1
21.96002, -21, 2, 0.110065, 0, 1
22.06415, -22, 2, 0.1009555, 0, 1
22.16827, -22, 2, 0.08320761, 0, 1
22.2724, -22, 2, 0.06579161, 0, 1
22.37652, -22, 2, 0.04873228, 0, 1
22.48065, -22, 2, 0.03235006, 0, 1
22.58477, -22, 2, 0.02420306, 0, 1
22.6889, -22, 2, 0.007753849, 0, 1
22.79302, -22, 2, -0.00878191, 0, 1
22.89715, -22, 2, -0.02560759, 0, 1
23.00127, -23, 2, -0.04199886, 0, 1
23.10539, -23, 2, -0.05016303, 0, 1
23.20952, -23, 2, -0.06618118, 0, 1
23.31364, -23, 2, -0.08195543, 0, 1
23.41777, -23, 2, -0.09799767, 0, 1
23.52189, -23, 2, -0.1144979, 0, 1
23.62602, -23, 2, -0.1227412, 0, 1
23.73014, -23, 2, -0.139596, 0, 1
23.83427, -23, 2, -0.1566675, -1, 1
23.93839, -23, 2, -0.174088, -1, 1
24.04251, -24, 2, -0.1919713, -1, 1
24.14664, -24, 2, -0.2005196, -1, 1
24.25076, -24, 2, -0.2184901, -1, 1
24.35489, -24, 2, -0.2360015, -1, 1
24.45901, -24, 2, -0.254694, -1, 1
24.56314, -24, 2, -0.2731829, -1, 1
24.66726, -24, 2, -0.2825403, -1, 1
24.77139, -24, 2, -0.3012147, -1, 1
24.87551, -24, 2, -0.3189673, -2, 1
24.97964, -24, 2, -0.3356364, -2, 1
25.08376, -25, 2, -0.3514452, -2, 1
25.18789, -25, 2, -0.3670974, -2, 1
25.29201, -25, 2, -0.3748603, -2, 1
25.39614, -25, 2, -0.3900375, -2, 1
25.50026, -25, 2, -0.4051206, -2, 1
25.60438, -25, 2, -0.4199109, -2, 1
25.70851, -25, 2, -0.4339952, -2, 1
25.81263, -25, 2, -0.4410257, -2, 1
25.91676, -25, 2, -0.4546542, -2, 1
26.02088, -26, 2, -0.4678917, -3, 1
26.12501, -26, 2, -0.4805415, -3, 1
26.22913, -26, 2, -0.4930358, -3, 1
26.33326, -26, 2, -0.499444, -3, 1
26.43738, -26, 2, -0.5119591, -3, 1
26.5415, -26, 2, -0.5246906, -3, 1
26.64563, -26, 2, -0.5370889, -3, 1
26.74975, -26, 2, -0.5431457, -3, 1
26.85388, -26, 2, -0.5556111, -3, 1
26.958, -26, 2, -0.5678988, -3, 1
27.06213, -27, 2, -0.5798607, -3, 1
27.16625, -27, 2, -0.5919333, -3, 1
27.27038, -27, 2, -0.5979338, -3, 1
27.3745, -27, 2, -0.6100376, -3, 1
27.47863, -27, 2, -0.6221175, -4, 1
27.58275, -27, 2, -0.633894, -4, 1
27.68687, -27, 2, -0.6459904, -4, 1
27.791, -27, 2, -0.6521242, -4, 1
27.89512, -27, 2, -0.6645975, -4, 1
27.99925, -27, 2, -0.6773729, -4, 1
28.10337, -28, 2, -0.690434, -4, 1
28.2075, -28, 2, -0.703835, -4, 1
28.31162, -28, 2, -0.7106743, -4, 1
28.41575, -28, 2, -0.7243605, -4, 1
28.51987, -28, 2, -0.7381735, -4, 1
28.62399, -28, 2, -0.7520294, -4, 1
28.72812, -28, 2, -0.7656856, -4, 1
28.83224, -28, 2, -0.7724743, -5, 1
28.93637, -28, 2, -0.7859454, -5, 1
29.04049, -29, 2, -0.7993855, -5, 1
29.14462, -29, 2, -0.8124661, -5, 1
29.24874, -29, 2, -0.8248086, -5, 1
29.35287, -29, 2, -0.83674, -5, 1
29.45699, -29, 2, -0.8431339, -5, 1
29.56112, -29, 2, -0.8554816, -5, 1
29.66524, -29, 2, -0.8675785, -5, 1
29.76937, -29, 2, -0.8792152, -5, 1
29.87349, -29, 2, -0.8847442, -5, 1
29.97762, -29, 2, -0.8954887, -5, 1
30.08174, -30, 2, -0.9054041, -5, 1
30.18586, -30, 2, -0.914597, -5, 1
30.28999, -30, 2, -0.9228597, -5, 1
30.39411, -30, 2, -0.9306293, -6, 1
30.49824, -30, 2, -0.9343944, -6, 1
30.60236, -30, 2, -0.9416471, -6, 1
30.70649, -30, 2, -0.9489427, -6, 1
30.81061, -30, 2, -0.9563303, -6, 1
30.91474, -30, 2, -0.9601154, -6, 1
31.01886, -31, 2, -0.9674683, -6, 1
31.12298, -31, 2, -0.9746876, -6, 1
31.22711, -31, 2, -0.9819746, -6, 1
31.33123, -31, 2, -0.9891515, -6, 1
31.43536, -31, 2, -0.9964247, -6, 1
31.53948, -31, 2, -0.9999223, -6, 1
31.64361, -31, 2, -1.006769, -6, 1
31.74773, -31, 2, -1.013398, -6, 1
31.85186, -31, 2, -1.01984, -6, 1
31.95598, -31, 2, -1.022823, -6, 1
32.0601, -32, 2, -1.028589, -6, 1
32.16423, -32, 2, -1.034543, -6, 1
32.26835, -32, 2, -1.040328, -6, 1
32.37248, -32, 2, -1.046108, -6, 1
32.4766, -32, 2, -1.048968, -6, 1
32.58073, -32, 2, -1.054869, -6, 1
32.68485, -32, 2, -1.060302, -6, 1
32.78898, -32, 2, -1.064905, -6, 1
32.8931, -32, 2, -1.068892, -6, 1
32.99723, -32, 2, -1.070451, -6, 1
33.10135, -33, 2, -1.073462, -6, 1
33.20547, -33, 2, -1.075892, -6, 1
33.3096, -33, 2, -1.077609, -7, 1
33.41372, -33, 2, -1.078775, -7, 1
33.51785, -33, 2, -1.079122, -7, 1
33.62197, -33, 2, -1.079279, -7, 1
33.7261, -33, 2, -1.079339, -7, 1
33.83022, -33, 2, -1.079231, -7, 1
33.93435, -33, 2, -1.079158, -7, 1
34.03847, -34, 2, -1.079219, -7, 1
34.1426, -34, 2, -1.079154, -7, 1
34.24672, -34, 2, -1.079358, -7, 1
34.35085, -34, 2, -1.079521, -7, 1
34.45497, -34, 2, -1.079816, -7, 1
34.55909, -34, 2, -1.080113, -7, 1
34.66322, -34, 2, -1.080132, -7, 1
34.76734, -34, 2, -1.079916, -7, 1
34.87147, -34, 2, -1.07951, -7, 1
34.97559, -34, 2, -1.078857, -7, 1
35.07972, -35, 2, -1.078609, -7, 1
35.18384, -35, 2, -1.077759, -7, 1
35.28797, -35, 2, -1.076834, -6, 1
35.39209, -35, 2, -1.075608, -6, 1
35.49622, -35, 2, -1.074092, -6, 1
35.60034, -35, 2, -1.073285, -6, 1
35.70446, -35, 2, -1.071296, -6, 1
35.80859, -35, 2, -1.069423, -6, 1
35.91271, -35, 2, -1.067619, -6, 1
36.01684, -36, 2, -1.066083, -6, 1
36.12096, -36, 2, -1.065414, -6, 1
36.22509, -36, 2, -1.064291, -6, 1
36.32921, -36, 2, -1.06374, -6, 1
36.43333, -36, 2, -1.063605, -6, 1
36.53746, -36, 2, -1.063756, -6, 1
36.64159, -36, 2, -1.063838, -6, 1
36.74571, -36, 2, -1.063599, -6, 1
36.84983, -36, 2, -1.062596, -6, 1
36.95396, -36, 2, -1.060638, -6, 1
37.05808, -37, 2, -1.058119, -6, 1
37.16221, -37, 2, -1.056613, -6, 1
37.26633, -37, 2, -1.052318, -6, 1
37.37046, -37, 2, -1.046663, -6, 1
37.47458, -37, 2, -1.039815, -6, 1
37.5787, -37, 2, -1.03237, -6, 1
37.68283, -37, 2, -1.028604, -6, 1
37.78696, -37, 2, -1.020107, -6, 1
37.89108, -37, 2, -1.011804, -6, 1
37.9952, -37, 2, -1.003662, -6, 1
38.09933, -38, 2, -0.9953241, -6, 1
38.20345, -38, 2, -0.9912496, -6, 1
38.30758, -38, 2, -0.9830098, -6, 1
38.4117, -38, 2, -0.9746594, -6, 1
38.51583, -38, 2, -0.9664812, -6, 1
38.61995, -38, 2, -0.9584193, -6, 1
38.72408, -38, 2, -0.9500308, -6, 1
38.8282, -38, 2, -0.9462142, -6, 1
38.93232, -38, 2, -0.9383631, -6, 1
39.03645, -39, 2, -0.9311905, -6, 1
39.14058, -39, 2, -0.9248152, -6, 1
39.2447, -39, 2, -0.9215097, -5, 1
39.34882, -39, 2, -0.9154148, -5, 1
39.45295, -39, 2, -0.9091616, -5, 1
39.55707, -39, 2, -0.9028883, -5, 1
39.6612, -39, 2, -0.8967915, -5, 1
39.76532, -39, 2, -0.8938065, -5, 1
39.86945, -39, 2, -0.8876557, -5, 1
39.97357, -39, 2, -0.8815355, -5, 1
40.07769, -40, 2, -0.8748779, -5, 1
40.18182, -40, 2, -0.8682141, -5, 1
