car_pos_meter , car_pos_cell, car_speed, ped_pos_meter, ped_pos_cell, ped_speed
-25.625, 25, 2, 4.099651, 26, 1
-25.52088, 25, 2, 4.083251, 26, 1
-25.41675, 25, 2, 4.066258, 26, 1
-25.31263, 25, 2, 4.048919, 26, 1
-25.2085, 25, 2, 4.031959, 26, 1
-25.10438, 25, 2, 4.023462, 26, 1
-25.00025, 25, 2, 4.006, 26, 1
-24.89613, 24, 2, 3.988211, 25, 1
-24.792, 24, 2, 3.969531, 25, 1
-24.68788, 24, 2, 3.950021, 25, 1
-24.58375, 24, 2, 3.9305, 25, 1
-24.47963, 24, 2, 3.919887, 25, 1
-24.37551, 24, 2, 3.898668, 25, 1
-24.27138, 24, 2, 3.876149, 25, 1
-24.16726, 24, 2, 3.853369, 25, 1
-24.06313, 24, 2, 3.831259, 24, 1
-23.95901, 23, 2, 3.819943, 24, 1
-23.85488, 23, 2, 3.7993, 24, 1
-23.75076, 23, 2, 3.779515, 24, 1
-23.64663, 23, 2, 3.760542, 24, 1
-23.54251, 23, 2, 3.742587, 24, 1
-23.43839, 23, 2, 3.733, 24, 1
-23.33426, 23, 2, 3.714873, 24, 1
-23.23013, 23, 2, 3.696665, 24, 1
-23.12601, 23, 2, 3.678697, 23, 1
-23.02189, 23, 2, 3.670198, 23, 1
-22.91776, 22, 2, 3.652418, 23, 1
-22.81364, 22, 2, 3.635208, 23, 1
-22.70951, 22, 2, 3.617537, 23, 1
-22.60539, 22, 2, 3.608713, 23, 1
-22.50126, 22, 2, 3.581732, 23, 1
-22.39714, 22, 2, 3.57243, 23, 1
-22.29301, 22, 2, 3.554161, 23, 1
-22.18889, 22, 2, 3.535118, 22, 1
-22.08476, 22, 2, 3.51558, 22, 1
-21.98064, 21, 2, 3.495867, 22, 1
-21.87652, 21, 2, 3.485904, 22, 1
-21.77239, 21, 2, 3.466473, 22, 1
-21.66827, 21, 2, 3.446263, 22, 1
-21.56414, 21, 2, 3.425871, 22, 1
-21.46002, 21, 2, 3.405108, 22, 1
-21.35589, 21, 2, 3.394262, 22, 1
-21.25177, 21, 2, 3.373315, 21, 1
-21.14764, 21, 2, 3.352167, 21, 1
-21.04352, 21, 2, 3.331071, 21, 1
-20.9394, 20, 2, 3.310241, 21, 1
-20.83527, 20, 2, 3.299665, 21, 1
-20.73115, 20, 2, 3.278008, 21, 1
-20.62702, 20, 2, 3.25649, 21, 1
-20.5229, 20, 2, 3.23525, 21, 1
-20.41877, 20, 2, 3.214117, 20, 1
-20.31465, 20, 2, 3.203732, 20, 1
-20.21052, 20, 2, 3.183237, 20, 1
-20.1064, 20, 2, 3.162148, 20, 1
-20.00227, 20, 2, 3.141107, 20, 1
-19.89815, 19, 2, 3.120037, 20, 1
-19.79403, 19, 2, 3.109587, 20, 1
-19.6899, 19, 2, 3.089076, 20, 1
-19.58578, 19, 2, 3.068678, 19, 1
-19.48165, 19, 2, 3.048715, 19, 1
-19.37753, 19, 2, 3.029192, 19, 1
-19.2734, 19, 2, 3.019171, 19, 1
-19.16928, 19, 2, 2.999238, 19, 1
-19.06515, 19, 2, 2.97927, 19, 1
-18.96103, 18, 2, 2.958757, 19, 1
-18.8569, 18, 2, 2.938179, 19, 1
-18.75278, 18, 2, 2.927556, 19, 1
-18.64865, 18, 2, 2.906899, 18, 1
-18.54453, 18, 2, 2.886126, 18, 1
-18.44041, 18, 2, 2.865021, 18, 1
-18.33628, 18, 2, 2.843975, 18, 1
-18.23216, 18, 2, 2.833252, 18, 1
-18.12803, 18, 2, 2.81169, 18, 1
-18.02391, 18, 2, 2.789575, 18, 1
-17.91978, 17, 1, 2.767016, 17, 1
-17.90541, 17, 2, 2.743791, 17, 1
-17.80128, 17, 2, 2.731981, 17, 1
-17.69716, 17, 2, 2.70825, 17, 1
-17.59303, 17, 2, 2.684478, 17, 1
-17.48891, 17, 1, 2.660309, 17, 1
-17.47453, 17, 2, 2.648275, 17, 1
-17.37041, 17, 2, 2.624244, 17, 1
-17.26628, 17, 2, 2.600204, 16, 1
-17.16216, 17, 2, 2.577735, 16, 1
-17.05804, 17, 2, 2.555589, 16, 1
-16.95391, 16, 2, 2.533541, 16, 1
-16.84979, 16, 2, 2.522735, 16, 1
-16.74566, 16, 2, 2.501507, 16, 1
-16.64154, 16, 2, 2.480659, 16, 1
-16.53741, 16, 2, 2.46063, 15, 1
-16.43329, 16, 2, 2.430513, 15, 1
-16.32916, 16, 2, 2.430513, 15, 1
-16.22504, 16, 2, 2.410689, 15, 1
-16.12091, 16, 2, 2.390393, 15, 1
-16.01679, 16, 2, 2.369859, 15, 1
-15.91267, 15, 2, 2.349133, 15, 1
-15.80854, 15, 2, 2.338901, 15, 1
-15.70442, 15, 2, 2.318051, 15, 1
-15.60029, 15, 2, 2.296689, 14, 1
-15.49617, 15, 2, 2.275629, 14, 1
-15.39204, 15, 2, 2.264981, 14, 1
-15.28792, 15, 2, 2.243219, 14, 1
-15.18379, 15, 2, 2.221453, 14, 1
-15.07967, 15, 2, 2.199311, 14, 1
-14.97554, 14, 1, 2.177091, 14, 1
-14.96117, 14, 2, 2.154068, 14, 1
-14.85705, 14, 2, 2.142783, 13, 1
-14.75292, 14, 2, 2.118816, 13, 1
-14.6488, 14, 2, 2.095051, 13, 1
-14.54467, 14, 2, 2.071215, 13, 1
-14.44055, 14, 2, 2.04735, 13, 1
-14.33642, 14, 2, 2.035423, 13, 1
-14.2323, 14, 2, 2.011202, 13, 1
-14.12817, 14, 2, 1.987628, 12, 1
-14.02405, 14, 2, 1.96466, 12, 1
-13.91992, 13, 2, 1.953071, 12, 1
-13.8158, 13, 2, 1.919768, 12, 1
-13.71168, 13, 2, 1.908679, 12, 1
-13.60755, 13, 2, 1.8867, 12, 1
-13.50343, 13, 2, 1.864747, 12, 1
-13.3993, 13, 2, 1.842835, 11, 1
-13.29518, 13, 2, 1.832191, 11, 1
-13.19105, 13, 2, 1.811247, 11, 1
-13.08693, 13, 2, 1.790392, 11, 1
-12.9828, 12, 2, 1.770195, 11, 1
-12.87868, 12, 2, 1.760278, 11, 1
-12.77455, 12, 2, 1.739508, 11, 1
-12.67043, 12, 2, 1.718906, 11, 1
-12.56631, 12, 2, 1.697917, 11, 1
-12.46218, 12, 2, 1.676827, 10, 1
-12.35806, 12, 2, 1.655787, 10, 1
-12.25393, 12, 2, 1.645073, 10, 1
-12.14981, 12, 2, 1.623025, 10, 1
-12.04568, 12, 2, 1.600732, 10, 1
-11.94156, 11, 2, 1.578434, 10, 1
-11.83743, 11, 2, 1.5559, 10, 1
-11.73331, 11, 2, 1.54466, 10, 1
-11.62918, 11, 2, 1.521541, 9, 1
-11.52506, 11, 2, 1.498538, 9, 1
-11.42094, 11, 2, 1.474759, 9, 1
-11.31681, 11, 2, 1.45059, 9, 1
-11.21269, 11, 2, 1.438701, 9, 1
-11.10856, 11, 2, 1.413977, 9, 1
-11.00444, 11, 2, 1.389567, 9, 1
-10.90031, 10, 2, 1.365224, 8, 1
-10.79619, 10, 2, 1.353135, 8, 1
-10.69206, 10, 2, 1.330202, 8, 1
-10.58794, 10, 2, 1.307525, 8, 1
-10.48381, 10, 2, 1.285525, 8, 1
-10.37969, 10, 2, 1.264042, 8, 1
-10.27557, 10, 2, 1.242297, 8, 1
-10.17144, 10, 2, 1.231829, 8, 1
-10.06732, 10, 2, 1.210699, 7, 1
-9.96319, 9, 2, 1.190402, 7, 1
-9.859065, 9, 2, 1.170207, 7, 1
-9.75494, 9, 2, 1.150178, 7, 1
-9.650815, 9, 2, 1.130202, 7, 1
-9.54669, 9, 2, 1.120221, 7, 1
-9.442565, 9, 2, 1.100452, 7, 1
-9.33844, 9, 2, 1.080465, 7, 1
-9.234314, 9, 2, 1.060796, 6, 1
-9.130189, 9, 2, 1.041129, 6, 1
-9.026064, 9, 2, 1.031174, 6, 1
-8.921939, 8, 2, 1.011492, 6, 1
-8.817814, 8, 2, 0.9912627, 6, 1
-8.713689, 8, 2, 0.9709139, 6, 1
-8.609564, 8, 2, 0.9503615, 6, 1
-8.505439, 8, 2, 0.9399216, 6, 1
-8.401313, 8, 2, 0.9191852, 5, 1
-8.297188, 8, 2, 0.8977711, 5, 1
-8.193063, 8, 2, 0.8768568, 5, 1
-8.088938, 8, 2, 0.8664227, 5, 1
-7.984813, 7, 2, 0.8453875, 5, 1
-7.880688, 7, 2, 0.8245394, 5, 1
-7.776563, 7, 2, 0.803823, 5, 1
-7.672437, 7, 2, 0.7835813, 5, 1
-7.568312, 7, 2, 0.7733216, 5, 1
-7.464187, 7, 2, 0.7523377, 4, 1
-7.360062, 7, 2, 0.7313609, 4, 1
-7.255937, 7, 2, 0.7096212, 4, 1
-7.151812, 7, 2, 0.6868477, 4, 1
-7.047687, 7, 2, 0.6752043, 4, 1
-6.943562, 6, 2, 0.6508679, 4, 1
-6.839436, 6, 2, 0.6255255, 4, 1
-6.735311, 6, 2, 0.6001251, 3, 1
-6.631186, 6, 2, 0.5872324, 3, 1
-6.527061, 6, 2, 0.5620623, 3, 1
-6.422935, 6, 2, 0.5384159, 3, 1
-6.31881, 6, 2, 0.5273359, 3, 1
-6.214685, 6, 2, 0.5051351, 3, 1
-6.11056, 6, 2, 0.4838252, 3, 1
-6.006435, 6, 2, 0.4629982, 3, 1
-5.90231, 5, 2, 0.4526398, 2, 1
-5.798185, 5, 2, 0.4317071, 2, 1
-5.69406, 5, 2, 0.4108715, 2, 1
-5.589934, 5, 2, 0.3896792, 2, 1
-5.485809, 5, 2, 0.369091, 2, 1
-5.381684, 5, 2, 0.3587625, 2, 1
-5.277559, 5, 2, 0.3391182, 2, 1
-5.173434, 5, 2, 0.3191259, 2, 1
-5.069309, 5, 2, 0.2989082, 1, 1
-4.965184, 4, 2, 0.2784655, 1, 1
-4.861059, 4, 2, 0.2680006, 1, 1
-4.756933, 4, 2, 0.2470846, 1, 1
-4.652808, 4, 2, 0.2258484, 1, 1
-4.548683, 4, 2, 0.2046456, 1, 1
-4.444558, 4, 2, 0.1836004, 1, 1
-4.340433, 4, 2, 0.1723745, 1, 1
-4.236308, 4, 2, 0.1510332, 0, 1
-4.132183, 4, 2, 0.1290288, 0, 1
-4.028058, 4, 2, 0.1063414, 0, 1
-3.923932, 3, 2, 0.08429503, 0, 1
-3.819807, 3, 2, 0.0736866, 0, 1
-3.715682, 3, 2, 0.05394077, 0, 1
-3.611557, 3, 2, 0.03441381, 0, 1
-3.507432, 3, 2, 0.01497889, 0, 1
-3.403306, 3, 2, 0.005240679, 0, 1
-3.299181, 3, 2, -0.01390982, 0, 1
-3.195056, 3, 2, -0.03247094, 0, 1
-3.090931, 3, 2, -0.04875994, 0, 1
-2.986806, 2, 2, -0.0642066, 0, 1
-2.882681, 2, 2, -0.07914972, 0, 1
-2.778556, 2, 2, -0.08653736, 0, 1
-2.674431, 2, 2, -0.1017866, 0, 1
-2.570305, 2, 2, -0.117815, 0, 1
-2.46618, 2, 2, -0.1343832, 0, 1
-2.362056, 2, 2, -0.1425457, 0, 1
-2.257931, 2, 2, -0.158905, -1, 1
-2.153805, 2, 2, -0.1755958, -1, 1
-2.04968, 2, 2, -0.192018, -1, 1
-1.945555, 1, 2, -0.2084312, -1, 1
-1.841431, 1, 2, -0.2246542, -1, 1
-1.737306, 1, 2, -0.2325938, -1, 1
-1.63318, 1, 2, -0.2491193, -1, 1
-1.529055, 1, 2, -0.2669535, -1, 1
-1.424931, 1, 2, -0.2868304, -1, 1
-1.320806, 1, 2, -0.2973213, -1, 1
-1.216681, 1, 2, -0.3192163, -2, 1
-1.112556, 1, 2, -0.341404, -2, 1
-1.008431, 1, 2, -0.3637409, -2, 1
-0.9043056, 0, 2, -0.3870597, -2, 1
-0.8001806, 0, 2, -0.410176, -2, 1
-0.6960556, 0, 2, -0.421958, -2, 1
-0.5919306, 0, 2, -0.4455462, -2, 1
-0.4878056, 0, 2, -0.4692574, -3, 1
-0.3836806, 0, 2, -0.480722, -3, 1
-0.2795556, 0, 2, -0.515255, -3, 1
-0.1754306, 0, 2, -0.5264978, -3, 1
-0.07130564, 0, 2, -0.5481262, -3, 1
0.03281935, 0, 2, -0.5687985, -3, 1
0.1369443, 0, 2, -0.5890894, -3, 1
0.2410693, 0, 2, -0.6069751, -3, 1
0.3451943, 0, 2, -0.6157999, -4, 1
0.4493193, 0, 2, -0.6325212, -4, 1
0.5534443, 0, 2, -0.6483436, -4, 1
0.6575693, 0, 2, -0.6638956, -4, 1
0.7616943, 0, 2, -0.6721978, -4, 1
0.8658193, 0, 2, -0.6890135, -4, 1
0.9699443, 0, 2, -0.7061296, -4, 1
1.074069, -1, 2, -0.7236948, -4, 1
1.178194, -1, 2, -0.7415748, -4, 1
1.282319, -1, 2, -0.7592959, -4, 1
1.386444, -1, 2, -0.7684002, -4, 1
1.490569, -1, 2, -0.7861648, -5, 1
1.594694, -1, 2, -0.8044372, -5, 1
1.698819, -1, 2, -0.8224554, -5, 1
1.802944, -1, 2, -0.8398829, -5, 1
1.907069, -1, 2, -0.848917, -5, 1
2.011194, -2, 2, -0.8662724, -5, 1
2.115319, -2, 2, -0.8837018, -5, 1
2.219444, -2, 2, -0.9011917, -5, 1
2.323569, -2, 2, -0.9188871, -5, 1
2.427694, -2, 2, -0.9281526, -6, 1
2.531819, -2, 2, -0.9462681, -6, 1
2.635944, -2, 2, -0.9650555, -6, 1
2.74007, -2, 2, -0.9840932, -6, 1
2.844195, -2, 2, -1.002395, -6, 1
2.94832, -2, 2, -1.01173, -6, 1
3.052445, -3, 2, -1.028455, -6, 1
3.15657, -3, 2, -1.044721, -6, 1
3.260695, -3, 2, -1.060446, -6, 1
3.36482, -3, 2, -1.075721, -6, 1
3.468946, -3, 2, -1.083715, -7, 1
3.573071, -3, 2, -1.098212, -7, 1
3.677196, -3, 2, -1.111913, -7, 1
3.781321, -3, 2, -1.124563, -7, 1
3.885446, -3, 2, -1.136658, -7, 1
3.989571, -3, 2, -1.142583, -7, 1
4.093697, -4, 2, -1.154338, -7, 1
4.197822, -4, 2, -1.1656, -7, 1
4.301947, -4, 2, -1.176068, -7, 1
4.406072, -4, 2, -1.185874, -7, 1
4.510197, -4, 2, -1.190893, -7, 1
4.614322, -4, 2, -1.199529, -7, 1
4.718447, -4, 2, -1.207491, -7, 1
4.822572, -4, 2, -1.21445, -7, 1
4.926698, -4, 2, -1.219894, -7, 1
5.030823, -5, 2, -1.222344, -7, 1
5.134948, -5, 2, -1.226534, -7, 1
5.239073, -5, 2, -1.230633, -7, 1
5.343198, -5, 2, -1.234244, -8, 1
5.447323, -5, 2, -1.23786, -8, 1
5.551448, -5, 2, -1.239852, -8, 1
5.655573, -5, 2, -1.243222, -8, 1
5.759699, -5, 2, -1.246526, -8, 1
5.863824, -5, 2, -1.249164, -8, 1
5.967949, -5, 2, -1.251203, -8, 1
6.072074, -6, 2, -1.252529, -8, 1
6.176199, -6, 2, -1.254502, -8, 1
6.280324, -6, 2, -1.257008, -8, 1
6.384449, -6, 2, -1.259593, -8, 1
6.488575, -6, 2, -1.261931, -8, 1
6.5927, -6, 2, -1.263244, -8, 1
6.696825, -6, 2, -1.265403, -8, 1
6.80095, -6, 2, -1.267693, -8, 1
6.905075, -6, 2, -1.268414, -8, 1
7.009201, -7, 2, -1.270336, -8, 1
7.113326, -7, 2, -1.270846, -8, 1
7.217451, -7, 2, -1.272608, -8, 1
7.321576, -7, 2, -1.272885, -8, 1
7.425701, -7, 2, -1.272032, -8, 1
7.529826, -7, 2, -1.269975, -8, 1
7.633951, -7, 2, -1.268692, -8, 1
7.738076, -7, 2, -1.265614, -8, 1
7.842202, -7, 2, -1.261666, -8, 1
7.946327, -7, 2, -1.257596, -8, 1
8.050451, -8, 2, -1.253018, -8, 1
8.154577, -8, 2, -1.250683, -8, 1
8.258702, -8, 2, -1.245726, -8, 1
8.362827, -8, 2, -1.239977, -8, 1
8.466952, -8, 2, -1.233803, -8, 1
8.571077, -8, 2, -1.22719, -7, 1
8.675202, -8, 2, -1.224385, -7, 1
8.779327, -8, 2, -1.217656, -7, 1
8.883452, -8, 2, -1.210269, -7, 1
8.987578, -8, 2, -1.202735, -7, 1
9.091703, -9, 2, -1.195101, -7, 1
9.195828, -9, 2, -1.191014, -7, 1
9.299953, -9, 2, -1.183587, -7, 1
9.404078, -9, 2, -1.175755, -7, 1
9.508204, -9, 2, -1.168114, -7, 1
9.612329, -9, 2, -1.160701, -7, 1
9.716454, -9, 2, -1.153546, -7, 1
9.82058, -9, 2, -1.150053, -7, 1
9.924705, -9, 2, -1.142923, -7, 1
10.02883, -10, 2, -1.136185, -7, 1
10.13295, -10, 2, -1.129484, -7, 1
10.23708, -10, 2, -1.126203, -7, 1
10.3412, -10, 2, -1.11975, -7, 1
10.44533, -10, 2, -1.113277, -7, 1
10.54945, -10, 2, -1.106746, -7, 1
10.65358, -10, 2, -1.103474, -7, 1
10.7577, -10, 2, -1.096972, -7, 1
10.86183, -10, 2, -1.090481, -7, 1
10.96595, -10, 2, -1.083924, -7, 1
11.07008, -11, 2, -1.077543, -7, 1
11.1742, -11, 2, -1.071376, -6, 1
11.27832, -11, 2, -1.068347, -6, 1
11.38245, -11, 2, -1.062284, -6, 1
11.48657, -11, 2, -1.05615, -6, 1
11.5907, -11, 2, -1.050295, -6, 1
11.69482, -11, 2, -1.044632, -6, 1
11.79895, -11, 2, -1.04161, -6, 1
11.90307, -11, 2, -1.036047, -6, 1
12.0072, -12, 2, -1.030463, -6, 1
12.11132, -12, 2, -1.025121, -6, 1
12.21544, -12, 2, -1.020138, -6, 1
12.31957, -12, 2, -1.01765, -6, 1
12.42369, -12, 2, -1.013194, -6, 1
12.52782, -12, 2, -1.008991, -6, 1
12.63194, -12, 2, -1.005016, -6, 1
12.73607, -12, 2, -1.003295, -6, 1
12.84019, -12, 2, -1.000158, -6, 1
12.94432, -12, 2, -0.9972124, -6, 1
13.04844, -13, 2, -0.9945107, -6, 1
13.15257, -13, 2, -0.9920297, -6, 1
13.25669, -13, 2, -0.9908433, -6, 1
13.36082, -13, 2, -0.9877491, -6, 1
13.46494, -13, 2, -0.9869256, -6, 1
