timestamp_sec,frame_id,game_played,yielding,player1discrete,player2discrete,player1yieldprob,player2yieldprob,player1_pose_x,player1_pose_y,player1_pose_z,player1_pose_orient_x,player1_pose_orient_y,player1_pose_orient_z,player1_pose_orient_w,player2_pose_x,player2_pose_y,player2_pose_z,player2_pose_orient_x,player2_pose_orient_y,player2_pose_orient_z,player2_pose_orient_w
1718118851.5354137,map,True,True,5,5,0.612995793784914,0.612995793784914,1.2282893657684326,-1.5410830974578857,0.0,0.0,0.0,0.031678960100955784,0.9994980923423099,2.9217067871245312,-6.817195249394676,0.7946868682609367,0.0,0.0,0.0,1.0
1718118851.585638,map,True,True,5,5,0.612995793784914,0.612995793784914,1.2282893657684326,-1.5410830974578857,0.0,0.0,0.0,0.031678960100955784,0.9994980923423099,2.9217067871245312,-6.817195249394676,0.7946868682609367,0.0,0.0,0.0,1.0
1718118851.637523,map,True,True,5,5,0.612995793784914,0.612995793784914,1.2282893657684326,-1.5410830974578857,0.0,0.0,0.0,0.031678960100955784,0.9994980923423099,2.9217067871245312,-6.817195249394676,0.7946868682609367,0.0,0.0,0.0,1.0
1718118851.6876776,map,True,True,5,5,0.612995793784914,0.612995793784914,1.2282893657684326,-1.5410830974578857,0.0,0.0,0.0,0.031678960100955784,0.9994980923423099,2.9217067871245312,-6.817195249394676,0.7946868682609367,0.0,0.0,0.0,1.0
1718118851.7404432,map,True,True,5,5,0.612995793784914,0.612995793784914,1.2282893657684326,-1.5410830974578857,0.0,0.0,0.0,0.031678960100955784,0.9994980923423099,2.9217067871245312,-6.817195249394676,0.7946868682609367,0.0,0.0,0.0,1.0
1718118851.791936,map,True,False,5,6,0.0,0.0,1.2282893657684326,-1.5410830974578857,0.0,0.0,0.0,0.031678960100955784,0.9994980923423099,2.939344464058778,-6.984771534794133,0.7982894918987713,0.0,0.0,0.0,1.0
1718118851.838534,map,True,False,5,6,0.0,0.0,1.2282893657684326,-1.5410830974578857,0.0,0.0,0.0,0.031678960100955784,0.9994980923423099,2.939344464058778,-6.984771534794133,0.7982894918987713,0.0,0.0,0.0,1.0
1718118851.8889632,map,True,False,5,6,0.0,0.0,1.2287510633468628,-1.5432759523391724,0.0,0.0,0.0,0.031837498866863455,0.9994930532079499,2.939344464058778,-6.984771534794133,0.7982894918987713,0.0,0.0,0.0,1.0
1718118851.9396718,map,True,False,5,6,0.0,0.0,1.2287510633468628,-1.5432759523391724,0.0,0.0,0.0,0.031837498866863455,0.9994930532079499,2.939344464058778,-6.984771534794133,0.7982894918987713,0.0,0.0,0.0,1.0
1718118852.0396569,map,True,False,5,6,0.0,0.0,1.2287510633468628,-1.5432759523391724,0.0,0.0,0.0,0.031837498866863455,0.9994930532079499,2.939344464058778,-6.984771534794133,0.7982894918987713,0.0,0.0,0.0,1.0
1718118852.1415594,map,True,False,5,5,0.612995793784914,0.612995793784914,1.2287510633468628,-1.5432759523391724,0.0,0.0,0.0,0.031837498866863455,0.9994930532079499,2.927375686925934,-6.9060124391931375,0.7965552107213523,0.0,0.0,0.0,1.0
1718118852.1909685,map,True,True,5,5,0.612995793784914,0.612995793784914,1.2287510633468628,-1.5432759523391724,0.0,0.0,0.0,0.031837498866863455,0.9994930532079499,2.927375686925934,-6.9060124391931375,0.7965552107213523,0.0,0.0,0.0,1.0
1718118852.2407024,map,True,True,5,5,0.612995793784914,0.612995793784914,1.2287510633468628,-1.5432759523391724,0.0,0.0,0.0,0.031837498866863455,0.9994930532079499,2.927375686925934,-6.9060124391931375,0.7965552107213523,0.0,0.0,0.0,1.0
1718118852.4413185,map,True,True,5,5,0.612995793784914,0.612995793784914,1.2287510633468628,-1.5432759523391724,0.0,0.0,0.0,0.031837498866863455,0.9994930532079499,2.933883563253679,-6.945029803372913,0.7974165315745678,0.0,0.0,0.0,1.0
1718118852.5392623,map,True,True,5,5,0.612995793784914,0.612995793784914,1.2267341613769531,-1.543722152709961,0.0,0.0,0.0,0.031969154334823294,0.9994888489403153,2.933883563253679,-6.945029803372913,0.7974165315745678,0.0,0.0,0.0,1.0
1718118852.5903153,map,True,False,5,5,0.612995793784914,0.612995793784914,1.2267341613769531,-1.543722152709961,0.0,0.0,0.0,0.031969154334823294,0.9994888489403153,2.933883563253679,-6.945029803372913,0.7974165315745678,0.0,0.0,0.0,1.0
1718118852.640195,map,True,False,5,5,0.612995793784914,0.612995793784914,1.2267341613769531,-1.543722152709961,0.0,0.0,0.0,0.031969154334823294,0.9994888489403153,2.933883563253679,-6.945029803372913,0.7974165315745678,0.0,0.0,0.0,1.0
1718118852.6906884,map,True,True,5,5,0.612995793784914,0.612995793784914,1.2267341613769531,-1.543722152709961,0.0,0.0,0.0,0.031969154334823294,0.9994888489403153,2.933883563253679,-6.945029803372913,0.7974165315745678,0.0,0.0,0.0,1.0
1718118852.7909002,map,True,True,5,5,0.612995793784914,0.612995793784914,1.2267341613769531,-1.543722152709961,0.0,0.0,0.0,0.031969154334823294,0.9994888489403153,2.9164572193107583,-6.929660346399795,0.7969175470622062,0.0,0.0,0.0,1.0
1718118852.8487194,map,True,True,5,5,0.612995793784914,0.612995793784914,1.2267341613769531,-1.543722152709961,0.0,0.0,0.0,0.031969154334823294,0.9994888489403153,2.9164572193107583,-6.929660346399795,0.7969175470622062,0.0,0.0,0.0,1.0
1718118852.8942878,map,True,True,5,5,0.612995793784914,0.612995793784914,1.2267341613769531,-1.543722152709961,0.0,0.0,0.0,0.031969154334823294,0.9994888489403153,2.9164572193107583,-6.929660346399795,0.7969175470622062,0.0,0.0,0.0,1.0
1718118852.9472392,map,True,False,5,5,0.612995793784914,0.612995793784914,1.2267341613769531,-1.543722152709961,0.0,0.0,0.0,0.031969154334823294,0.9994888489403153,2.9164572193107583,-6.929660346399795,0.7969175470622062,0.0,0.0,0.0,1.0
1718118853.04372,map,True,True,5,5,0.612995793784914,0.612995793784914,1.2267341613769531,-1.543722152709961,0.0,0.0,0.0,0.031969154334823294,0.9994888489403153,2.9164572193107583,-6.929660346399795,0.7969175470622062,0.0,0.0,0.0,1.0
1718118853.0935037,map,True,True,5,5,0.612995793784914,0.612995793784914,1.2267341613769531,-1.543722152709961,0.0,0.0,0.0,0.031969154334823294,0.9994888489403153,2.8825105037032652,-6.850039557039571,0.787055638978867,0.0,0.0,0.0,1.0
1718118853.1433685,map,True,True,5,5,0.612995793784914,0.612995793784914,1.2267341613769531,-1.543722152709961,0.0,0.0,0.0,0.031969154334823294,0.9994888489403153,2.908349871640132,-6.920064085781907,0.7966445431343134,0.0,0.0,0.0,1.0
1718118853.1937866,map,True,True,5,5,0.612995793784914,0.612995793784914,1.2267341613769531,-1.543722152709961,0.0,0.0,0.0,0.031969154334823294,0.9994888489403153,2.908349871640132,-6.920064085781907,0.7966445431343134,0.0,0.0,0.0,1.0
1718118853.2018356,map,True,False,5,5,0.612995793784914,0.612995793784914,1.2267341613769531,-1.543722152709961,0.0,0.0,0.0,0.031969154334823294,0.9994888489403153,2.908349871640132,-6.920064085781907,0.7966445431343134,0.0,0.0,0.0,1.0
1718118853.2035408,map,True,True,5,5,0.612995793784914,0.612995793784914,1.2267341613769531,-1.543722152709961,0.0,0.0,0.0,0.031969154334823294,0.9994888489403153,2.908349871640132,-6.920064085781907,0.7966445431343134,0.0,0.0,0.0,1.0
1718118853.2077456,map,True,False,5,5,0.612995793784914,0.612995793784914,1.2267341613769531,-1.543722152709961,0.0,0.0,0.0,0.031969154334823294,0.9994888489403153,2.908349871640132,-6.920064085781907,0.7966445431343134,0.0,0.0,0.0,1.0
1718118853.2112029,map,True,False,5,5,0.612995793784914,0.612995793784914,1.2267341613769531,-1.543722152709961,0.0,0.0,0.0,0.031969154334823294,0.9994888489403153,2.908349871640132,-6.920064085781907,0.7966445431343134,0.0,0.0,0.0,1.0
1718118853.215578,map,True,False,5,5,0.612995793784914,0.612995793784914,1.2267341613769531,-1.543722152709961,0.0,0.0,0.0,0.031969154334823294,0.9994888489403153,2.908349871640132,-6.920064085781907,0.7966445431343134,0.0,0.0,0.0,1.0
1718118853.219934,map,True,True,5,5,0.612995793784914,0.612995793784914,1.2267341613769531,-1.543722152709961,0.0,0.0,0.0,0.031969154334823294,0.9994888489403153,2.908349871640132,-6.920064085781907,0.7966445431343134,0.0,0.0,0.0,1.0
1718118853.225092,map,True,True,5,5,0.612995793784914,0.612995793784914,1.2267341613769531,-1.543722152709961,0.0,0.0,0.0,0.031969154334823294,0.9994888489403153,2.908349871640132,-6.920064085781907,0.7966445431343134,0.0,0.0,0.0,1.0
1718118853.2296839,map,True,True,5,5,0.612995793784914,0.612995793784914,1.2267341613769531,-1.543722152709961,0.0,0.0,0.0,0.031969154334823294,0.9994888489403153,2.908349871640132,-6.920064085781907,0.7966445431343134,0.0,0.0,0.0,1.0
1718118853.2337916,map,True,True,5,5,0.612995793784914,0.612995793784914,1.2267341613769531,-1.543722152709961,0.0,0.0,0.0,0.031969154334823294,0.9994888489403153,2.908349871640132,-6.920064085781907,0.7966445431343134,0.0,0.0,0.0,1.0
1718118853.2354648,map,True,True,5,5,0.612995793784914,0.612995793784914,1.2267341613769531,-1.543722152709961,0.0,0.0,0.0,0.031969154334823294,0.9994888489403153,2.908349871640132,-6.920064085781907,0.7966445431343134,0.0,0.0,0.0,1.0
1718118853.2395537,map,True,True,5,5,0.612995793784914,0.612995793784914,1.2267341613769531,-1.543722152709961,0.0,0.0,0.0,0.031969154334823294,0.9994888489403153,2.908349871640132,-6.920064085781907,0.7966445431343134,0.0,0.0,0.0,1.0
1718118853.2427993,map,True,False,5,5,0.612995793784914,0.612995793784914,1.2267341613769531,-1.543722152709961,0.0,0.0,0.0,0.031969154334823294,0.9994888489403153,2.908349871640132,-6.920064085781907,0.7966445431343134,0.0,0.0,0.0,1.0
1718118853.2475863,map,True,True,5,5,0.612995793784914,0.612995793784914,1.2267341613769531,-1.543722152709961,0.0,0.0,0.0,0.031969154334823294,0.9994888489403153,2.908349871640132,-6.920064085781907,0.7966445431343134,0.0,0.0,0.0,1.0
1718118853.4148505,map,True,False,5,6,0.0,0.0,1.2295489311218262,-1.5416756868362427,0.0,0.0,0.0,0.03162695483952389,0.9994997472004191,2.9906835297180283,-7.238562381472837,0.7865447477674686,0.0,0.0,0.0,1.0
1718118853.4688396,map,True,False,5,6,0.0,0.0,1.2295489311218262,-1.5416756868362427,0.0,0.0,0.0,0.03162695483952389,0.9994997472004191,2.9973904291237794,-7.184480676656999,0.7856605245727898,0.0,0.0,0.0,1.0
1718118853.5146327,map,True,False,5,6,0.0,0.0,1.2295489311218262,-1.5416756868362427,0.0,0.0,0.0,0.03162695483952389,0.9994997472004191,2.9973904291237794,-7.184480676656999,0.7856605245727898,0.0,0.0,0.0,1.0
1718118853.5694532,map,True,False,5,6,0.0,0.0,1.2295489311218262,-1.5416756868362427,0.0,0.0,0.0,0.03162695483952389,0.9994997472004191,2.9973904291237794,-7.184480676656999,0.7856605245727898,0.0,0.0,0.0,1.0
1718118853.6200924,map,True,False,5,6,0.0,0.0,1.2295489311218262,-1.5416756868362427,0.0,0.0,0.0,0.03162695483952389,0.9994997472004191,2.9973904291237794,-7.184480676656999,0.7856605245727898,0.0,0.0,0.0,1.0
1718118853.691939,map,True,False,5,6,0.0,0.0,1.2295489311218262,-1.5416756868362427,0.0,0.0,0.0,0.03162695483952389,0.9994997472004191,2.9973904291237794,-7.184480676656999,0.7856605245727898,0.0,0.0,0.0,1.0
1718118853.7706428,map,True,False,5,5,0.612995793784914,0.612995793784914,1.2295489311218262,-1.5416756868362427,0.0,0.0,0.0,0.03162695483952389,0.9994997472004191,3.0093460852285436,-6.95458096240925,0.7652617950648246,0.0,0.0,0.0,1.0
1718118853.8205812,map,True,False,5,5,0.612995793784914,0.612995793784914,1.2295489311218262,-1.5416756868362427,0.0,0.0,0.0,0.03162695483952389,0.9994997472004191,3.0093460852285436,-6.95458096240925,0.7652617950648246,0.0,0.0,0.0,1.0
1718118853.893629,map,True,False,5,5,0.612995793784914,0.612995793784914,1.2262979745864868,-1.5421277284622192,0.0,0.0,0.0,0.03191612916058452,0.9994905485399992,3.0093460852285436,-6.95458096240925,0.7652617950648246,0.0,0.0,0.0,1.0
1718118853.9445179,map,True,True,5,5,0.612995793784914,0.612995793784914,1.2262979745864868,-1.5421277284622192,0.0,0.0,0.0,0.03191612916058452,0.9994905485399992,3.0093460852285436,-6.95458096240925,0.7652617950648246,0.0,0.0,0.0,1.0
1718118853.9946342,map,True,True,5,5,0.612995793784914,0.612995793784914,1.2262979745864868,-1.5421277284622192,0.0,0.0,0.0,0.03191612916058452,0.9994905485399992,3.0093460852285436,-6.95458096240925,0.7652617950648246,0.0,0.0,0.0,1.0
1718118854.0447602,map,True,True,5,5,0.612995793784914,0.612995793784914,1.2262979745864868,-1.5421277284622192,0.0,0.0,0.0,0.03191612916058452,0.9994905485399992,3.0093460852285436,-6.95458096240925,0.7652617950648246,0.0,0.0,0.0,1.0
1718118854.0951838,map,True,True,5,5,0.612995793784914,0.612995793784914,1.2262979745864868,-1.5421277284622192,0.0,0.0,0.0,0.03191612916058452,0.9994905485399992,2.9877529609309055,-6.250875157883939,0.7547389554879722,0.0,0.0,0.0,1.0
1718118854.1454222,map,True,True,5,5,0.612995793784914,0.612995793784914,1.2262979745864868,-1.5421277284622192,0.0,0.0,0.0,0.03191612916058452,0.9994905485399992,2.991096643288673,-6.268565324935565,0.7477792320510741,0.0,0.0,0.0,1.0
1718118854.195446,map,True,True,5,5,0.612995793784914,0.612995793784914,1.2262979745864868,-1.5421277284622192,0.0,0.0,0.0,0.03191612916058452,0.9994905485399992,2.991096643288673,-6.268565324935565,0.7477792320510741,0.0,0.0,0.0,1.0
1718118854.2463522,map,True,True,5,5,0.612995793784914,0.612995793784914,1.2262979745864868,-1.5421277284622192,0.0,0.0,0.0,0.03191612916058452,0.9994905485399992,2.991096643288673,-6.268565324935565,0.7477792320510741,0.0,0.0,0.0,1.0
1718118854.446855,map,True,False,5,5,0.612995793784914,0.612995793784914,1.2262979745864868,-1.5421277284622192,0.0,0.0,0.0,0.03191612916058452,0.9994905485399992,2.9807542509576868,-6.019690386350251,0.7507914450338734,0.0,0.0,0.0,1.0
1718118854.5460007,map,True,False,5,5,0.612995793784914,0.612995793784914,1.2262979745864868,-1.5421277284622192,0.0,0.0,0.0,0.03191612916058452,0.9994905485399992,2.9807542509576868,-6.019690386350251,0.7507914450338734,0.0,0.0,0.0,1.0
1718118854.6453133,map,True,False,5,5,0.612995793784914,0.612995793784914,1.2669875621795654,-1.5477262735366821,0.0,0.0,0.0,0.03161213223603202,0.9995002093675097,2.9807542509576868,-6.019690386350251,0.7507914450338734,0.0,0.0,0.0,1.0
1718118854.6964498,map,True,True,5,5,0.612995793784914,0.612995793784914,1.2669875621795654,-1.5477262735366821,0.0,0.0,0.0,0.03161213223603202,0.9995002093675097,2.9807542509576868,-6.019690386350251,0.7507914450338734,0.0,0.0,0.0,1.0
1718118854.7494888,map,True,False,5,5,0.612995793784914,0.612995793784914,1.2669875621795654,-1.5477262735366821,0.0,0.0,0.0,0.03161213223603202,0.9995002093675097,3.050177634975925,-6.079566825297549,0.7722703054430043,0.0,0.0,0.0,1.0
1718118854.8488193,map,True,False,5,5,0.612995793784914,0.612995793784914,1.2669875621795654,-1.5477262735366821,0.0,0.0,0.0,0.03161213223603202,0.9995002093675097,3.1103175388012514,-6.119083720623944,0.7594793328109594,0.0,0.0,0.0,1.0
1718118854.9048543,map,True,True,5,5,0.612995793784914,0.612995793784914,1.2669875621795654,-1.5477262735366821,0.0,0.0,0.0,0.03161213223603202,0.9995002093675097,3.1103175388012514,-6.119083720623944,0.7594793328109594,0.0,0.0,0.0,1.0
1718118854.9514003,map,True,True,5,5,0.612995793784914,0.612995793784914,1.2669875621795654,-1.5477262735366821,0.0,0.0,0.0,0.03161213223603202,0.9995002093675097,3.1103175388012514,-6.119083720623944,0.7594793328109594,0.0,0.0,0.0,1.0
1718118855.0020328,map,True,True,5,5,0.612995793784914,0.612995793784914,1.2669875621795654,-1.5477262735366821,0.0,0.0,0.0,0.03161213223603202,0.9995002093675097,3.1103175388012514,-6.119083720623944,0.7594793328109594,0.0,0.0,0.0,1.0
1718118855.0518377,map,True,False,5,5,0.612995793784914,0.612995793784914,1.2669875621795654,-1.5477262735366821,0.0,0.0,0.0,0.03161213223603202,0.9995002093675097,3.1103175388012514,-6.119083720623944,0.7594793328109594,0.0,0.0,0.0,1.0
1718118855.101435,map,True,False,5,4,0.0,0.0,1.2669875621795654,-1.5477262735366821,0.0,0.0,0.0,0.03161213223603202,0.9995002093675097,3.170999478487855,-5.741648151281117,0.753194547294492,0.0,0.0,0.0,1.0
1718118855.1516182,map,True,False,5,4,0.0,0.0,1.2669875621795654,-1.5477262735366821,0.0,0.0,0.0,0.03161213223603202,0.9995002093675097,3.170999478487855,-5.741648151281117,0.753194547294492,0.0,0.0,0.0,1.0
1718118855.202441,map,True,False,5,4,0.0,0.0,1.2669875621795654,-1.5477262735366821,0.0,0.0,0.0,0.03161213223603202,0.9995002093675097,3.170999478487855,-5.741648151281117,0.753194547294492,0.0,0.0,0.0,1.0
1718118855.4516356,map,True,False,5,4,0.0,0.0,1.3469005823135376,-1.5850543975830078,0.0,0.0,0.0,0.03316234514603702,0.9994499809903303,3.183410888486187,-5.420070717152333,0.7176996950314803,0.0,0.0,0.0,1.0
1718118855.5034819,map,True,False,5,4,0.0,0.0,1.3469005823135376,-1.5850543975830078,0.0,0.0,0.0,0.03316234514603702,0.9994499809903303,3.183410888486187,-5.420070717152333,0.7176996950314803,0.0,0.0,0.0,1.0
1718118855.5524602,map,True,False,5,4,0.0,0.0,1.3469005823135376,-1.5850543975830078,0.0,0.0,0.0,0.03316234514603702,0.9994499809903303,3.183410888486187,-5.420070717152333,0.7176996950314803,0.0,0.0,0.0,1.0
1718118855.6564507,map,True,False,5,4,0.0,0.0,1.3469005823135376,-1.5850543975830078,0.0,0.0,0.0,0.03316234514603702,0.9994499809903303,3.183410888486187,-5.420070717152333,0.7176996950314803,0.0,0.0,0.0,1.0
1718118855.7040014,map,True,False,5,4,0.0,0.0,1.3469005823135376,-1.5850543975830078,0.0,0.0,0.0,0.03316234514603702,0.9994499809903303,3.183410888486187,-5.420070717152333,0.7176996950314803,0.0,0.0,0.0,1.0
1718118855.7550046,map,True,False,5,4,0.0,0.0,1.3469005823135376,-1.5850543975830078,0.0,0.0,0.0,0.03316234514603702,0.9994499809903303,3.192782615024988,-5.216365988400478,0.7386587074031945,0.0,0.0,0.0,1.0
1718118855.8549714,map,True,False,5,4,0.0,0.0,1.3469005823135376,-1.5850543975830078,0.0,0.0,0.0,0.03316234514603702,0.9994499809903303,3.261012999203029,-5.261774239127923,0.7221372180424674,0.0,0.0,0.0,1.0
1718118855.9048855,map,True,False,5,4,0.0,0.0,1.3469005823135376,-1.5850543975830078,0.0,0.0,0.0,0.03316234514603702,0.9994499809903303,3.261012999203029,-5.261774239127923,0.7221372180424674,0.0,0.0,0.0,1.0
1718118855.9552555,map,True,False,5,4,0.0,0.0,1.3469005823135376,-1.5850543975830078,0.0,0.0,0.0,0.03316234514603702,0.9994499809903303,3.261012999203029,-5.261774239127923,0.7221372180424674,0.0,0.0,0.0,1.0
1718118856.0051808,map,True,False,5,4,0.0,0.0,1.3469005823135376,-1.5850543975830078,0.0,0.0,0.0,0.03316234514603702,0.9994499809903303,3.261012999203029,-5.261774239127923,0.7221372180424674,0.0,0.0,0.0,1.0
1718118856.0562952,map,True,False,5,4,0.0,0.0,1.3469005823135376,-1.5850543975830078,0.0,0.0,0.0,0.03316234514603702,0.9994499809903303,3.261012999203029,-5.261774239127923,0.7221372180424674,0.0,0.0,0.0,1.0
1718118856.1069849,map,True,False,5,4,0.0,0.0,1.443816900253296,-1.6165804862976074,0.0,0.0,0.0,0.03394586860088212,0.9994236656206202,3.3982907616082976,-5.050070776420949,0.71991061016387,0.0,0.0,0.0,1.0
1718118856.1576397,map,True,False,5,4,0.0,0.0,1.443816900253296,-1.6165804862976074,0.0,0.0,0.0,0.03394586860088212,0.9994236656206202,3.3982907616082976,-5.050070776420949,0.71991061016387,0.0,0.0,0.0,1.0
1718118856.20785,map,True,False,5,4,0.0,0.0,1.443816900253296,-1.6165804862976074,0.0,0.0,0.0,0.03394586860088212,0.9994236656206202,3.3982907616082976,-5.050070776420949,0.71991061016387,0.0,0.0,0.0,1.0
1718118856.4064991,map,True,False,5,3,0.0,0.0,1.443816900253296,-1.6165804862976074,0.0,0.0,0.0,0.03394586860088212,0.9994236656206202,3.346967626982889,-4.70021732585955,0.7108453803126061,0.0,0.0,0.0,1.0
1718118856.4570937,map,True,False,5,3,0.0,0.0,1.443816900253296,-1.6165804862976074,0.0,0.0,0.0,0.03394586860088212,0.9994236656206202,3.361327793619423,-4.666157487816778,0.6854681641636312,0.0,0.0,0.0,1.0
1718118856.506729,map,True,False,5,3,0.0,0.0,1.443816900253296,-1.6165804862976074,0.0,0.0,0.0,0.03394586860088212,0.9994236656206202,3.361327793619423,-4.666157487816778,0.6854681641636312,0.0,0.0,0.0,1.0
1718118856.6065526,map,True,False,5,3,0.0,0.0,1.443816900253296,-1.6165804862976074,0.0,0.0,0.0,0.03394586860088212,0.9994236656206202,3.361327793619423,-4.666157487816778,0.6854681641636312,0.0,0.0,0.0,1.0
1718118856.706484,map,True,False,5,3,0.0,0.0,1.5482513904571533,-1.643592119216919,0.0,0.0,0.0,0.03526358106589133,0.9993780407313596,3.361327793619423,-4.666157487816778,0.6854681641636312,0.0,0.0,0.0,1.0
1718118856.7576647,map,True,False,5,3,0.0,0.0,1.5482513904571533,-1.643592119216919,0.0,0.0,0.0,0.03526358106589133,0.9993780407313596,3.3607247332283166,-4.334988552275716,0.7071955396315319,0.0,0.0,0.0,1.0
1718118856.8574524,map,True,False,5,3,0.0,0.0,1.5482513904571533,-1.643592119216919,0.0,0.0,0.0,0.03526358106589133,0.9993780407313596,3.3945610036883194,-4.393629589445963,0.7123880806760137,0.0,0.0,0.0,1.0
1718118856.9627843,map,True,False,5,3,0.0,0.0,1.5482513904571533,-1.643592119216919,0.0,0.0,0.0,0.03526358106589133,0.9993780407313596,3.3945610036883194,-4.393629589445963,0.7123880806760137,0.0,0.0,0.0,1.0
1718118857.0594704,map,True,False,5,3,0.0,0.0,1.5482513904571533,-1.643592119216919,0.0,0.0,0.0,0.03526358106589133,0.9993780407313596,3.3945610036883194,-4.393629589445963,0.7123880806760137,0.0,0.0,0.0,1.0
1718118857.158351,map,True,False,5,3,0.0,0.0,1.5482513904571533,-1.643592119216919,0.0,0.0,0.0,0.03526358106589133,0.9993780407313596,3.4735118277465595,-4.300586681278766,0.6980025936181412,0.0,0.0,0.0,1.0
1718118857.5070899,map,True,False,4,2,0.0,0.0,1.6350873708724976,-1.6711013317108154,0.0,0.0,0.0,0.03630151912193953,0.9993408832368768,3.394055753256484,-3.859889525826391,0.6911949785917971,0.0,0.0,0.0,1.0
1718118857.5573065,map,True,False,4,2,0.0,0.0,1.6350873708724976,-1.6711013317108154,0.0,0.0,0.0,0.03630151912193953,0.9993408832368768,3.394055753256484,-3.859889525826391,0.6911949785917971,0.0,0.0,0.0,1.0
1718118857.6090198,map,True,False,4,2,0.0,0.0,1.6350873708724976,-1.6711013317108154,0.0,0.0,0.0,0.03630151912193953,0.9993408832368768,3.394055753256484,-3.859889525826391,0.6911949785917971,0.0,0.0,0.0,1.0
1718118857.7094855,map,True,False,4,2,0.0,0.0,1.6350873708724976,-1.6711013317108154,0.0,0.0,0.0,0.03630151912193953,0.9993408832368768,3.394055753256484,-3.859889525826391,0.6911949785917971,0.0,0.0,0.0,1.0
1718118857.7617245,map,True,False,4,2,0.0,0.0,1.6350873708724976,-1.6711013317108154,0.0,0.0,0.0,0.03630151912193953,0.9993408832368768,3.5140834900263638,-3.651825180679878,0.6688683812091897,0.0,0.0,0.0,1.0
1718118857.8135674,map,True,False,4,2,0.0,0.0,1.6350873708724976,-1.6711013317108154,0.0,0.0,0.0,0.03630151912193953,0.9993408832368768,3.5084570972429274,-3.615519014927062,0.6690047969378731,0.0,0.0,0.0,1.0
1718118857.8612936,map,True,False,4,2,0.0,0.0,1.6350873708724976,-1.6711013317108154,0.0,0.0,0.0,0.03630151912193953,0.9993408832368768,3.5084570972429274,-3.615519014927062,0.6690047969378731,0.0,0.0,0.0,1.0
1718118857.962939,map,True,False,4,2,0.0,0.0,1.6350873708724976,-1.6711013317108154,0.0,0.0,0.0,0.03630151912193953,0.9993408832368768,3.5084570972429274,-3.615519014927062,0.6690047969378731,0.0,0.0,0.0,1.0
1718118858.0128648,map,True,False,4,2,0.0,0.0,1.6350873708724976,-1.6711013317108154,0.0,0.0,0.0,0.03630151912193953,0.9993408832368768,3.5084570972429274,-3.615519014927062,0.6690047969378731,0.0,0.0,0.0,1.0
1718118858.0633347,map,True,False,4,2,0.0,0.0,1.6350873708724976,-1.6711013317108154,0.0,0.0,0.0,0.03630151912193953,0.9993408832368768,3.5084570972429274,-3.615519014927062,0.6690047969378731,0.0,0.0,0.0,1.0
1718118858.1648207,map,True,False,4,2,0.0,0.0,1.6350873708724976,-1.6711013317108154,0.0,0.0,0.0,0.03630151912193953,0.9993408832368768,3.588223171947277,-3.4089851793676513,0.6854329953829685,0.0,0.0,0.0,1.0
1718118858.2131166,map,True,False,4,2,0.0,0.0,1.6350873708724976,-1.6711013317108154,0.0,0.0,0.0,0.03630151912193953,0.9993408832368768,3.588223171947277,-3.4089851793676513,0.6854329953829685,0.0,0.0,0.0,1.0
1718118858.413939,map,True,False,4,2,0.0,0.0,1.7456492185592651,-1.7193427085876465,0.0,0.0,0.0,0.03787130803857544,0.9992826243036012,3.6002191196386786,-3.195371076193328,0.6818076765900143,0.0,0.0,0.0,1.0
1718118858.4636931,map,True,False,4,2,0.0,0.0,1.7456492185592651,-1.7193427085876465,0.0,0.0,0.0,0.03787130803857544,0.9992826243036012,3.676169952014083,-3.089572796798769,0.6841225006193624,0.0,0.0,0.0,1.0
1718118858.5232053,map,True,False,4,2,0.0,0.0,1.7456492185592651,-1.7193427085876465,0.0,0.0,0.0,0.03787130803857544,0.9992826243036012,3.676169952014083,-3.089572796798769,0.6841225006193624,0.0,0.0,0.0,1.0
1718118858.5670338,map,True,False,4,2,0.0,0.0,1.7456492185592651,-1.7193427085876465,0.0,0.0,0.0,0.03787130803857544,0.9992826243036012,3.676169952014083,-3.089572796798769,0.6841225006193624,0.0,0.0,0.0,1.0
1718118858.6649003,map,True,False,4,2,0.0,0.0,1.7456492185592651,-1.7193427085876465,0.0,0.0,0.0,0.03787130803857544,0.9992826243036012,3.676169952014083,-3.089572796798769,0.6841225006193624,0.0,0.0,0.0,1.0
1718118858.715049,map,True,False,4,2,0.0,0.0,1.7456492185592651,-1.7193427085876465,0.0,0.0,0.0,0.03787130803857544,0.9992826243036012,3.676169952014083,-3.089572796798769,0.6841225006193624,0.0,0.0,0.0,1.0
1718118858.8148215,map,True,False,4,2,0.0,0.0,1.7456492185592651,-1.7193427085876465,0.0,0.0,0.0,0.03787130803857544,0.9992826243036012,3.639716762642513,-2.908155585081735,0.6834913376546288,0.0,0.0,0.0,1.0
1718118858.864935,map,True,False,4,2,0.0,0.0,1.7456492185592651,-1.7193427085876465,0.0,0.0,0.0,0.03787130803857544,0.9992826243036012,3.639716762642513,-2.908155585081735,0.6834913376546288,0.0,0.0,0.0,1.0
1718118858.915338,map,True,False,4,2,0.0,0.0,1.7456492185592651,-1.7193427085876465,0.0,0.0,0.0,0.03787130803857544,0.9992826243036012,3.639716762642513,-2.908155585081735,0.6834913376546288,0.0,0.0,0.0,1.0
1718118858.9660423,map,True,False,4,2,0.0,0.0,1.7456492185592651,-1.7193427085876465,0.0,0.0,0.0,0.03787130803857544,0.9992826243036012,3.639716762642513,-2.908155585081735,0.6834913376546288,0.0,0.0,0.0,1.0
1718118859.0165398,map,True,False,4,2,0.0,0.0,1.7456492185592651,-1.7193427085876465,0.0,0.0,0.0,0.03787130803857544,0.9992826243036012,3.639716762642513,-2.908155585081735,0.6834913376546288,0.0,0.0,0.0,1.0
1718118859.1161563,map,True,False,4,1,0.0,0.0,1.9044511318206787,-1.7565467357635498,0.0,0.0,0.0,0.038337863117379904,0.9992648342979371,3.7280669249193865,-2.6168648356380517,0.6822797787359944,0.0,0.0,0.0,1.0
1718118859.1666086,map,True,False,4,1,0.0,0.0,1.9044511318206787,-1.7565467357635498,0.0,0.0,0.0,0.038337863117379904,0.9992648342979371,3.7280669249193865,-2.6168648356380517,0.6822797787359944,0.0,0.0,0.0,1.0
1718118859.473048,map,True,False,4,1,0.0,0.0,1.9044511318206787,-1.7565467357635498,0.0,0.0,0.0,0.038337863117379904,0.9992648342979371,3.776378465496433,-2.357560234279372,0.682897830899879,0.0,0.0,0.0,1.0
1718118859.515793,map,True,False,4,1,0.0,0.0,1.9044511318206787,-1.7565467357635498,0.0,0.0,0.0,0.038337863117379904,0.9992648342979371,3.779393621596771,-2.3426120599269846,0.6811601539413095,0.0,0.0,0.0,1.0
1718118859.5660675,map,True,False,4,1,0.0,0.0,1.9044511318206787,-1.7565467357635498,0.0,0.0,0.0,0.038337863117379904,0.9992648342979371,3.779393621596771,-2.3426120599269846,0.6811601539413095,0.0,0.0,0.0,1.0
1718118859.6164787,map,True,False,4,1,0.0,0.0,1.9044511318206787,-1.7565467357635498,0.0,0.0,0.0,0.038337863117379904,0.9992648342979371,3.779393621596771,-2.3426120599269846,0.6811601539413095,0.0,0.0,0.0,1.0
1718118859.6708686,map,True,False,4,1,0.0,0.0,1.9044511318206787,-1.7565467357635498,0.0,0.0,0.0,0.038337863117379904,0.9992648342979371,3.779393621596771,-2.3426120599269846,0.6811601539413095,0.0,0.0,0.0,1.0
1718118859.770316,map,True,False,3,1,0.0,0.0,2.0538957118988037,-1.7950199842453003,0.0,0.0,0.0,0.040755531382548095,0.999169153529093,3.779393621596771,-2.3426120599269846,0.6811601539413095,0.0,0.0,0.0,1.0
1718118859.8683224,map,True,False,3,1,0.0,0.0,2.0538957118988037,-1.7950199842453003,0.0,0.0,0.0,0.040755531382548095,0.999169153529093,3.887378036656135,-2.2853765702066875,0.6792086500561628,0.0,0.0,0.0,1.0
1718118859.9724283,map,True,False,3,1,0.0,0.0,2.0538957118988037,-1.7950199842453003,0.0,0.0,0.0,0.040755531382548095,0.999169153529093,3.887378036656135,-2.2853765702066875,0.6792086500561628,0.0,0.0,0.0,1.0
1718118860.0733685,map,True,False,3,1,0.0,0.0,2.0538957118988037,-1.7950199842453003,0.0,0.0,0.0,0.040755531382548095,0.999169153529093,3.887378036656135,-2.2853765702066875,0.6792086500561628,0.0,0.0,0.0,1.0
1718118860.1217687,map,True,False,3,1,0.0,0.0,2.0538957118988037,-1.7950199842453003,0.0,0.0,0.0,0.040755531382548095,0.999169153529093,3.887378036656135,-2.2853765702066875,0.6792086500561628,0.0,0.0,0.0,1.0
1718118860.1742795,map,True,False,3,1,0.0,0.0,2.0538957118988037,-1.7950199842453003,0.0,0.0,0.0,0.040755531382548095,0.999169153529093,3.887378036656135,-2.2853765702066875,0.6792086500561628,0.0,0.0,0.0,1.0
1718118860.2224154,map,True,False,3,1,0.0,0.0,2.0538957118988037,-1.7950199842453003,0.0,0.0,0.0,0.040755531382548095,0.999169153529093,3.887378036656135,-2.2853765702066875,0.6792086500561628,0.0,0.0,0.0,1.0
