car_pos_meter , car_pos_cell, car_speed, ped_pos_meter, ped_pos_cell, ped_speed
-5.125, 5, 1, 4.091019, 5, 1
-5.122125, 5, 1, 4.086094, 5, 1
-5.11925, 5, 1, 4.070944, 5, 1
-5.116375, 5, 2, 4.060632, 5, 1
-5.095551, 5, 1, 4.055349, 5, 1
-5.092676, 5, 2, 4.050012, 5, 1
-5.071851, 5, 1, 4.033605, 5, 1
-5.068976, 5, 1, 4.022305, 5, 1
-5.066101, 5, 1, 4.016626, 5, 1
-5.063226, 5, 1, 4.00474, 5, 1
-5.060351, 5, 1, 3.992709, 5, 1
-5.057477, 5, 1, 3.980007, 5, 1
-5.054602, 5, 1, 3.967121, 5, 1
-5.051727, 5, 2, 3.95397, 5, 1
-5.030902, 5, 2, 3.947273, 5, 1
-5.010077, 5, 1, 3.933889, 5, 1
-5.007202, 5, 1, 3.920248, 5, 1
-5.004327, 5, 2, 3.9061, 5, 1
-4.983502, 4, 2, 3.891732, 5, 1
-4.962677, 4, 2, 3.884191, 5, 1
-4.941853, 4, 2, 3.868743, 5, 1
-4.921028, 4, 2, 3.85274, 5, 1
-4.900203, 4, 2, 3.837115, 4, 1
-4.879378, 4, 2, 3.820626, 4, 1
-4.858553, 4, 2, 3.812566, 4, 1
-4.837728, 4, 1, 3.796365, 4, 1
-4.834853, 4, 1, 3.780786, 4, 1
-4.831978, 4, 2, 3.765809, 4, 1
-4.811153, 4, 2, 3.751286, 4, 1
-4.790329, 4, 2, 3.743991, 4, 1
-4.769504, 4, 1, 3.729289, 4, 1
-4.766629, 4, 1, 3.714163, 4, 1
-4.763754, 4, 2, 3.699014, 4, 1
-4.742929, 4, 1, 3.68376, 4, 1
-4.740054, 4, 1, 3.676235, 4, 1
-4.737179, 4, 1, 3.660964, 4, 1
-4.734304, 4, 1, 3.645461, 4, 1
-4.73143, 4, 2, 3.629986, 4, 1
-4.710605, 4, 1, 3.614463, 4, 1
-4.70773, 4, 2, 3.606841, 4, 1
-4.686905, 4, 2, 3.591373, 4, 1
-4.66608, 4, 1, 3.576268, 4, 1
-4.663205, 4, 2, 3.560976, 4, 1
-4.64238, 4, 1, 3.545396, 4, 1
-4.639505, 4, 1, 3.537565, 4, 1
-4.636631, 4, 1, 3.521829, 4, 1
-4.633756, 4, 2, 3.505799, 4, 1
-4.612931, 4, 2, 3.489589, 4, 1
-4.592106, 4, 1, 3.472921, 4, 1
-4.589231, 4, 1, 3.46434, 4, 1
-4.586356, 4, 1, 3.447217, 4, 1
-4.583481, 4, 1, 3.42998, 4, 1
-4.580606, 4, 2, 3.412361, 4, 1
-4.559782, 4, 1, 3.394971, 4, 1
-4.556907, 4, 1, 3.386288, 4, 1
-4.554032, 4, 1, 3.368714, 4, 1
-4.551157, 4, 2, 3.350944, 4, 1
-4.530332, 4, 2, 3.334081, 4, 1
-4.509507, 4, 1, 3.31707, 4, 1
-4.506632, 4, 2, 3.308189, 4, 1
-4.485807, 4, 1, 3.291433, 4, 1
-4.482933, 4, 2, 3.275235, 4, 1
-4.462108, 4, 2, 3.259542, 4, 1
-4.441283, 4, 1, 3.243968, 4, 1
-4.438408, 4, 1, 3.236172, 4, 1
-4.435533, 4, 2, 3.220736, 4, 1
-4.414708, 4, 2, 3.205702, 4, 1
-4.393883, 4, 1, 3.190807, 4, 1
-4.391008, 4, 1, 3.175666, 4, 1
-4.388134, 4, 2, 3.16805, 4, 1
-4.367309, 4, 1, 3.152221, 4, 1
-4.364434, 4, 2, 3.136406, 4, 1
-4.343609, 4, 1, 3.120636, 4, 1
-4.340734, 4, 1, 3.104536, 4, 1
-4.337859, 4, 1, 3.096812, 4, 1
-4.334984, 4, 1, 3.080217, 4, 1
-4.332109, 4, 2, 3.063559, 3, 1
-4.311285, 4, 2, 3.046724, 3, 1
-4.29046, 4, 2, 3.038295, 3, 1
-4.269635, 4, 2, 3.021119, 3, 1
-4.24881, 4, 2, 3.003723, 3, 1
-4.227985, 4, 2, 2.985982, 3, 1
-4.20716, 4, 2, 2.96747, 3, 1
-4.186335, 4, 2, 2.958055, 3, 1
-4.16551, 4, 2, 2.938951, 3, 1
-4.144685, 4, 2, 2.919418, 3, 1
-4.12386, 4, 2, 2.899497, 3, 1
-4.103035, 4, 2, 2.879477, 3, 1
-4.082211, 4, 2, 2.859551, 3, 1
-4.061386, 4, 2, 2.849356, 3, 1
-4.040561, 4, 2, 2.829021, 3, 1
-4.019736, 4, 2, 2.809083, 3, 1
-3.998911, 3, 1, 2.789613, 3, 1
-3.996036, 3, 1, 2.769335, 3, 1
-3.993161, 3, 2, 2.75959, 3, 1
-3.972336, 3, 2, 2.740099, 3, 1
-3.951511, 3, 1, 2.721259, 3, 1
-3.948636, 3, 1, 2.702971, 3, 1
-3.945761, 3, 1, 2.68476, 3, 1
-3.942886, 3, 2, 2.665836, 3, 1
-3.922061, 3, 2, 2.656705, 3, 1
-3.901236, 3, 1, 2.638495, 3, 1
-3.898361, 3, 1, 2.620791, 3, 1
-3.895486, 3, 1, 2.603343, 3, 1
-3.892611, 3, 1, 2.594307, 3, 1
-3.889735, 3, 2, 2.577308, 3, 1
-3.868911, 3, 1, 2.560081, 3, 1
-3.866035, 3, 1, 2.542944, 3, 1
-3.86316, 3, 2, 2.525687, 3, 1
-3.842335, 3, 1, 2.516689, 3, 1
-3.83946, 3, 2, 2.499338, 3, 1
-3.818635, 3, 1, 2.481689, 3, 1
-3.81576, 3, 1, 2.464396, 3, 1
-3.812885, 3, 2, 2.447003, 3, 1
-3.79206, 3, 1, 2.438074, 3, 1
-3.789185, 3, 1, 2.420712, 3, 1
-3.78631, 3, 1, 2.402809, 3, 1
-3.783435, 3, 1, 2.384882, 3, 1
-3.78056, 3, 2, 2.366898, 3, 1
-3.759735, 3, 1, 2.358173, 3, 1
-3.75686, 3, 2, 2.340553, 3, 1
-3.736035, 3, 1, 2.32227, 3, 1
-3.73316, 3, 2, 2.305361, 2, 1
-3.712335, 3, 2, 2.288756, 2, 1
-3.69151, 3, 2, 2.279705, 2, 1
-3.670685, 3, 2, 2.262399, 2, 1
-3.64986, 3, 2, 2.245528, 2, 1
-3.629035, 3, 2, 2.228981, 2, 1
-3.608211, 3, 2, 2.220758, 2, 1
-3.587386, 3, 2, 2.204637, 2, 1
-3.566561, 3, 2, 2.189159, 2, 1
-3.545736, 3, 2, 2.173274, 2, 1
-3.524911, 3, 2, 2.157973, 2, 1
-3.504086, 3, 2, 2.143243, 2, 1
-3.483261, 3, 2, 2.135905, 2, 1
-3.462436, 3, 2, 2.121816, 2, 1
-3.441611, 3, 2, 2.107222, 2, 1
-3.420786, 3, 2, 2.09345, 2, 1
-3.399961, 3, 2, 2.080002, 2, 1
-3.379137, 3, 2, 2.073105, 2, 1
-3.358312, 3, 2, 2.059728, 2, 1
-3.337487, 3, 2, 2.045959, 2, 1
-3.316662, 3, 2, 2.031912, 2, 1
-3.295837, 3, 2, 2.017587, 2, 1
-3.275012, 3, 2, 2.002697, 2, 1
-3.254187, 3, 2, 1.995427, 2, 1
-3.233362, 3, 2, 1.980058, 2, 1
-3.212537, 3, 2, 1.964583, 2, 1
-3.191712, 3, 2, 1.949068, 2, 1
-3.170887, 3, 2, 1.940972, 2, 1
-3.150063, 3, 2, 1.924499, 2, 1
-3.129238, 3, 2, 1.907364, 2, 1
-3.108413, 3, 2, 1.890903, 2, 1
-3.087588, 3, 2, 1.873857, 2, 1
-3.066763, 3, 2, 1.865132, 2, 1
-3.045938, 3, 2, 1.84797, 2, 1
-3.025113, 3, 2, 1.830238, 2, 1
-3.004288, 3, 2, 1.812936, 2, 1
-2.983463, 2, 1, 1.795475, 2, 1
-2.980588, 2, 1, 1.786169, 2, 1
-2.977713, 2, 1, 1.767768, 2, 1
-2.974838, 2, 1, 1.749253, 2, 1
-2.971963, 2, 2, 1.730505, 2, 1
-2.951138, 2, 1, 1.711877, 2, 1
-2.948263, 2, 1, 1.702801, 2, 1
-2.945388, 2, 2, 1.68516, 2, 1
-2.924563, 2, 2, 1.667665, 2, 1
-2.903738, 2, 2, 1.651074, 2, 1
-2.882913, 2, 1, 1.633802, 2, 1
-2.880038, 2, 2, 1.625239, 2, 1
-2.859213, 2, 1, 1.607375, 2, 1
-2.856338, 2, 1, 1.589146, 2, 1
-2.853463, 2, 2, 1.571537, 2, 1
-2.832638, 2, 1, 1.554044, 2, 1
-2.829763, 2, 2, 1.536007, 1, 1
-2.808938, 2, 2, 1.527168, 1, 1
-2.788113, 2, 2, 1.509316, 1, 1
-2.767288, 2, 2, 1.491561, 1, 1
-2.746463, 2, 2, 1.47419, 1, 1
-2.725638, 2, 2, 1.465997, 1, 1
-2.704813, 2, 2, 1.448946, 1, 1
-2.683989, 2, 2, 1.432351, 1, 1
-2.663164, 2, 2, 1.415623, 1, 1
-2.642339, 2, 2, 1.399352, 1, 1
-2.621514, 2, 2, 1.390913, 1, 1
-2.600689, 2, 2, 1.374268, 1, 1
-2.579864, 2, 2, 1.357328, 1, 1
-2.559039, 2, 2, 1.340198, 1, 1
-2.538214, 2, 2, 1.322951, 1, 1
-2.517389, 2, 2, 1.314676, 1, 1
-2.496564, 2, 2, 1.29754, 1, 1
-2.475739, 2, 2, 1.280499, 1, 1
-2.454915, 2, 2, 1.26313, 1, 1
-2.43409, 2, 2, 1.246182, 1, 1
-2.413265, 2, 2, 1.237778, 1, 1
-2.39244, 2, 2, 1.220291, 1, 1
-2.371615, 2, 2, 1.202205, 1, 1
-2.35079, 2, 2, 1.184282, 1, 1
-2.329965, 2, 2, 1.166674, 1, 1
-2.30914, 2, 2, 1.149558, 1, 1
-2.288315, 2, 2, 1.141016, 1, 1
-2.26749, 2, 2, 1.124058, 1, 1
-2.246665, 2, 2, 1.116062, 1, 1
-2.225841, 2, 2, 1.082026, 1, 1
-2.205016, 2, 2, 1.073686, 1, 1
-2.184191, 2, 2, 1.057232, 1, 1
-2.163366, 2, 2, 1.049092, 1, 1
-2.142541, 2, 2, 1.032936, 1, 1
-2.121716, 2, 2, 1.016824, 1, 1
-2.100891, 2, 2, 1.000765, 1, 1
-2.080066, 2, 2, 0.9847958, 1, 1
-2.059241, 2, 2, 0.9768617, 1, 1
-2.038416, 2, 2, 0.9524305, 1, 1
-2.017591, 2, 2, 0.9441998, 1, 1
-1.996766, 1, 2, 0.9269803, 1, 1
-1.975941, 1, 2, 0.9181714, 1, 1
-1.955116, 1, 2, 0.9005034, 1, 1
-1.934291, 1, 2, 0.8824663, 1, 1
-1.913466, 1, 2, 0.8645039, 1, 1
-1.892641, 1, 2, 0.846416, 1, 1
-1.871816, 1, 2, 0.8284545, 1, 1
-1.850991, 1, 2, 0.8193707, 1, 1
-1.830166, 1, 2, 0.801024, 1, 1
-1.809341, 1, 2, 0.7822111, 1, 1
-1.788516, 1, 2, 0.7624063, 0, 1
-1.767691, 1, 2, 0.7422864, 0, 1
-1.746866, 1, 2, 0.7321467, 0, 1
-1.726041, 1, 2, 0.7110121, 0, 1
-1.705216, 1, 2, 0.6890721, 0, 1
-1.684391, 1, 2, 0.6671824, 0, 1
-1.663566, 1, 2, 0.6560802, 0, 1
-1.642741, 1, 2, 0.6346133, 0, 1
-1.621916, 1, 2, 0.6130567, 0, 1
-1.601091, 1, 2, 0.5911942, 0, 1
-1.580266, 1, 2, 0.5805264, 0, 1
-1.559441, 1, 2, 0.5583026, 0, 1
-1.538616, 1, 2, 0.5362449, 0, 1
-1.517791, 1, 2, 0.5146859, 0, 1
-1.496966, 1, 2, 0.4933715, 0, 1
-1.476141, 1, 2, 0.4725382, 0, 1
-1.455316, 1, 2, 0.462297, 0, 1
-1.434491, 1, 2, 0.4422479, 0, 1
-1.413666, 1, 2, 0.4228263, 0, 1
-1.392841, 1, 2, 0.4036002, 0, 1
-1.372016, 1, 2, 0.3847752, 0, 1
-1.351191, 1, 2, 0.3748906, 0, 1
-1.330366, 1, 2, 0.3553429, 0, 1
-1.309541, 1, 2, 0.3360205, 0, 1
-1.288715, 1, 2, 0.3167958, 0, 1
-1.26789, 1, 2, 0.2980084, 0, 1
-1.247065, 1, 2, 0.2886863, 0, 1
-1.22624, 1, 2, 0.2698162, 0, 1
-1.205415, 1, 2, 0.2513311, 0, 1
-1.18459, 1, 2, 0.2326245, 0, 1
-1.163765, 1, 2, 0.2129569, 0, 1
-1.14294, 1, 2, 0.2026663, 0, 1
-1.122115, 1, 2, 0.1842217, 0, 1
-1.10129, 1, 2, 0.1659772, 0, 1
-1.080465, 1, 2, 0.1462328, 0, 1
-1.05964, 1, 2, 0.1289372, 0, 1
-1.038815, 1, 2, 0.1207049, 0, 1
-1.01799, 1, 2, 0.1041801, 0, 1
-0.9971651, 0, 2, 0.08782387, 0, 1
-0.9763401, 0, 2, 0.07151031, 0, 1
-0.955515, 0, 2, 0.05492163, 0, 1
-0.93469, 0, 2, 0.04599738, 0, 1
-0.913865, 0, 2, 0.02901554, 0, 1
-0.8930399, 0, 2, 0.013309, 0, 1
-0.8722149, 0, 2, -0.002222061, 0, 1
-0.8513899, 0, 2, -0.01727247, 0, 1
-0.8305649, 0, 2, -0.02501297, 0, 1
-0.8097398, 0, 2, -0.04055882, 0, 1
-0.7889148, 0, 2, -0.0560751, 0, 1
-0.7680898, 0, 2, -0.071738, 0, 1
-0.7472647, 0, 2, -0.08727694, 0, 1
-0.7264397, 0, 2, -0.09523773, 0, 1
-0.7056147, 0, 2, -0.1113584, 0, 1
-0.6847897, 0, 2, -0.1276803, 0, 1
-0.6639646, 0, 2, -0.1434767, 0, 1
-0.6431396, 0, 2, -0.1518548, 0, 1
-0.6223146, 0, 2, -0.1681352, 0, 1
-0.6014895, 0, 2, -0.1761222, 0, 1
-0.5806645, 0, 2, -0.2000895, 0, 1
-0.5598395, 0, 2, -0.21701, 0, 1
-0.5390145, 0, 2, -0.2340479, 0, 1
-0.5181894, 0, 2, -0.2420049, 0, 1
-0.4973644, 0, 2, -0.2586184, 0, 1
-0.4765394, 0, 2, -0.2768717, 0, 1
-0.4557144, 0, 2, -0.2938576, 0, 1
-0.4348894, 0, 2, -0.3106401, 0, 1
-0.4140644, 0, 2, -0.3194015, 0, 1
-0.3932394, 0, 2, -0.3362627, 0, 1
-0.3724144, 0, 2, -0.3526897, 0, 1
-0.3515894, 0, 2, -0.3687072, 0, 1
-0.3307644, 0, 2, -0.3837306, 0, 1
-0.3099394, 0, 2, -0.3910058, 0, 1
-0.2891144, 0, 2, -0.4058015, 0, 1
-0.2682894, 0, 2, -0.4208765, 0, 1
-0.2474644, 0, 2, -0.4354391, 0, 1
-0.2266394, 0, 2, -0.4490805, 0, 1
-0.2058145, 0, 2, -0.4559474, 0, 1
-0.1849895, 0, 2, -0.4695766, 0, 1
-0.1641645, 0, 2, -0.4829569, 0, 1
-0.1433395, 0, 2, -0.49611, 0, 1
-0.1225145, 0, 2, -0.5027008, 0, 1
-0.1016895, 0, 2, -0.5157499, 0, 1
-0.08086446, 0, 2, -0.5287089, 0, 1
-0.06003946, 0, 2, -0.5421159, 0, 1
-0.03921446, 0, 2, -0.5551558, 0, 1
-0.01838947, 0, 2, -0.5616741, 0, 1
0.002435533, 0, 2, -0.5744462, 0, 1
0.02326053, 0, 2, -0.5868278, 0, 1
0.04408553, 0, 2, -0.5988321, 0, 1
0.06491053, 0, 2, -0.6104417, 0, 1
0.08573553, 0, 2, -0.6163902, 0, 1
0.1065605, 0, 2, -0.628078, 0, 1
0.1273855, 0, 2, -0.6392608, 0, 1
0.1482105, 0, 2, -0.6507721, 0, 1
0.1690355, 0, 2, -0.6631885, 0, 1
0.1898605, 0, 2, -0.6693311, 0, 1
0.2106855, 0, 2, -0.6814723, 0, 1
0.2315105, 0, 2, -0.6927772, 0, 1
0.2523355, 0, 2, -0.7034802, 0, 1
0.2731605, 0, 2, -0.708776, 0, 1
0.2939855, 0, 2, -0.7197828, 0, 1
0.3148105, 0, 2, -0.7301075, 0, 1
0.3356355, 0, 2, -0.7388425, 0, 1
0.3564605, 0, 2, -0.7459304, 0, 1
0.3772855, 0, 2, -0.7511804, 0, 1
0.3981105, 0, 2, -0.7529993, 0, 1
0.4189355, 0, 2, -0.7562208, 0, 1
0.4397605, 0, 2, -0.7576981, 0, 1
0.4605855, 0, 2, -0.75808, 0, 1
0.4814105, 0, 2, -0.7569156, 0, 1
0.5022355, 0, 2, -0.752892, 0, 1
0.5230606, 0, 2, -0.7516832, 0, 1
0.5438856, 0, 2, -0.7484932, 0, 1
0.5647106, 0, 2, -0.7450442, 0, 1
0.5855356, 0, 2, -0.7412624, 0, 1
0.6063607, 0, 2, -0.7381067, 0, 1
0.6271857, 0, 2, -0.7357955, 0, 1
0.6480107, 0, 2, -0.7347269, 0, 1
0.6688358, 0, 2, -0.7335289, 0, 1
0.6896608, 0, 2, -0.7325273, 0, 1
0.7104858, 0, 2, -0.7324347, 0, 1
0.7313108, 0, 2, -0.7321677, 0, 1
0.7521359, 0, 2, -0.7318935, 0, 1
0.7729609, 0, 2, -0.7316413, 0, 1
0.7937859, 0, 2, -0.7309046, 0, 1
0.814611, 0, 2, -0.7301049, 0, 1
0.835436, 0, 2, -0.7295401, 0, 1
0.856261, 0, 2, -0.7285419, 0, 1
0.877086, 0, 2, -0.7276342, 0, 1
0.8979111, 0, 2, -0.7273045, 0, 1
0.9187361, 0, 2, -0.727222, 0, 1
0.9395611, 0, 2, -0.7273335, 0, 1
0.9603862, 0, 2, -0.7273569, 0, 1
0.9812112, 0, 2, -0.7278652, 0, 1
1.002036, -1, 2, -0.7290595, 0, 1
1.022861, -1, 2, -0.7306023, 0, 1
1.043686, -1, 2, -0.7315335, 0, 1
1.064511, -1, 2, -0.7335, 0, 1
1.085336, -1, 2, -0.7359359, 0, 1
1.106161, -1, 2, -0.7383075, 0, 1
1.126986, -1, 2, -0.7417774, 0, 1
1.147811, -1, 2, -0.7457628, 0, 1
1.168636, -1, 2, -0.7479329, 0, 1
1.189461, -1, 2, -0.7527356, 0, 1
1.210286, -1, 2, -0.7573628, 0, 1
1.231112, -1, 2, -0.7631097, 0, 1
1.251937, -1, 2, -0.7695565, -1, 1
1.272762, -1, 2, -0.7732744, -1, 1
1.293587, -1, 2, -0.7777004, -1, 1
1.314412, -1, 2, -0.7849555, -1, 1
1.335237, -1, 2, -0.7927189, -1, 1
1.356062, -1, 2, -0.7966499, -1, 1
1.376887, -1, 2, -0.8044333, -1, 1
1.397712, -1, 2, -0.8119993, -1, 1
1.418537, -1, 2, -0.8193822, -1, 1
1.439362, -1, 2, -0.8260326, -1, 1
1.460187, -1, 2, -0.8324802, -1, 1
1.481012, -1, 2, -0.8351765, -1, 1
1.501837, -1, 2, -0.8403487, -1, 1
1.522662, -1, 2, -0.8450971, -1, 1
1.543487, -1, 2, -0.8489454, -1, 1
1.564312, -1, 2, -0.8510036, -1, 1
1.585137, -1, 2, -0.8543363, -1, 1
1.605962, -1, 2, -0.8578122, -1, 1
1.626787, -1, 2, -0.8600883, -1, 1
1.647612, -1, 2, -0.8617759, -1, 1
1.668437, -1, 2, -0.8625879, -1, 1
1.689262, -1, 2, -0.8628507, -1, 1
1.710087, -1, 2, -0.8632231, -1, 1
1.730912, -1, 2, -0.8632889, -1, 1
1.751737, -1, 2, -0.8627615, -1, 1
1.772562, -1, 2, -0.8621764, -1, 1
1.793387, -1, 2, -0.8613172, -1, 1
1.814212, -1, 2, -0.8604207, -1, 1
1.835037, -1, 2, -0.859375, -1, 1
1.855862, -1, 2, -0.8582563, -1, 1
1.876687, -1, 2, -0.8575149, -1, 1
1.897512, -1, 2, -0.8558195, -1, 1
1.918337, -1, 2, -0.8540983, -1, 1
1.939162, -1, 2, -0.8519416, -1, 1
1.959988, -1, 2, -0.849514, -1, 1
1.980813, -1, 2, -0.8482938, -1, 1
2.001637, -2, 2, -0.8463535, -1, 1
2.022462, -2, 2, -0.8445578, -1, 1
2.043287, -2, 2, -0.8430963, -1, 1
2.064112, -2, 2, -0.8416991, -1, 1
2.084937, -2, 2, -0.8414102, -1, 1
2.105762, -2, 2, -0.8408461, -1, 1
2.126587, -2, 2, -0.8405824, -1, 1
2.147412, -2, 2, -0.8407195, -1, 1
2.168237, -2, 2, -0.8408995, -1, 1
2.189062, -2, 2, -0.841321, -1, 1
2.209887, -2, 2, -0.8417637, -1, 1
2.230711, -2, 2, -0.8425875, -1, 1
2.251536, -2, 2, -0.8436525, -1, 1
2.272361, -2, 2, -0.8444967, -1, 1
2.293186, -2, 2, -0.844959, -1, 1
2.314011, -2, 2, -0.8457918, -1, 1
2.334836, -2, 2, -0.847496, -1, 1
2.355661, -2, 2, -0.8493218, -1, 1
2.376486, -2, 2, -0.8500433, -1, 1
2.397311, -2, 2, -0.8515749, -1, 1
2.418136, -2, 2, -0.8525283, -1, 1
2.438961, -2, 2, -0.8529882, -1, 1
2.459785, -2, 2, -0.8522029, -1, 1
2.48061, -2, 2, -0.8498125, -1, 1
2.501435, -2, 2, -0.8479342, -1, 1
2.52226, -2, 2, -0.8432465, -1, 1
2.543085, -2, 2, -0.8378286, -1, 1
2.56391, -2, 2, -0.8314548, -1, 1
2.584735, -2, 2, -0.8237915, -1, 1
2.60556, -2, 2, -0.8195891, -1, 1
2.626385, -2, 2, -0.810771, -1, 1
2.64721, -2, 2, -0.8010483, -1, 1
2.668035, -2, 2, -0.7908883, -1, 1
2.688859, -2, 2, -0.7795212, -1, 1
2.709684, -2, 2, -0.7740216, -1, 1
2.730509, -2, 2, -0.7623167, 0, 1
2.751334, -2, 2, -0.7502246, 0, 1
2.772159, -2, 2, -0.7438796, 0, 1
2.792984, -2, 2, -0.7236238, 0, 1
2.813809, -2, 2, -0.7162616, 0, 1
2.834634, -2, 2, -0.701581, 0, 1
2.855459, -2, 2, -0.6864996, 0, 1
2.876284, -2, 2, -0.6787827, 0, 1
