timestamp_sec,frame_id,game_played,yielding,player1discrete,player2discrete,player1yieldprob,player2yieldprob,player1_pose_x,player1_pose_y,player1_pose_z,player1_pose_orient_x,player1_pose_orient_y,player1_pose_orient_z,player1_pose_orient_w,player2_pose_x,player2_pose_y,player2_pose_z,player2_pose_orient_x,player2_pose_orient_y,player2_pose_orient_z,player2_pose_orient_w
1717759257.6596878,map,True,False,4,4,0.5922520728754596,0.5922520728754596,2.6790125370025635,-2.4539153575897217,0.0,0.0,0.0,0.0480212932273112,0.9988463124516629,4.503940004720918,-6.773592359336978,1.0634259412608942,0.0,0.0,0.0,1.0
1717759257.7091322,map,True,False,4,4,0.5922520728754596,0.5922520728754596,2.6790125370025635,-2.4539153575897217,0.0,0.0,0.0,0.0480212932273112,0.9988463124516629,4.503940004720918,-6.773592359336978,1.0634259412608942,0.0,0.0,0.0,1.0
1717759257.7598307,map,True,True,4,4,0.5922520728754596,0.5922520728754596,2.6790125370025635,-2.4539153575897217,0.0,0.0,0.0,0.0480212932273112,0.9988463124516629,4.503940004720918,-6.773592359336978,1.0634259412608942,0.0,0.0,0.0,1.0
1717759257.916403,map,True,True,4,4,0.5922520728754596,0.5922520728754596,2.6790125370025635,-2.4539153575897217,0.0,0.0,0.0,0.0480212932273112,0.9988463124516629,4.556864082226464,-6.555089550611622,0.9091128318211084,0.0,0.0,0.0,1.0
1717759257.9624472,map,True,True,4,4,0.5922520728754596,0.5922520728754596,2.8502891063690186,-2.4927003383636475,0.0,0.0,0.0,0.04964635499305106,0.9987668540401449,4.51182676787996,-6.338174776611098,0.7292434091033124,0.0,0.0,0.0,1.0
1717759258.0132234,map,True,False,4,4,0.5922520728754596,0.5922520728754596,2.8502891063690186,-2.4927003383636475,0.0,0.0,0.0,0.04964635499305106,0.9987668540401449,4.51182676787996,-6.338174776611098,0.7292434091033124,0.0,0.0,0.0,1.0
1717759258.1128967,map,True,False,4,4,0.5922520728754596,0.5922520728754596,2.8502891063690186,-2.4927003383636475,0.0,0.0,0.0,0.04964635499305106,0.9987668540401449,4.51182676787996,-6.338174776611098,0.7292434091033124,0.0,0.0,0.0,1.0
1717759258.162988,map,True,False,4,4,0.5922520728754596,0.5922520728754596,2.8502891063690186,-2.4927003383636475,0.0,0.0,0.0,0.04964635499305106,0.9987668540401449,4.51182676787996,-6.338174776611098,0.7292434091033124,0.0,0.0,0.0,1.0
1717759258.2141185,map,True,True,4,4,0.5922520728754596,0.5922520728754596,2.8502891063690186,-2.4927003383636475,0.0,0.0,0.0,0.04964635499305106,0.9987668540401449,4.51182676787996,-6.338174776611098,0.7292434091033124,0.0,0.0,0.0,1.0
1717759258.3139966,map,True,True,4,4,0.5922520728754596,0.5922520728754596,2.8502891063690186,-2.4927003383636475,0.0,0.0,0.0,0.04964635499305106,0.9987668540401449,4.553255911268824,-6.0960721154794815,0.6500553256623443,0.0,0.0,0.0,1.0
1717759258.3655987,map,True,True,4,4,0.5922520728754596,0.5922520728754596,2.8502891063690186,-2.4927003383636475,0.0,0.0,0.0,0.04964635499305106,0.9987668540401449,4.553255911268824,-6.0960721154794815,0.6500553256623443,0.0,0.0,0.0,1.0
1717759258.469243,map,True,False,4,4,0.5922520728754596,0.5922520728754596,2.8502891063690186,-2.4927003383636475,0.0,0.0,0.0,0.04964635499305106,0.9987668540401449,4.553255911268824,-6.0960721154794815,0.6500553256623443,0.0,0.0,0.0,1.0
1717759258.5142105,map,True,False,4,4,0.5922520728754596,0.5922520728754596,2.8502891063690186,-2.4927003383636475,0.0,0.0,0.0,0.04964635499305106,0.9987668540401449,4.553255911268824,-6.0960721154794815,0.6500553256623443,0.0,0.0,0.0,1.0
1717759258.5640988,map,True,True,4,4,0.5922520728754596,0.5922520728754596,2.8502891063690186,-2.4927003383636475,0.0,0.0,0.0,0.04964635499305106,0.9987668540401449,4.553255911268824,-6.0960721154794815,0.6500553256623443,0.0,0.0,0.0,1.0
1717759258.6632273,map,True,False,4,3,0.0,0.0,2.8502891063690186,-2.4927003383636475,0.0,0.0,0.0,0.04964635499305106,0.9987668540401449,4.526527054524629,-5.600604110130635,0.6916910696724342,0.0,0.0,0.0,1.0
1717759258.7140565,map,True,False,4,3,0.0,0.0,2.8502891063690186,-2.4927003383636475,0.0,0.0,0.0,0.04964635499305106,0.9987668540401449,4.526527054524629,-5.600604110130635,0.6916910696724342,0.0,0.0,0.0,1.0
1717759258.9648414,map,True,True,3,3,0.6616527499769684,0.6616527499769684,3.0310771465301514,-2.5153956413269043,0.0,0.0,0.0,0.05054442346789285,0.9987218108752605,4.546282842582851,-5.396349117090903,0.6641955843051873,0.0,0.0,0.0,1.0
1717759259.015281,map,True,True,3,3,0.6616527499769684,0.6616527499769684,3.0310771465301514,-2.5153956413269043,0.0,0.0,0.0,0.05054442346789285,0.9987218108752605,4.546282842582851,-5.396349117090903,0.6641955843051873,0.0,0.0,0.0,1.0
1717759259.117231,map,True,False,3,3,0.6616527499769684,0.6616527499769684,3.0310771465301514,-2.5153956413269043,0.0,0.0,0.0,0.05054442346789285,0.9987218108752605,4.546282842582851,-5.396349117090903,0.6641955843051873,0.0,0.0,0.0,1.0
1717759259.1655529,map,True,True,3,3,0.6616527499769684,0.6616527499769684,3.0310771465301514,-2.5153956413269043,0.0,0.0,0.0,0.05054442346789285,0.9987218108752605,4.546282842582851,-5.396349117090903,0.6641955843051873,0.0,0.0,0.0,1.0
1717759259.2149613,map,True,False,3,3,0.6616527499769684,0.6616527499769684,3.0310771465301514,-2.5153956413269043,0.0,0.0,0.0,0.05054442346789285,0.9987218108752605,4.546282842582851,-5.396349117090903,0.6641955843051873,0.0,0.0,0.0,1.0
1717759259.3152995,map,True,True,3,3,0.6616527499769684,0.6616527499769684,3.0310771465301514,-2.5153956413269043,0.0,0.0,0.0,0.05054442346789285,0.9987218108752605,4.589010483099209,-5.214332969221132,0.6776800271932963,0.0,0.0,0.0,1.0
1717759259.364987,map,True,True,3,3,0.6616527499769684,0.6616527499769684,3.0310771465301514,-2.5153956413269043,0.0,0.0,0.0,0.05054442346789285,0.9987218108752605,4.589010483099209,-5.214332969221132,0.6776800271932963,0.0,0.0,0.0,1.0
1717759259.4647846,map,True,False,3,3,0.6616527499769684,0.6616527499769684,3.0310771465301514,-2.5153956413269043,0.0,0.0,0.0,0.05054442346789285,0.9987218108752605,4.589010483099209,-5.214332969221132,0.6776800271932963,0.0,0.0,0.0,1.0
1717759259.5651968,map,True,False,3,3,0.6616527499769684,0.6616527499769684,3.0310771465301514,-2.5153956413269043,0.0,0.0,0.0,0.05054442346789285,0.9987218108752605,4.589010483099209,-5.214332969221132,0.6776800271932963,0.0,0.0,0.0,1.0
1717759259.616134,map,True,True,3,3,0.6616527499769684,0.6616527499769684,3.0310771465301514,-2.5153956413269043,0.0,0.0,0.0,0.05054442346789285,0.9987218108752605,4.6095782286803235,-4.979647525643463,0.6626228839637883,0.0,0.0,0.0,1.0
1717759259.667926,map,True,True,3,3,0.6616527499769684,0.6616527499769684,3.1886329650878906,-2.54545259475708,0.0,0.0,0.0,0.0518744678578241,0.9986536081656769,4.6095782286803235,-4.979647525643463,0.6626228839637883,0.0,0.0,0.0,1.0
1717759259.7174413,map,True,True,3,3,0.6616527499769684,0.6616527499769684,3.1886329650878906,-2.54545259475708,0.0,0.0,0.0,0.0518744678578241,0.9986536081656769,4.6095782286803235,-4.979647525643463,0.6626228839637883,0.0,0.0,0.0,1.0
1717759259.7672563,map,True,True,3,3,0.6616527499769684,0.6616527499769684,3.1886329650878906,-2.54545259475708,0.0,0.0,0.0,0.0518744678578241,0.9986536081656769,4.6095782286803235,-4.979647525643463,0.6626228839637883,0.0,0.0,0.0,1.0
1717759259.9189463,map,True,False,3,2,0.0,0.0,3.1886329650878906,-2.54545259475708,0.0,0.0,0.0,0.0518744678578241,0.9986536081656769,4.634497601021889,-4.6900842929561435,0.6881539255624426,0.0,0.0,0.0,1.0
1717759259.972897,map,True,False,3,2,0.0,0.0,3.1886329650878906,-2.54545259475708,0.0,0.0,0.0,0.0518744678578241,0.9986536081656769,4.637440171555999,-4.6760584661007725,0.6880939128294804,0.0,0.0,0.0,1.0
1717759260.0207927,map,True,False,3,2,0.0,0.0,3.1886329650878906,-2.54545259475708,0.0,0.0,0.0,0.0518744678578241,0.9986536081656769,4.637440171555999,-4.6760584661007725,0.6880939128294804,0.0,0.0,0.0,1.0
1717759260.1206222,map,True,False,3,2,0.0,0.0,3.1886329650878906,-2.54545259475708,0.0,0.0,0.0,0.0518744678578241,0.9986536081656769,4.637440171555999,-4.6760584661007725,0.6880939128294804,0.0,0.0,0.0,1.0
1717759260.171451,map,True,False,3,2,0.0,0.0,3.1886329650878906,-2.54545259475708,0.0,0.0,0.0,0.0518744678578241,0.9986536081656769,4.637440171555999,-4.6760584661007725,0.6880939128294804,0.0,0.0,0.0,1.0
1717759260.222114,map,True,False,3,2,0.0,0.0,3.1886329650878906,-2.54545259475708,0.0,0.0,0.0,0.0518744678578241,0.9986536081656769,4.637440171555999,-4.6760584661007725,0.6880939128294804,0.0,0.0,0.0,1.0
1717759260.2755063,map,True,False,3,2,0.0,0.0,3.1886329650878906,-2.54545259475708,0.0,0.0,0.0,0.0518744678578241,0.9986536081656769,4.733992160703465,-4.501749095375314,0.687422638997619,0.0,0.0,0.0,1.0
1717759260.3737102,map,True,False,3,2,0.0,0.0,3.1886329650878906,-2.54545259475708,0.0,0.0,0.0,0.0518744678578241,0.9986536081656769,4.733992160703465,-4.501749095375314,0.687422638997619,0.0,0.0,0.0,1.0
1717759260.4727433,map,True,False,3,2,0.0,0.0,3.2693941593170166,-2.565490245819092,0.0,0.0,0.0,0.05457692769530605,0.9985095629408448,4.733992160703465,-4.501749095375314,0.687422638997619,0.0,0.0,0.0,1.0
1717759260.5231605,map,True,False,3,2,0.0,0.0,3.2693941593170166,-2.565490245819092,0.0,0.0,0.0,0.05457692769530605,0.9985095629408448,4.733992160703465,-4.501749095375314,0.687422638997619,0.0,0.0,0.0,1.0
1717759260.6227102,map,True,False,3,2,0.0,0.0,3.2693941593170166,-2.565490245819092,0.0,0.0,0.0,0.05457692769530605,0.9985095629408448,4.748792785823067,-4.405319885096134,0.6870726635965583,0.0,0.0,0.0,1.0
1717759260.674056,map,True,False,3,2,0.0,0.0,3.2693941593170166,-2.565490245819092,0.0,0.0,0.0,0.05457692769530605,0.9985095629408448,4.748792785823067,-4.405319885096134,0.6870726635965583,0.0,0.0,0.0,1.0
1717759260.7266412,map,True,False,3,2,0.0,0.0,3.2693941593170166,-2.565490245819092,0.0,0.0,0.0,0.05457692769530605,0.9985095629408448,4.748792785823067,-4.405319885096134,0.6870726635965583,0.0,0.0,0.0,1.0
1717759260.774804,map,True,False,3,2,0.0,0.0,3.2693941593170166,-2.565490245819092,0.0,0.0,0.0,0.05457692769530605,0.9985095629408448,4.748792785823067,-4.405319885096134,0.6870726635965583,0.0,0.0,0.0,1.0
1717759260.9271362,map,True,False,3,2,0.0,0.0,3.2693941593170166,-2.565490245819092,0.0,0.0,0.0,0.05457692769530605,0.9985095629408448,4.703769642202608,-4.308528773045033,0.6867683056564055,0.0,0.0,0.0,1.0
1717759260.9748878,map,True,False,3,2,0.0,0.0,3.2693941593170166,-2.565490245819092,0.0,0.0,0.0,0.05457692769530605,0.9985095629408448,4.706486155339896,-4.3189905046611985,0.6868049752877491,0.0,0.0,0.0,1.0
1717759261.0271957,map,True,False,3,2,0.0,0.0,3.2693941593170166,-2.565490245819092,0.0,0.0,0.0,0.05457692769530605,0.9985095629408448,4.706486155339896,-4.3189905046611985,0.6868049752877491,0.0,0.0,0.0,1.0
1717759261.1273582,map,True,False,3,2,0.0,0.0,3.2693941593170166,-2.565490245819092,0.0,0.0,0.0,0.05457692769530605,0.9985095629408448,4.706486155339896,-4.3189905046611985,0.6868049752877491,0.0,0.0,0.0,1.0
1717759261.1772778,map,True,False,3,2,0.0,0.0,3.2693941593170166,-2.565490245819092,0.0,0.0,0.0,0.05457692769530605,0.9985095629408448,4.706486155339896,-4.3189905046611985,0.6868049752877491,0.0,0.0,0.0,1.0
1717759261.2767303,map,True,False,2,2,0.49874686716791977,0.49874686716791977,3.3652801513671875,-2.5792906284332275,0.0,0.0,0.0,0.055617923130075374,0.9984521211081915,4.767717500097098,-4.299367029846929,0.6867081186513965,0.0,0.0,0.0,1.0
1717759261.3276932,map,True,True,2,2,0.49874686716791977,0.49874686716791977,3.3652801513671875,-2.5792906284332275,0.0,0.0,0.0,0.055617923130075374,0.9984521211081915,4.767717500097098,-4.299367029846929,0.6867081186513965,0.0,0.0,0.0,1.0
1717759261.427171,map,True,False,2,2,0.49874686716791977,0.49874686716791977,3.3652801513671875,-2.5792906284332275,0.0,0.0,0.0,0.055617923130075374,0.9984521211081915,4.767717500097098,-4.299367029846929,0.6867081186513965,0.0,0.0,0.0,1.0
1717759261.5298827,map,True,False,2,2,0.49874686716791977,0.49874686716791977,3.3652801513671875,-2.5792906284332275,0.0,0.0,0.0,0.055617923130075374,0.9984521211081915,4.767717500097098,-4.299367029846929,0.6867081186513965,0.0,0.0,0.0,1.0
1717759261.595583,map,True,True,2,2,0.49874686716791977,0.49874686716791977,3.3652801513671875,-2.5792906284332275,0.0,0.0,0.0,0.055617923130075374,0.9984521211081915,4.802303405735862,-4.291599492258564,0.6839238351730963,0.0,0.0,0.0,1.0
1717759261.6774535,map,True,False,2,2,0.49874686716791977,0.49874686716791977,3.3652801513671875,-2.5792906284332275,0.0,0.0,0.0,0.055617923130075374,0.9984521211081915,4.8003181252560605,-4.315004992574757,0.6839909659685983,0.0,0.0,0.0,1.0
1717759261.7273567,map,True,False,2,2,0.49874686716791977,0.49874686716791977,3.3652801513671875,-2.5792906284332275,0.0,0.0,0.0,0.055617923130075374,0.9984521211081915,4.8003181252560605,-4.315004992574757,0.6839909659685983,0.0,0.0,0.0,1.0
1717759261.777799,map,True,False,2,2,0.49874686716791977,0.49874686716791977,3.3652801513671875,-2.5792906284332275,0.0,0.0,0.0,0.055617923130075374,0.9984521211081915,4.8003181252560605,-4.315004992574757,0.6839909659685983,0.0,0.0,0.0,1.0
1717759261.9802196,map,True,True,2,2,0.49874686716791977,0.49874686716791977,3.3652801513671875,-2.5792906284332275,0.0,0.0,0.0,0.055617923130075374,0.9984521211081915,4.817178550285141,-4.31311391549489,0.6840566836334018,0.0,0.0,0.0,1.0
1717759262.030186,map,True,False,2,2,0.49874686716791977,0.49874686716791977,3.506826877593994,-2.5939531326293945,0.0,0.0,0.0,0.055940689128524165,0.9984340924367529,4.817178550285141,-4.31311391549489,0.6840566836334018,0.0,0.0,0.0,1.0
1717759262.130175,map,True,True,2,2,0.49874686716791977,0.49874686716791977,3.506826877593994,-2.5939531326293945,0.0,0.0,0.0,0.055940689128524165,0.9984340924367529,4.817178550285141,-4.31311391549489,0.6840566836334018,0.0,0.0,0.0,1.0
1717759262.23051,map,True,True,2,2,0.49874686716791977,0.49874686716791977,3.506826877593994,-2.5939531326293945,0.0,0.0,0.0,0.055940689128524165,0.9984340924367529,4.817178550285141,-4.31311391549489,0.6840566836334018,0.0,0.0,0.0,1.0
1717759262.2817156,map,True,False,2,2,0.49874686716791977,0.49874686716791977,3.506826877593994,-2.5939531326293945,0.0,0.0,0.0,0.055940689128524165,0.9984340924367529,4.896227788728789,-4.430398674403914,0.6814055301020014,0.0,0.0,0.0,1.0
1717759262.3309388,map,True,True,2,2,0.49874686716791977,0.49874686716791977,3.506826877593994,-2.5939531326293945,0.0,0.0,0.0,0.055940689128524165,0.9984340924367529,4.896227788728789,-4.430398674403914,0.6814055301020014,0.0,0.0,0.0,1.0
1717759262.3807771,map,True,False,2,2,0.49874686716791977,0.49874686716791977,3.506826877593994,-2.5939531326293945,0.0,0.0,0.0,0.055940689128524165,0.9984340924367529,4.896227788728789,-4.430398674403914,0.6814055301020014,0.0,0.0,0.0,1.0
1717759262.4316752,map,True,False,2,2,0.49874686716791977,0.49874686716791977,3.506826877593994,-2.5939531326293945,0.0,0.0,0.0,0.055940689128524165,0.9984340924367529,4.896227788728789,-4.430398674403914,0.6814055301020014,0.0,0.0,0.0,1.0
1717759262.531331,map,True,True,2,2,0.49874686716791977,0.49874686716791977,3.506826877593994,-2.5939531326293945,0.0,0.0,0.0,0.055940689128524165,0.9984340924367529,4.896227788728789,-4.430398674403914,0.6814055301020014,0.0,0.0,0.0,1.0
1717759262.6312635,map,True,True,2,2,0.49874686716791977,0.49874686716791977,3.525265693664551,-2.5952231884002686,0.0,0.0,0.0,0.05582497899658683,0.9984405696624705,4.918189263967023,-4.437960073254779,0.8362258502449846,0.0,0.0,0.0,1.0
1717759262.7309465,map,True,True,2,2,0.49874686716791977,0.49874686716791977,3.525265693664551,-2.5952231884002686,0.0,0.0,0.0,0.05582497899658683,0.9984405696624705,4.918189263967023,-4.437960073254779,0.8362258502449846,0.0,0.0,0.0,1.0
