timestamp_sec,frame_id,game_played,yielding,player1discrete,player2discrete,player1yieldprob,player2yieldprob,player1_pose_x,player1_pose_y,player1_pose_z,player1_pose_orient_x,player1_pose_orient_y,player1_pose_orient_z,player1_pose_orient_w,player2_pose_x,player2_pose_y,player2_pose_z,player2_pose_orient_x,player2_pose_orient_y,player2_pose_orient_z,player2_pose_orient_w
1717756689.8985791,map,True,False,9,6,0.0,0.0,0.6913321018218994,-2.003368854522705,0.0,0.0,0.0,0.019636363979752457,0.9998071901886624,3.6822801510435257,-8.567439712874727,0.8538872768218123,0.0,0.0,0.0,1.0
1717756689.95411,map,True,False,9,6,0.0,0.0,0.6913321018218994,-2.003368854522705,0.0,0.0,0.0,0.019636363979752457,0.9998071901886624,3.6822801510435257,-8.567439712874727,0.8538872768218123,0.0,0.0,0.0,1.0
1717756689.9987385,map,True,False,9,6,0.0,0.0,0.6913321018218994,-2.003368854522705,0.0,0.0,0.0,0.019636363979752457,0.9998071901886624,3.6822801510435257,-8.567439712874727,0.8538872768218123,0.0,0.0,0.0,1.0
1717756690.0600476,map,True,False,9,6,0.0,0.0,0.6913321018218994,-2.003368854522705,0.0,0.0,0.0,0.019636363979752457,0.9998071901886624,3.6822801510435257,-8.567439712874727,0.8538872768218123,0.0,0.0,0.0,1.0
1717756690.106709,map,True,False,9,6,0.0,0.0,0.6913321018218994,-2.003368854522705,0.0,0.0,0.0,0.019636363979752457,0.9998071901886624,3.6822801510435257,-8.567439712874727,0.8538872768218123,0.0,0.0,0.0,1.0
1717756690.1587934,map,True,False,9,6,0.0,0.0,0.6913321018218994,-2.003368854522705,0.0,0.0,0.0,0.019636363979752457,0.9998071901886624,3.6822801510435257,-8.567439712874727,0.8538872768218123,0.0,0.0,0.0,1.0
1717756690.2072515,map,True,False,9,6,0.0,0.0,0.6913321018218994,-2.003368854522705,0.0,0.0,0.0,0.019636363979752457,0.9998071901886624,3.641377955790724,-8.43887512166706,0.8504993262375309,0.0,0.0,0.0,1.0
1717756690.3072953,map,True,False,9,6,0.0,0.0,0.6913321018218994,-2.003368854522705,0.0,0.0,0.0,0.019636363979752457,0.9998071901886624,3.641377955790724,-8.43887512166706,0.8504993262375309,0.0,0.0,0.0,1.0
1717756690.406829,map,True,False,9,6,0.0,0.0,0.6913321018218994,-2.003368854522705,0.0,0.0,0.0,0.019636363979752457,0.9998071901886624,3.641377955790724,-8.43887512166706,0.8504993262375309,0.0,0.0,0.0,1.0
1717756690.4623418,map,True,False,9,6,0.0,0.0,0.6913321018218994,-2.003368854522705,0.0,0.0,0.0,0.019636363979752457,0.9998071901886624,3.641377955790724,-8.43887512166706,0.8504993262375309,0.0,0.0,0.0,1.0
1717756690.5075402,map,True,False,9,6,0.0,0.0,0.6913321018218994,-2.003368854522705,0.0,0.0,0.0,0.019636363979752457,0.9998071901886624,3.65407005254756,-8.510888235950336,0.8522137664508239,0.0,0.0,0.0,1.0
1717756690.5581858,map,True,False,9,6,0.0,0.0,0.6919176578521729,-2.004589080810547,0.0,0.0,0.0,0.019741359098411543,0.9998051185256736,3.6846785282719727,-8.570259523685014,0.8538872768218141,0.0,0.0,0.0,1.0
1717756690.6581378,map,True,False,9,6,0.0,0.0,0.6919176578521729,-2.004589080810547,0.0,0.0,0.0,0.019741359098411543,0.9998051185256736,3.6846785282719727,-8.570259523685014,0.8538872768218141,0.0,0.0,0.0,1.0
1717756690.7612278,map,True,False,9,6,0.0,0.0,0.6919176578521729,-2.004589080810547,0.0,0.0,0.0,0.019741359098411543,0.9998051185256736,3.6846785282719727,-8.570259523685014,0.8538872768218141,0.0,0.0,0.0,1.0
1717756690.8579404,map,True,False,9,6,0.0,0.0,0.6919176578521729,-2.004589080810547,0.0,0.0,0.0,0.019741359098411543,0.9998051185256736,3.6414247956476204,-8.43888648003109,0.8504993262375334,0.0,0.0,0.0,1.0
1717756690.9597282,map,True,False,9,6,0.0,0.0,0.6919176578521729,-2.004589080810547,0.0,0.0,0.0,0.019741359098411543,0.9998051185256736,3.6533906519725905,-8.508461765948109,0.852213766450823,0.0,0.0,0.0,1.0
1717756691.0093412,map,True,False,9,6,0.0,0.0,0.6919176578521729,-2.004589080810547,0.0,0.0,0.0,0.019741359098411543,0.9998051185256736,3.6533906519725905,-8.508461765948109,0.852213766450823,0.0,0.0,0.0,1.0
1717756691.107972,map,True,False,9,6,0.0,0.0,0.6925294399261475,-2.005229949951172,0.0,0.0,0.0,0.019689621738002504,0.9998061469056794,3.6533906519725905,-8.508461765948109,0.852213766450823,0.0,0.0,0.0,1.0
1717756691.1583695,map,True,False,9,6,0.0,0.0,0.6925294399261475,-2.005229949951172,0.0,0.0,0.0,0.019689621738002504,0.9998061469056794,3.6533906519725905,-8.508461765948109,0.852213766450823,0.0,0.0,0.0,1.0
1717756691.208217,map,True,False,9,6,0.0,0.0,0.6925294399261475,-2.005229949951172,0.0,0.0,0.0,0.019689621738002504,0.9998061469056794,3.6513510112548544,-8.507323402606477,0.8522137664508223,0.0,0.0,0.0,1.0
1717756691.260023,map,True,False,9,6,0.0,0.0,0.6925294399261475,-2.005229949951172,0.0,0.0,0.0,0.019689621738002504,0.9998061469056794,3.6513510112548544,-8.507323402606477,0.8522137664508223,0.0,0.0,0.0,1.0
1717756691.3103757,map,True,False,9,6,0.0,0.0,0.6925294399261475,-2.005229949951172,0.0,0.0,0.0,0.019689621738002504,0.9998061469056794,3.6513510112548544,-8.507323402606477,0.8522137664508223,0.0,0.0,0.0,1.0
1717756691.3598225,map,True,False,9,6,0.0,0.0,0.6925294399261475,-2.005229949951172,0.0,0.0,0.0,0.019689621738002504,0.9998061469056794,3.6513510112548544,-8.507323402606477,0.8522137664508223,0.0,0.0,0.0,1.0
1717756691.4101503,map,True,False,9,6,0.0,0.0,0.6925294399261475,-2.005229949951172,0.0,0.0,0.0,0.019689621738002504,0.9998061469056794,3.6513510112548544,-8.507323402606477,0.8522137664508223,0.0,0.0,0.0,1.0
1717756691.5163207,map,True,False,9,6,0.0,0.0,0.6925294399261475,-2.005229949951172,0.0,0.0,0.0,0.019689621738002504,0.9998061469056794,3.6524925750985613,-8.508525391603802,0.8522137664508221,0.0,0.0,0.0,1.0
1717756691.564822,map,True,False,9,6,0.0,0.0,0.6925294399261475,-2.005229949951172,0.0,0.0,0.0,0.019689621738002504,0.9998061469056794,3.6524925750985613,-8.508525391603802,0.8522137664508221,0.0,0.0,0.0,1.0
1717756691.6667254,map,True,False,9,6,0.0,0.0,0.6925294399261475,-2.005229949951172,0.0,0.0,0.0,0.019689621738002504,0.9998061469056794,3.631545383003486,-8.444728655672762,0.8505387261878713,0.0,0.0,0.0,1.0
1717756691.7663221,map,True,False,9,6,0.0,0.0,0.6914031505584717,-2.0033252239227295,0.0,0.0,0.0,0.01969640572344846,0.9998060127692169,3.631545383003486,-8.444728655672762,0.8505387261878713,0.0,0.0,0.0,1.0
1717756691.9183147,map,True,False,9,6,0.0,0.0,0.6914031505584717,-2.0033252239227295,0.0,0.0,0.0,0.01969640572344846,0.9998060127692169,3.629906150274925,-8.443383090764556,0.8505387261878741,0.0,0.0,0.0,1.0
1717756691.969492,map,True,False,9,6,0.0,0.0,0.6914031505584717,-2.0033252239227295,0.0,0.0,0.0,0.01969640572344846,0.9998060127692169,3.6508583750485073,-8.507178174032472,0.8522137664508258,0.0,0.0,0.0,1.0
1717756692.0163026,map,True,False,9,6,0.0,0.0,0.6914031505584717,-2.0033252239227295,0.0,0.0,0.0,0.01969640572344846,0.9998060127692169,3.6508583750485073,-8.507178174032472,0.8522137664508258,0.0,0.0,0.0,1.0
1717756692.119207,map,True,False,9,6,0.0,0.0,0.6914031505584717,-2.0033252239227295,0.0,0.0,0.0,0.01969640572344846,0.9998060127692169,3.6508583750485073,-8.507178174032472,0.8522137664508258,0.0,0.0,0.0,1.0
1717756692.21659,map,True,False,9,6,0.0,0.0,0.6914031505584717,-2.0033252239227295,0.0,0.0,0.0,0.01969640572344846,0.9998060127692169,3.6538809978794764,-8.508715401275126,0.8522137664508239,0.0,0.0,0.0,1.0
1717756692.2687957,map,True,False,9,6,0.0,0.0,0.6914031505584717,-2.0033252239227295,0.0,0.0,0.0,0.01969640572344846,0.9998060127692169,3.6331075897022114,-8.4457245139295,0.8505387261878704,0.0,0.0,0.0,1.0
1717756692.3188949,map,True,False,9,6,0.0,0.0,0.6914031505584717,-2.0033252239227295,0.0,0.0,0.0,0.01969640572344846,0.9998060127692169,3.6331075897022114,-8.4457245139295,0.8505387261878704,0.0,0.0,0.0,1.0
1717756692.4192202,map,True,False,9,6,0.0,0.0,0.690342903137207,-2.0034384727478027,0.0,0.0,0.0,0.019740046952099573,0.9998051483338045,3.6331075897022114,-8.4457245139295,0.8505387261878704,0.0,0.0,0.0,1.0
1717756692.519122,map,True,False,9,6,0.0,0.0,0.690342903137207,-2.0034384727478027,0.0,0.0,0.0,0.019740046952099573,0.9998051483338045,3.6331075897022114,-8.4457245139295,0.8505387261878704,0.0,0.0,0.0,1.0
1717756692.5761127,map,True,False,9,6,0.0,0.0,0.690342903137207,-2.0034384727478027,0.0,0.0,0.0,0.019740046952099573,0.9998051483338045,3.6517684639229797,-8.506917823446521,0.852213766450823,0.0,0.0,0.0,1.0
1717756692.670938,map,True,False,9,6,0.0,0.0,0.690342903137207,-2.0034384727478027,0.0,0.0,0.0,0.019740046952099573,0.9998051483338045,3.601157390569106,-8.352829274852908,0.8481678999695402,0.0,0.0,0.0,1.0
1717756692.769183,map,True,False,9,6,0.0,0.0,0.690342903137207,-2.0034384727478027,0.0,0.0,0.0,0.019740046952099573,0.9998051483338045,3.601157390569106,-8.352829274852908,0.8481678999695402,0.0,0.0,0.0,1.0
1717756692.9706724,map,True,False,9,6,0.0,0.0,0.6901218891143799,-2.002689838409424,0.0,0.0,0.0,0.01979217192216474,0.9998041199527716,3.6741760563710226,-8.57357815955706,0.8430290318069188,0.0,0.0,0.0,1.0
1717756693.0206788,map,True,False,9,6,0.0,0.0,0.6901218891143799,-2.002689838409424,0.0,0.0,0.0,0.01979217192216474,0.9998041199527716,3.6741760563710226,-8.57357815955706,0.8430290318069188,0.0,0.0,0.0,1.0
1717756693.1241255,map,True,False,9,6,0.0,0.0,0.6901218891143799,-2.002689838409424,0.0,0.0,0.0,0.01979217192216474,0.9998041199527716,3.6741760563710226,-8.57357815955706,0.8430290318069188,0.0,0.0,0.0,1.0
1717756693.1702695,map,True,False,9,6,0.0,0.0,0.6901218891143799,-2.002689838409424,0.0,0.0,0.0,0.01979217192216474,0.9998041199527716,3.6741760563710226,-8.57357815955706,0.8430290318069188,0.0,0.0,0.0,1.0
1717756693.2715673,map,True,False,9,6,0.0,0.0,0.6901218891143799,-2.002689838409424,0.0,0.0,0.0,0.01979217192216474,0.9998041199527716,3.603829546288715,-8.388295816150391,0.8489542496276273,0.0,0.0,0.0,1.0
1717756693.3203135,map,True,False,9,6,0.0,0.0,0.6901218891143799,-2.002689838409424,0.0,0.0,0.0,0.01979217192216474,0.9998041199527716,3.603829546288715,-8.388295816150391,0.8489542496276273,0.0,0.0,0.0,1.0
1717756693.3582919,map,True,False,9,6,0.0,0.0,0.6901218891143799,-2.002689838409424,0.0,0.0,0.0,0.01979217192216474,0.9998041199527716,3.603829546288715,-8.388295816150391,0.8489542496276273,0.0,0.0,0.0,1.0
1717756693.3613763,map,True,False,9,6,0.0,0.0,0.6901218891143799,-2.002689838409424,0.0,0.0,0.0,0.01979217192216474,0.9998041199527716,3.603829546288715,-8.388295816150391,0.8489542496276273,0.0,0.0,0.0,1.0
1717756693.366116,map,True,False,9,6,0.0,0.0,0.6901218891143799,-2.002689838409424,0.0,0.0,0.0,0.01979217192216474,0.9998041199527716,3.603829546288715,-8.388295816150391,0.8489542496276273,0.0,0.0,0.0,1.0
1717756693.3721006,map,True,False,9,6,0.0,0.0,0.6901218891143799,-2.002689838409424,0.0,0.0,0.0,0.01979217192216474,0.9998041199527716,3.603829546288715,-8.388295816150391,0.8489542496276273,0.0,0.0,0.0,1.0
1717756693.3739052,map,True,False,9,6,0.0,0.0,0.6901218891143799,-2.002689838409424,0.0,0.0,0.0,0.01979217192216474,0.9998041199527716,3.603829546288715,-8.388295816150391,0.8489542496276273,0.0,0.0,0.0,1.0
1717756693.3778574,map,True,False,9,6,0.0,0.0,0.6901218891143799,-2.002689838409424,0.0,0.0,0.0,0.01979217192216474,0.9998041199527716,3.603829546288715,-8.388295816150391,0.8489542496276273,0.0,0.0,0.0,1.0
1717756693.4257748,map,True,False,9,6,0.0,0.0,0.6901218891143799,-2.002689838409424,0.0,0.0,0.0,0.01979217192216474,0.9998041199527716,3.603829546288715,-8.388295816150391,0.8489542496276273,0.0,0.0,0.0,1.0
1717756693.4310803,map,True,False,9,6,0.0,0.0,0.6901218891143799,-2.002689838409424,0.0,0.0,0.0,0.01979217192216474,0.9998041199527716,3.603829546288715,-8.388295816150391,0.8489542496276273,0.0,0.0,0.0,1.0
1717756693.4390192,map,True,False,9,6,0.0,0.0,0.6901218891143799,-2.002689838409424,0.0,0.0,0.0,0.01979217192216474,0.9998041199527716,3.603829546288715,-8.388295816150391,0.8489542496276273,0.0,0.0,0.0,1.0
1717756693.4419475,map,True,False,9,6,0.0,0.0,0.6901218891143799,-2.002689838409424,0.0,0.0,0.0,0.01979217192216474,0.9998041199527716,3.603829546288715,-8.388295816150391,0.8489542496276273,0.0,0.0,0.0,1.0
1717756693.4537444,map,True,False,9,6,0.0,0.0,0.6901218891143799,-2.002689838409424,0.0,0.0,0.0,0.01979217192216474,0.9998041199527716,3.603829546288715,-8.388295816150391,0.8489542496276273,0.0,0.0,0.0,1.0
1717756693.458235,map,True,False,9,6,0.0,0.0,0.6901218891143799,-2.002689838409424,0.0,0.0,0.0,0.01979217192216474,0.9998041199527716,3.603829546288715,-8.388295816150391,0.8489542496276273,0.0,0.0,0.0,1.0
1717756693.461591,map,True,False,9,6,0.0,0.0,0.6901218891143799,-2.002689838409424,0.0,0.0,0.0,0.01979217192216474,0.9998041199527716,3.603829546288715,-8.388295816150391,0.8489542496276273,0.0,0.0,0.0,1.0
1717756693.4794357,map,True,False,9,6,0.0,0.0,0.6901218891143799,-2.002689838409424,0.0,0.0,0.0,0.01979217192216474,0.9998041199527716,3.603829546288715,-8.388295816150391,0.8489542496276273,0.0,0.0,0.0,1.0
1717756693.4905748,map,True,False,9,6,0.0,0.0,0.6901218891143799,-2.002689838409424,0.0,0.0,0.0,0.01979217192216474,0.9998041199527716,3.603829546288715,-8.388295816150391,0.8489542496276273,0.0,0.0,0.0,1.0
1717756693.497816,map,True,False,9,6,0.0,0.0,0.6915531158447266,-2.0047733783721924,0.0,0.0,0.0,0.01980338235590625,0.9998038963915375,3.603829546288715,-8.388295816150391,0.8489542496276273,0.0,0.0,0.0,1.0
1717756693.5024886,map,True,False,9,6,0.0,0.0,0.6915531158447266,-2.0047733783721924,0.0,0.0,0.0,0.01980338235590625,0.9998038963915375,3.603829546288715,-8.388295816150391,0.8489542496276273,0.0,0.0,0.0,1.0
1717756693.506166,map,True,False,9,6,0.0,0.0,0.6915531158447266,-2.0047733783721924,0.0,0.0,0.0,0.01980338235590625,0.9998038963915375,3.603829546288715,-8.388295816150391,0.8489542496276273,0.0,0.0,0.0,1.0
1717756693.5091088,map,True,False,9,6,0.0,0.0,0.6915531158447266,-2.0047733783721924,0.0,0.0,0.0,0.01980338235590625,0.9998038963915375,3.603829546288715,-8.388295816150391,0.8489542496276273,0.0,0.0,0.0,1.0
1717756693.5137067,map,True,False,9,6,0.0,0.0,0.6915531158447266,-2.0047733783721924,0.0,0.0,0.0,0.01980338235590625,0.9998038963915375,3.603829546288715,-8.388295816150391,0.8489542496276273,0.0,0.0,0.0,1.0
1717756693.52635,map,True,False,9,6,0.0,0.0,0.6915531158447266,-2.0047733783721924,0.0,0.0,0.0,0.01980338235590625,0.9998038963915375,3.603829546288715,-8.388295816150391,0.8489542496276273,0.0,0.0,0.0,1.0
1717756693.5344193,map,True,False,9,6,0.0,0.0,0.6915531158447266,-2.0047733783721924,0.0,0.0,0.0,0.01980338235590625,0.9998038963915375,3.603829546288715,-8.388295816150391,0.8489542496276273,0.0,0.0,0.0,1.0
1717756693.537567,map,True,False,9,6,0.0,0.0,0.6915531158447266,-2.0047733783721924,0.0,0.0,0.0,0.01980338235590625,0.9998038963915375,3.603829546288715,-8.388295816150391,0.8489542496276273,0.0,0.0,0.0,1.0
1717756693.5462103,map,True,False,9,6,0.0,0.0,0.6915531158447266,-2.0047733783721924,0.0,0.0,0.0,0.01980338235590625,0.9998038963915375,3.603829546288715,-8.388295816150391,0.8489542496276273,0.0,0.0,0.0,1.0
1717756693.6000974,map,True,False,9,6,0.0,0.0,0.6915531158447266,-2.0047733783721924,0.0,0.0,0.0,0.01980338235590625,0.9998038963915375,3.6806101650592398,-8.300133743901604,0.837281528283848,0.0,0.0,0.0,1.0
1717756693.6472409,map,True,False,9,6,0.0,0.0,0.6915531158447266,-2.0047733783721924,0.0,0.0,0.0,0.01980338235590625,0.9998038963915375,3.6806101650592398,-8.300133743901604,0.837281528283848,0.0,0.0,0.0,1.0
1717756693.650885,map,True,False,9,6,0.0,0.0,0.6915531158447266,-2.0047733783721924,0.0,0.0,0.0,0.01980338235590625,0.9998038963915375,3.6806101650592398,-8.300133743901604,0.837281528283848,0.0,0.0,0.0,1.0
1717756693.6538906,map,True,False,9,6,0.0,0.0,0.6915531158447266,-2.0047733783721924,0.0,0.0,0.0,0.01980338235590625,0.9998038963915375,3.6806101650592398,-8.300133743901604,0.837281528283848,0.0,0.0,0.0,1.0
1717756693.658634,map,True,False,9,6,0.0,0.0,0.6915531158447266,-2.0047733783721924,0.0,0.0,0.0,0.01980338235590625,0.9998038963915375,3.6806101650592398,-8.300133743901604,0.837281528283848,0.0,0.0,0.0,1.0
1717756693.6704617,map,True,False,9,6,0.0,0.0,0.6915531158447266,-2.0047733783721924,0.0,0.0,0.0,0.01980338235590625,0.9998038963915375,3.6806101650592398,-8.300133743901604,0.837281528283848,0.0,0.0,0.0,1.0
1717756693.675593,map,True,False,9,6,0.0,0.0,0.6915531158447266,-2.0047733783721924,0.0,0.0,0.0,0.01980338235590625,0.9998038963915375,3.6806101650592398,-8.300133743901604,0.837281528283848,0.0,0.0,0.0,1.0
1717756693.677913,map,True,False,9,6,0.0,0.0,0.6915531158447266,-2.0047733783721924,0.0,0.0,0.0,0.01980338235590625,0.9998038963915375,3.6806101650592398,-8.300133743901604,0.837281528283848,0.0,0.0,0.0,1.0
1717756693.6824393,map,True,False,9,6,0.0,0.0,0.6915531158447266,-2.0047733783721924,0.0,0.0,0.0,0.01980338235590625,0.9998038963915375,3.6806101650592398,-8.300133743901604,0.837281528283848,0.0,0.0,0.0,1.0
1717756693.691073,map,True,False,9,6,0.0,0.0,0.6915531158447266,-2.0047733783721924,0.0,0.0,0.0,0.01980338235590625,0.9998038963915375,3.6806101650592398,-8.300133743901604,0.837281528283848,0.0,0.0,0.0,1.0
1717756693.6939392,map,True,False,9,6,0.0,0.0,0.6915531158447266,-2.0047733783721924,0.0,0.0,0.0,0.01980338235590625,0.9998038963915375,3.6806101650592398,-8.300133743901604,0.837281528283848,0.0,0.0,0.0,1.0
1717756693.706044,map,True,False,9,6,0.0,0.0,0.6915531158447266,-2.0047733783721924,0.0,0.0,0.0,0.01980338235590625,0.9998038963915375,3.6806101650592398,-8.300133743901604,0.837281528283848,0.0,0.0,0.0,1.0
1717756693.7079892,map,True,False,9,6,0.0,0.0,0.6915531158447266,-2.0047733783721924,0.0,0.0,0.0,0.01980338235590625,0.9998038963915375,3.6806101650592398,-8.300133743901604,0.837281528283848,0.0,0.0,0.0,1.0
1717756693.7332208,map,True,False,9,6,0.0,0.0,0.6915531158447266,-2.0047733783721924,0.0,0.0,0.0,0.01980338235590625,0.9998038963915375,3.6806101650592398,-8.300133743901604,0.837281528283848,0.0,0.0,0.0,1.0
1717756693.7351458,map,True,False,9,6,0.0,0.0,0.6915531158447266,-2.0047733783721924,0.0,0.0,0.0,0.01980338235590625,0.9998038963915375,3.6806101650592398,-8.300133743901604,0.837281528283848,0.0,0.0,0.0,1.0
1717756693.736473,map,True,False,9,6,0.0,0.0,0.6915531158447266,-2.0047733783721924,0.0,0.0,0.0,0.01980338235590625,0.9998038963915375,3.6806101650592398,-8.300133743901604,0.837281528283848,0.0,0.0,0.0,1.0
1717756693.7377076,map,True,False,9,6,0.0,0.0,0.6915531158447266,-2.0047733783721924,0.0,0.0,0.0,0.01980338235590625,0.9998038963915375,3.6806101650592398,-8.300133743901604,0.837281528283848,0.0,0.0,0.0,1.0
1717756693.7537487,map,True,False,9,6,0.0,0.0,0.6915531158447266,-2.0047733783721924,0.0,0.0,0.0,0.01980338235590625,0.9998038963915375,3.6806101650592398,-8.300133743901604,0.837281528283848,0.0,0.0,0.0,1.0
1717756693.759005,map,True,False,9,6,0.0,0.0,0.6915531158447266,-2.0047733783721924,0.0,0.0,0.0,0.01980338235590625,0.9998038963915375,3.6806101650592398,-8.300133743901604,0.837281528283848,0.0,0.0,0.0,1.0
1717756693.7620008,map,True,False,9,6,0.0,0.0,0.6915531158447266,-2.0047733783721924,0.0,0.0,0.0,0.01980338235590625,0.9998038963915375,3.6806101650592398,-8.300133743901604,0.837281528283848,0.0,0.0,0.0,1.0
1717756693.766105,map,True,False,9,6,0.0,0.0,0.6915531158447266,-2.0047733783721924,0.0,0.0,0.0,0.01980338235590625,0.9998038963915375,3.6806101650592398,-8.300133743901604,0.837281528283848,0.0,0.0,0.0,1.0
1717756693.8800488,map,True,False,9,6,0.0,0.0,0.6915531158447266,-2.0047733783721924,0.0,0.0,0.0,0.01980338235590625,0.9998038963915375,3.761804699317788,-8.365794091117289,0.8286159115649041,0.0,0.0,0.0,1.0
1717756693.885437,map,True,False,9,6,0.0,0.0,0.6915531158447266,-2.0047733783721924,0.0,0.0,0.0,0.01980338235590625,0.9998038963915375,3.761804699317788,-8.365794091117289,0.8286159115649041,0.0,0.0,0.0,1.0
1717756693.8993592,map,True,False,9,6,0.0,0.0,0.6915531158447266,-2.0047733783721924,0.0,0.0,0.0,0.01980338235590625,0.9998038963915375,3.730393253966056,-8.276626405411207,0.8265505603856211,0.0,0.0,0.0,1.0
1717756693.903341,map,True,False,9,6,0.0,0.0,0.6915531158447266,-2.0047733783721924,0.0,0.0,0.0,0.01980338235590625,0.9998038963915375,3.739274499659846,-8.270870914767379,0.8370484226026487,0.0,0.0,0.0,1.0
1717756693.9059474,map,True,False,9,6,0.0,0.0,0.6915531158447266,-2.0047733783721924,0.0,0.0,0.0,0.01980338235590625,0.9998038963915375,3.739274499659846,-8.270870914767379,0.8370484226026487,0.0,0.0,0.0,1.0
1717756693.913657,map,True,False,9,6,0.0,0.0,0.6915531158447266,-2.0047733783721924,0.0,0.0,0.0,0.01980338235590625,0.9998038963915375,3.739274499659846,-8.270870914767379,0.8370484226026487,0.0,0.0,0.0,1.0
1717756693.9178023,map,True,False,9,6,0.0,0.0,0.6915531158447266,-2.0047733783721924,0.0,0.0,0.0,0.01980338235590625,0.9998038963915375,3.739274499659846,-8.270870914767379,0.8370484226026487,0.0,0.0,0.0,1.0
1717756693.9220207,map,True,False,9,6,0.0,0.0,0.6915531158447266,-2.0047733783721924,0.0,0.0,0.0,0.01980338235590625,0.9998038963915375,3.739274499659846,-8.270870914767379,0.8370484226026487,0.0,0.0,0.0,1.0
1717756693.9252584,map,True,False,9,6,0.0,0.0,0.6915531158447266,-2.0047733783721924,0.0,0.0,0.0,0.01980338235590625,0.9998038963915375,3.739274499659846,-8.270870914767379,0.8370484226026487,0.0,0.0,0.0,1.0
1717756693.9542532,map,True,False,9,6,0.0,0.0,0.6915531158447266,-2.0047733783721924,0.0,0.0,0.0,0.01980338235590625,0.9998038963915375,3.739274499659846,-8.270870914767379,0.8370484226026487,0.0,0.0,0.0,1.0
1717756693.9573925,map,True,False,9,6,0.0,0.0,0.6915531158447266,-2.0047733783721924,0.0,0.0,0.0,0.01980338235590625,0.9998038963915375,3.739274499659846,-8.270870914767379,0.8370484226026487,0.0,0.0,0.0,1.0
1717756693.9660234,map,True,False,9,6,0.0,0.0,0.6915531158447266,-2.0047733783721924,0.0,0.0,0.0,0.01980338235590625,0.9998038963915375,3.739274499659846,-8.270870914767379,0.8370484226026487,0.0,0.0,0.0,1.0
1717756693.9702244,map,True,False,9,6,0.0,0.0,0.6915531158447266,-2.0047733783721924,0.0,0.0,0.0,0.01980338235590625,0.9998038963915375,3.739274499659846,-8.270870914767379,0.8370484226026487,0.0,0.0,0.0,1.0
1717756693.9910803,map,True,False,9,6,0.0,0.0,0.6915531158447266,-2.0047733783721924,0.0,0.0,0.0,0.01980338235590625,0.9998038963915375,3.739274499659846,-8.270870914767379,0.8370484226026487,0.0,0.0,0.0,1.0
1717756693.9975963,map,True,False,9,6,0.0,0.0,0.6915531158447266,-2.0047733783721924,0.0,0.0,0.0,0.01980338235590625,0.9998038963915375,3.739274499659846,-8.270870914767379,0.8370484226026487,0.0,0.0,0.0,1.0
1717756694.0035634,map,True,False,9,6,0.0,0.0,0.6915531158447266,-2.0047733783721924,0.0,0.0,0.0,0.01980338235590625,0.9998038963915375,3.739274499659846,-8.270870914767379,0.8370484226026487,0.0,0.0,0.0,1.0
1717756694.005891,map,True,False,9,6,0.0,0.0,0.6915531158447266,-2.0047733783721924,0.0,0.0,0.0,0.01980338235590625,0.9998038963915375,3.739274499659846,-8.270870914767379,0.8370484226026487,0.0,0.0,0.0,1.0
1717756694.010013,map,True,False,9,6,0.0,0.0,0.6915531158447266,-2.0047733783721924,0.0,0.0,0.0,0.01980338235590625,0.9998038963915375,3.739274499659846,-8.270870914767379,0.8370484226026487,0.0,0.0,0.0,1.0
1717756694.017502,map,True,False,9,6,0.0,0.0,0.6915531158447266,-2.0047733783721924,0.0,0.0,0.0,0.01980338235590625,0.9998038963915375,3.739274499659846,-8.270870914767379,0.8370484226026487,0.0,0.0,0.0,1.0
1717756694.0215726,map,True,False,9,6,0.0,0.0,0.6915531158447266,-2.0047733783721924,0.0,0.0,0.0,0.01980338235590625,0.9998038963915375,3.739274499659846,-8.270870914767379,0.8370484226026487,0.0,0.0,0.0,1.0
1717756694.0261729,map,True,False,9,6,0.0,0.0,0.6915531158447266,-2.0047733783721924,0.0,0.0,0.0,0.01980338235590625,0.9998038963915375,3.739274499659846,-8.270870914767379,0.8370484226026487,0.0,0.0,0.0,1.0
1717756694.0294588,map,True,False,9,6,0.0,0.0,0.6915531158447266,-2.0047733783721924,0.0,0.0,0.0,0.01980338235590625,0.9998038963915375,3.739274499659846,-8.270870914767379,0.8370484226026487,0.0,0.0,0.0,1.0
1717756694.0392387,map,True,False,9,6,0.0,0.0,0.6915531158447266,-2.0047733783721924,0.0,0.0,0.0,0.01980338235590625,0.9998038963915375,3.739274499659846,-8.270870914767379,0.8370484226026487,0.0,0.0,0.0,1.0
1717756694.0437357,map,True,False,9,6,0.0,0.0,0.6915531158447266,-2.0047733783721924,0.0,0.0,0.0,0.01980338235590625,0.9998038963915375,3.739274499659846,-8.270870914767379,0.8370484226026487,0.0,0.0,0.0,1.0
1717756694.0457785,map,True,False,9,6,0.0,0.0,0.6915531158447266,-2.0047733783721924,0.0,0.0,0.0,0.01980338235590625,0.9998038963915375,3.739274499659846,-8.270870914767379,0.8370484226026487,0.0,0.0,0.0,1.0
1717756694.049767,map,True,False,9,6,0.0,0.0,0.6915531158447266,-2.0047733783721924,0.0,0.0,0.0,0.01980338235590625,0.9998038963915375,3.739274499659846,-8.270870914767379,0.8370484226026487,0.0,0.0,0.0,1.0
1717756694.0537674,map,True,False,9,6,0.0,0.0,0.6915531158447266,-2.0047733783721924,0.0,0.0,0.0,0.01980338235590625,0.9998038963915375,3.739274499659846,-8.270870914767379,0.8370484226026487,0.0,0.0,0.0,1.0
1717756694.05714,map,True,False,9,6,0.0,0.0,0.6915531158447266,-2.0047733783721924,0.0,0.0,0.0,0.01980338235590625,0.9998038963915375,3.739274499659846,-8.270870914767379,0.8370484226026487,0.0,0.0,0.0,1.0
1717756694.0613573,map,True,False,9,6,0.0,0.0,0.6915531158447266,-2.0047733783721924,0.0,0.0,0.0,0.01980338235590625,0.9998038963915375,3.739274499659846,-8.270870914767379,0.8370484226026487,0.0,0.0,0.0,1.0
1717756694.0656767,map,True,False,9,6,0.0,0.0,0.6915531158447266,-2.0047733783721924,0.0,0.0,0.0,0.01980338235590625,0.9998038963915375,3.739274499659846,-8.270870914767379,0.8370484226026487,0.0,0.0,0.0,1.0
1717756694.0737085,map,True,False,9,6,0.0,0.0,0.6915531158447266,-2.0047733783721924,0.0,0.0,0.0,0.01980338235590625,0.9998038963915375,3.739274499659846,-8.270870914767379,0.8370484226026487,0.0,0.0,0.0,1.0
1717756694.0803225,map,True,False,9,6,0.0,0.0,0.6915531158447266,-2.0047733783721924,0.0,0.0,0.0,0.01980338235590625,0.9998038963915375,3.739274499659846,-8.270870914767379,0.8370484226026487,0.0,0.0,0.0,1.0
1717756694.081977,map,True,False,9,6,0.0,0.0,0.6915531158447266,-2.0047733783721924,0.0,0.0,0.0,0.01980338235590625,0.9998038963915375,3.739274499659846,-8.270870914767379,0.8370484226026487,0.0,0.0,0.0,1.0
1717756694.0850828,map,True,False,9,6,0.0,0.0,0.6915531158447266,-2.0047733783721924,0.0,0.0,0.0,0.01980338235590625,0.9998038963915375,3.739274499659846,-8.270870914767379,0.8370484226026487,0.0,0.0,0.0,1.0
1717756694.0899353,map,True,False,9,6,0.0,0.0,0.6915531158447266,-2.0047733783721924,0.0,0.0,0.0,0.01980338235590625,0.9998038963915375,3.739274499659846,-8.270870914767379,0.8370484226026487,0.0,0.0,0.0,1.0
1717756694.0933607,map,True,False,9,6,0.0,0.0,0.6915531158447266,-2.0047733783721924,0.0,0.0,0.0,0.01980338235590625,0.9998038963915375,3.739274499659846,-8.270870914767379,0.8370484226026487,0.0,0.0,0.0,1.0
1717756694.0974045,map,True,False,9,6,0.0,0.0,0.6915531158447266,-2.0047733783721924,0.0,0.0,0.0,0.01980338235590625,0.9998038963915375,3.739274499659846,-8.270870914767379,0.8370484226026487,0.0,0.0,0.0,1.0
1717756694.1066117,map,True,False,9,6,0.0,0.0,0.6927139759063721,-2.0049800872802734,0.0,0.0,0.0,0.01975690992927213,0.9998048204443147,3.739274499659846,-8.270870914767379,0.8370484226026487,0.0,0.0,0.0,1.0
1717756694.109166,map,True,False,9,6,0.0,0.0,0.6927139759063721,-2.0049800872802734,0.0,0.0,0.0,0.01975690992927213,0.9998048204443147,3.739274499659846,-8.270870914767379,0.8370484226026487,0.0,0.0,0.0,1.0
1717756694.1179607,map,True,False,9,6,0.0,0.0,0.6927139759063721,-2.0049800872802734,0.0,0.0,0.0,0.01975690992927213,0.9998048204443147,3.739274499659846,-8.270870914767379,0.8370484226026487,0.0,0.0,0.0,1.0
1717756694.1222632,map,True,False,9,6,0.0,0.0,0.6927139759063721,-2.0049800872802734,0.0,0.0,0.0,0.01975690992927213,0.9998048204443147,3.739274499659846,-8.270870914767379,0.8370484226026487,0.0,0.0,0.0,1.0
1717756694.1256673,map,True,False,9,6,0.0,0.0,0.6927139759063721,-2.0049800872802734,0.0,0.0,0.0,0.01975690992927213,0.9998048204443147,3.739274499659846,-8.270870914767379,0.8370484226026487,0.0,0.0,0.0,1.0
1717756694.1299255,map,True,False,9,6,0.0,0.0,0.6927139759063721,-2.0049800872802734,0.0,0.0,0.0,0.01975690992927213,0.9998048204443147,3.739274499659846,-8.270870914767379,0.8370484226026487,0.0,0.0,0.0,1.0
1717756694.142588,map,True,False,9,6,0.0,0.0,0.6927139759063721,-2.0049800872802734,0.0,0.0,0.0,0.01975690992927213,0.9998048204443147,3.739274499659846,-8.270870914767379,0.8370484226026487,0.0,0.0,0.0,1.0
1717756694.15003,map,True,False,9,6,0.0,0.0,0.6927139759063721,-2.0049800872802734,0.0,0.0,0.0,0.01975690992927213,0.9998048204443147,3.739274499659846,-8.270870914767379,0.8370484226026487,0.0,0.0,0.0,1.0
1717756694.1541107,map,True,False,9,6,0.0,0.0,0.6927139759063721,-2.0049800872802734,0.0,0.0,0.0,0.01975690992927213,0.9998048204443147,3.739274499659846,-8.270870914767379,0.8370484226026487,0.0,0.0,0.0,1.0
1717756694.1621382,map,True,False,9,6,0.0,0.0,0.6927139759063721,-2.0049800872802734,0.0,0.0,0.0,0.01975690992927213,0.9998048204443147,3.739274499659846,-8.270870914767379,0.8370484226026487,0.0,0.0,0.0,1.0
1717756694.1901653,map,True,False,9,6,0.0,0.0,0.6927139759063721,-2.0049800872802734,0.0,0.0,0.0,0.01975690992927213,0.9998048204443147,3.739274499659846,-8.270870914767379,0.8370484226026487,0.0,0.0,0.0,1.0
1717756694.194995,map,True,False,9,6,0.0,0.0,0.6927139759063721,-2.0049800872802734,0.0,0.0,0.0,0.01975690992927213,0.9998048204443147,3.739274499659846,-8.270870914767379,0.8370484226026487,0.0,0.0,0.0,1.0
1717756694.197491,map,True,False,9,6,0.0,0.0,0.6927139759063721,-2.0049800872802734,0.0,0.0,0.0,0.01975690992927213,0.9998048204443147,3.739274499659846,-8.270870914767379,0.8370484226026487,0.0,0.0,0.0,1.0
1717756694.2020295,map,True,False,9,6,0.0,0.0,0.6927139759063721,-2.0049800872802734,0.0,0.0,0.0,0.01975690992927213,0.9998048204443147,3.739274499659846,-8.270870914767379,0.8370484226026487,0.0,0.0,0.0,1.0
1717756694.2147174,map,True,False,9,6,0.0,0.0,0.6927139759063721,-2.0049800872802734,0.0,0.0,0.0,0.01975690992927213,0.9998048204443147,3.8468763646988413,-8.157597032930774,0.8456338127508752,0.0,0.0,0.0,1.0
1717756694.2173975,map,True,False,9,6,0.0,0.0,0.6927139759063721,-2.0049800872802734,0.0,0.0,0.0,0.01975690992927213,0.9998048204443147,3.8468763646988413,-8.157597032930774,0.8456338127508752,0.0,0.0,0.0,1.0
1717756694.226556,map,True,False,9,6,0.0,0.0,0.6927139759063721,-2.0049800872802734,0.0,0.0,0.0,0.01975690992927213,0.9998048204443147,3.8468763646988413,-8.157597032930774,0.8456338127508752,0.0,0.0,0.0,1.0
1717756694.2306561,map,True,False,9,6,0.0,0.0,0.6927139759063721,-2.0049800872802734,0.0,0.0,0.0,0.01975690992927213,0.9998048204443147,3.758419781028363,-8.0337906174874,0.8418888484351189,0.0,0.0,0.0,1.0
1717756694.2370605,map,True,False,9,6,0.0,0.0,0.6927139759063721,-2.0049800872802734,0.0,0.0,0.0,0.01975690992927213,0.9998048204443147,3.756812752426438,-7.971769712988587,0.8404548625301688,0.0,0.0,0.0,1.0
1717756694.2462962,map,True,False,9,6,0.0,0.0,0.6927139759063721,-2.0049800872802734,0.0,0.0,0.0,0.01975690992927213,0.9998048204443147,3.756812752426438,-7.971769712988587,0.8404548625301688,0.0,0.0,0.0,1.0
1717756694.2537599,map,True,False,9,6,0.0,0.0,0.6927139759063721,-2.0049800872802734,0.0,0.0,0.0,0.01975690992927213,0.9998048204443147,3.756812752426438,-7.971769712988587,0.8404548625301688,0.0,0.0,0.0,1.0
1717756694.2583494,map,True,False,9,6,0.0,0.0,0.6927139759063721,-2.0049800872802734,0.0,0.0,0.0,0.01975690992927213,0.9998048204443147,3.756812752426438,-7.971769712988587,0.8404548625301688,0.0,0.0,0.0,1.0
1717756694.2616997,map,True,False,9,6,0.0,0.0,0.6927139759063721,-2.0049800872802734,0.0,0.0,0.0,0.01975690992927213,0.9998048204443147,3.756812752426438,-7.971769712988587,0.8404548625301688,0.0,0.0,0.0,1.0
1717756694.278185,map,True,False,9,6,0.0,0.0,0.6927139759063721,-2.0049800872802734,0.0,0.0,0.0,0.01975690992927213,0.9998048204443147,3.756812752426438,-7.971769712988587,0.8404548625301688,0.0,0.0,0.0,1.0
1717756694.279964,map,True,False,9,6,0.0,0.0,0.6927139759063721,-2.0049800872802734,0.0,0.0,0.0,0.01975690992927213,0.9998048204443147,3.756812752426438,-7.971769712988587,0.8404548625301688,0.0,0.0,0.0,1.0
1717756694.3287702,map,True,False,9,6,0.0,0.0,0.6927139759063721,-2.0049800872802734,0.0,0.0,0.0,0.01975690992927213,0.9998048204443147,3.756812752426438,-7.971769712988587,0.8404548625301688,0.0,0.0,0.0,1.0
1717756694.3667457,map,True,False,9,6,0.0,0.0,0.6927139759063721,-2.0049800872802734,0.0,0.0,0.0,0.01975690992927213,0.9998048204443147,3.756812752426438,-7.971769712988587,0.8404548625301688,0.0,0.0,0.0,1.0
1717756694.3699682,map,True,False,9,6,0.0,0.0,0.6927139759063721,-2.0049800872802734,0.0,0.0,0.0,0.01975690992927213,0.9998048204443147,3.756812752426438,-7.971769712988587,0.8404548625301688,0.0,0.0,0.0,1.0
1717756694.4700189,map,True,False,9,6,0.0,0.0,0.6927139759063721,-2.0049800872802734,0.0,0.0,0.0,0.01975690992927213,0.9998048204443147,3.756812752426438,-7.971769712988587,0.8404548625301688,0.0,0.0,0.0,1.0
1717756694.5204256,map,True,False,9,6,0.0,0.0,0.6927139759063721,-2.0049800872802734,0.0,0.0,0.0,0.01975690992927213,0.9998048204443147,3.756812752426438,-7.971769712988587,0.8404548625301688,0.0,0.0,0.0,1.0
1717756694.5701513,map,True,False,9,5,0.0,0.0,0.6927139759063721,-2.0049800872802734,0.0,0.0,0.0,0.01975690992927213,0.9998048204443147,3.76154332994059,-7.6131204635146945,0.8217210358500283,0.0,0.0,0.0,1.0
1717756694.62088,map,True,False,9,5,0.0,0.0,0.6927139759063721,-2.0049800872802734,0.0,0.0,0.0,0.01975690992927213,0.9998048204443147,3.76154332994059,-7.6131204635146945,0.8217210358500283,0.0,0.0,0.0,1.0
1717756694.6716933,map,True,False,9,5,0.0,0.0,0.6927139759063721,-2.0049800872802734,0.0,0.0,0.0,0.01975690992927213,0.9998048204443147,3.76154332994059,-7.6131204635146945,0.8217210358500283,0.0,0.0,0.0,1.0
1717756694.7214956,map,True,False,9,5,0.0,0.0,0.7149522304534912,-2.0047497749328613,0.0,0.0,0.0,0.019535244221570783,0.9998091724233308,3.76154332994059,-7.6131204635146945,0.8217210358500283,0.0,0.0,0.0,1.0
1717756694.772185,map,True,False,9,5,0.0,0.0,0.7149522304534912,-2.0047497749328613,0.0,0.0,0.0,0.019535244221570783,0.9998091724233308,3.76154332994059,-7.6131204635146945,0.8217210358500283,0.0,0.0,0.0,1.0
1717756694.9220657,map,True,False,9,5,0.0,0.0,0.7149522304534912,-2.0047497749328613,0.0,0.0,0.0,0.019535244221570783,0.9998091724233308,3.880271588508243,-7.414981470791313,0.8083841329759721,0.0,0.0,0.0,1.0
1717756694.9746137,map,True,False,9,5,0.0,0.0,0.7149522304534912,-2.0047497749328613,0.0,0.0,0.0,0.019535244221570783,0.9998091724233308,3.8317513324569106,-7.260142898752745,0.7957211665197356,0.0,0.0,0.0,1.0
1717756695.073445,map,True,False,9,5,0.0,0.0,0.7149522304534912,-2.0047497749328613,0.0,0.0,0.0,0.019535244221570783,0.9998091724233308,3.8317513324569106,-7.260142898752745,0.7957211665197356,0.0,0.0,0.0,1.0
1717756695.1727586,map,True,False,9,5,0.0,0.0,0.7149522304534912,-2.0047497749328613,0.0,0.0,0.0,0.019535244221570783,0.9998091724233308,3.8317513324569106,-7.260142898752745,0.7957211665197356,0.0,0.0,0.0,1.0
1717756695.2259715,map,True,False,9,5,0.0,0.0,0.7149522304534912,-2.0047497749328613,0.0,0.0,0.0,0.019535244221570783,0.9998091724233308,3.8317513324569106,-7.260142898752745,0.7957211665197356,0.0,0.0,0.0,1.0
1717756695.3268542,map,True,False,9,5,0.0,0.0,0.7149522304534912,-2.0047497749328613,0.0,0.0,0.0,0.019535244221570783,0.9998091724233308,3.839336021094274,-7.0663414292706594,0.8002318486764123,0.0,0.0,0.0,1.0
1717756695.3747582,map,True,False,9,5,0.0,0.0,0.8668966293334961,-2.035249948501587,0.0,0.0,0.0,0.021740031479404363,0.9997636545550421,3.839336021094274,-7.0663414292706594,0.8002318486764123,0.0,0.0,0.0,1.0
1717756695.423973,map,True,False,9,5,0.0,0.0,0.8668966293334961,-2.035249948501587,0.0,0.0,0.0,0.021740031479404363,0.9997636545550421,3.839336021094274,-7.0663414292706594,0.8002318486764123,0.0,0.0,0.0,1.0
1717756695.4734855,map,True,False,9,5,0.0,0.0,0.8668966293334961,-2.035249948501587,0.0,0.0,0.0,0.021740031479404363,0.9997636545550421,3.839336021094274,-7.0663414292706594,0.8002318486764123,0.0,0.0,0.0,1.0
1717756695.5243788,map,True,False,9,5,0.0,0.0,0.8668966293334961,-2.035249948501587,0.0,0.0,0.0,0.021740031479404363,0.9997636545550421,3.839336021094274,-7.0663414292706594,0.8002318486764123,0.0,0.0,0.0,1.0
1717756695.5760024,map,True,False,9,5,0.0,0.0,0.8668966293334961,-2.035249948501587,0.0,0.0,0.0,0.021740031479404363,0.9997636545550421,3.839336021094274,-7.0663414292706594,0.8002318486764123,0.0,0.0,0.0,1.0
1717756695.6318848,map,True,False,9,4,0.0,0.0,0.8668966293334961,-2.035249948501587,0.0,0.0,0.0,0.021740031479404363,0.9997636545550421,3.8929623504819886,-6.732618042972193,0.7847983442035499,0.0,0.0,0.0,1.0
1717756695.6789749,map,True,False,9,4,0.0,0.0,0.8668966293334961,-2.035249948501587,0.0,0.0,0.0,0.021740031479404363,0.9997636545550421,3.892347556409713,-6.671365729640516,0.799907468274481,0.0,0.0,0.0,1.0
1717756695.7276468,map,True,False,9,5,0.0,0.0,0.8668966293334961,-2.035249948501587,0.0,0.0,0.0,0.021740031479404363,0.9997636545550421,3.917603955373551,-6.913125953071892,0.7968493157693398,0.0,0.0,0.0,1.0
1717756695.777222,map,True,False,9,5,0.0,0.0,0.8668966293334961,-2.035249948501587,0.0,0.0,0.0,0.021740031479404363,0.9997636545550421,3.917603955373551,-6.913125953071892,0.7968493157693398,0.0,0.0,0.0,1.0
1717756696.0307806,map,True,False,9,4,0.0,0.0,1.010765552520752,-2.0674755573272705,0.0,0.0,0.0,0.02449654321244476,0.9996999200953873,3.9789044532995193,-6.275818040064543,0.7759678588351975,0.0,0.0,0.0,1.0
1717756696.13117,map,True,False,9,4,0.0,0.0,1.010765552520752,-2.0674755573272705,0.0,0.0,0.0,0.02449654321244476,0.9996999200953873,3.9789044532995193,-6.275818040064543,0.7759678588351975,0.0,0.0,0.0,1.0
1717756696.1800182,map,True,False,9,4,0.0,0.0,1.010765552520752,-2.0674755573272705,0.0,0.0,0.0,0.02449654321244476,0.9996999200953873,3.9789044532995193,-6.275818040064543,0.7759678588351975,0.0,0.0,0.0,1.0
1717756696.230176,map,True,False,9,4,0.0,0.0,1.010765552520752,-2.0674755573272705,0.0,0.0,0.0,0.02449654321244476,0.9996999200953873,3.9789044532995193,-6.275818040064543,0.7759678588351975,0.0,0.0,0.0,1.0
1717756696.3306687,map,True,False,9,4,0.0,0.0,1.010765552520752,-2.0674755573272705,0.0,0.0,0.0,0.02449654321244476,0.9996999200953873,3.9789044532995193,-6.275818040064543,0.7759678588351975,0.0,0.0,0.0,1.0
1717756696.4305024,map,True,False,9,4,0.0,0.0,1.010765552520752,-2.0674755573272705,0.0,0.0,0.0,0.02449654321244476,0.9996999200953873,4.103973994826677,-5.9915774656436,0.7491366490916438,0.0,0.0,0.0,1.0
1717756696.4807072,map,True,False,9,4,0.0,0.0,1.010765552520752,-2.0674755573272705,0.0,0.0,0.0,0.02449654321244476,0.9996999200953873,4.103973994826677,-5.9915774656436,0.7491366490916438,0.0,0.0,0.0,1.0
1717756696.5803347,map,True,False,9,4,0.0,0.0,1.010765552520752,-2.0674755573272705,0.0,0.0,0.0,0.02449654321244476,0.9996999200953873,4.103973994826677,-5.9915774656436,0.7491366490916438,0.0,0.0,0.0,1.0
1717756696.6305115,map,True,False,8,4,0.0,0.0,1.0263724327087402,-2.0719857215881348,0.0,0.0,0.0,0.02492281454782649,0.9996893817565512,4.103973994826677,-5.9915774656436,0.7491366490916438,0.0,0.0,0.0,1.0
1717756696.6808205,map,True,False,8,3,0.0,0.0,1.0263724327087402,-2.0719857215881348,0.0,0.0,0.0,0.02492281454782649,0.9996893817565512,4.168105524404433,-5.81627999618879,0.7599546061927749,0.0,0.0,0.0,1.0
1717756697.0389752,map,True,False,8,3,0.0,0.0,1.0263724327087402,-2.0719857215881348,0.0,0.0,0.0,0.02492281454782649,0.9996893817565512,4.2659864053706915,-5.476178886756699,0.7347438044152504,0.0,0.0,0.0,1.0
1717756697.134666,map,True,False,8,3,0.0,0.0,1.0263724327087402,-2.0719857215881348,0.0,0.0,0.0,0.02492281454782649,0.9996893817565512,4.249091176007637,-5.3887786775424615,0.7461702414866328,0.0,0.0,0.0,1.0
1717756697.1855235,map,True,False,8,3,0.0,0.0,1.0263724327087402,-2.0719857215881348,0.0,0.0,0.0,0.02492281454782649,0.9996893817565512,4.249091176007637,-5.3887786775424615,0.7461702414866328,0.0,0.0,0.0,1.0
1717756697.2379441,map,True,False,8,3,0.0,0.0,1.0263724327087402,-2.0719857215881348,0.0,0.0,0.0,0.02492281454782649,0.9996893817565512,4.249091176007637,-5.3887786775424615,0.7461702414866328,0.0,0.0,0.0,1.0
1717756697.286846,map,True,False,8,3,0.0,0.0,1.0263724327087402,-2.0719857215881348,0.0,0.0,0.0,0.02492281454782649,0.9996893817565512,4.249091176007637,-5.3887786775424615,0.7461702414866328,0.0,0.0,0.0,1.0
1717756697.3410952,map,True,False,8,3,0.0,0.0,1.2971200942993164,-2.125995635986328,0.0,0.0,0.0,0.02837278783396093,0.9995974087939922,4.249091176007637,-5.3887786775424615,0.7461702414866328,0.0,0.0,0.0,1.0
1717756697.3879728,map,True,False,8,3,0.0,0.0,1.2971200942993164,-2.125995635986328,0.0,0.0,0.0,0.02837278783396093,0.9995974087939922,4.322539826890385,-5.133522554838166,0.7238487993250865,0.0,0.0,0.0,1.0
1717756697.4880373,map,True,False,8,3,0.0,0.0,1.2971200942993164,-2.125995635986328,0.0,0.0,0.0,0.02837278783396093,0.9995974087939922,4.322539826890385,-5.133522554838166,0.7238487993250865,0.0,0.0,0.0,1.0
1717756697.5385525,map,True,False,8,3,0.0,0.0,1.2971200942993164,-2.125995635986328,0.0,0.0,0.0,0.02837278783396093,0.9995974087939922,4.322539826890385,-5.133522554838166,0.7238487993250865,0.0,0.0,0.0,1.0
1717756697.6412454,map,True,False,8,3,0.0,0.0,1.2971200942993164,-2.125995635986328,0.0,0.0,0.0,0.02837278783396093,0.9995974087939922,4.322539826890385,-5.133522554838166,0.7238487993250865,0.0,0.0,0.0,1.0
1717756697.7409766,map,True,False,8,3,0.0,0.0,1.2971200942993164,-2.125995635986328,0.0,0.0,0.0,0.02837278783396093,0.9995974087939922,4.419127897435857,-5.009006191543075,0.7223187612360829,0.0,0.0,0.0,1.0
1717756698.0417576,map,True,False,7,2,0.0,0.0,1.4682197570800781,-2.1579177379608154,0.0,0.0,0.0,0.03073988892165604,0.9995274172147822,4.497217590406859,-4.707202805945517,0.7133213783864167,0.0,0.0,0.0,1.0
1717756698.1388779,map,True,False,7,2,0.0,0.0,1.4682197570800781,-2.1579177379608154,0.0,0.0,0.0,0.03073988892165604,0.9995274172147822,4.432015863524522,-4.8440537635259595,0.7310803837475068,0.0,0.0,0.0,1.0
1717756698.237424,map,True,False,7,2,0.0,0.0,1.4682197570800781,-2.1579177379608154,0.0,0.0,0.0,0.03073988892165604,0.9995274172147822,4.432015863524522,-4.8440537635259595,0.7310803837475068,0.0,0.0,0.0,1.0
1717756698.2887182,map,True,False,7,2,0.0,0.0,1.4682197570800781,-2.1579177379608154,0.0,0.0,0.0,0.03073988892165604,0.9995274172147822,4.432015863524522,-4.8440537635259595,0.7310803837475068,0.0,0.0,0.0,1.0
1717756698.3902354,map,True,False,7,2,0.0,0.0,1.4682197570800781,-2.1579177379608154,0.0,0.0,0.0,0.03073988892165604,0.9995274172147822,4.496610349556647,-4.4355278290545765,0.7152270051386145,0.0,0.0,0.0,1.0
1717756698.4879792,map,True,False,7,2,0.0,0.0,1.4682197570800781,-2.1579177379608154,0.0,0.0,0.0,0.03073988892165604,0.9995274172147822,4.496610349556647,-4.4355278290545765,0.7152270051386145,0.0,0.0,0.0,1.0
1717756698.539267,map,True,False,7,2,0.0,0.0,1.4682197570800781,-2.1579177379608154,0.0,0.0,0.0,0.03073988892165604,0.9995274172147822,4.496610349556647,-4.4355278290545765,0.7152270051386145,0.0,0.0,0.0,1.0
1717756698.5883803,map,True,False,7,2,0.0,0.0,1.5037422180175781,-2.1668903827667236,0.0,0.0,0.0,0.031167181448800145,0.9995141786396895,4.496610349556647,-4.4355278290545765,0.7152270051386145,0.0,0.0,0.0,1.0
1717756698.6399841,map,True,False,7,2,0.0,0.0,1.5037422180175781,-2.1668903827667236,0.0,0.0,0.0,0.031167181448800145,0.9995141786396895,4.496610349556647,-4.4355278290545765,0.7152270051386145,0.0,0.0,0.0,1.0
1717756698.6888719,map,True,False,7,2,0.0,0.0,1.5037422180175781,-2.1668903827667236,0.0,0.0,0.0,0.031167181448800145,0.9995141786396895,4.553310906688834,-4.275974855059907,0.6990122837905657,0.0,0.0,0.0,1.0
1717756698.7420852,map,True,False,7,2,0.0,0.0,1.5037422180175781,-2.1668903827667236,0.0,0.0,0.0,0.031167181448800145,0.9995141786396895,4.554457062579467,-4.134800087769138,0.711456412572937,0.0,0.0,0.0,1.0
1717756699.0903153,map,True,False,7,2,0.0,0.0,1.7110843658447266,-2.203965187072754,0.0,0.0,0.0,0.03299303574484615,0.99945558689458,4.766244177054311,-3.96819845793547,0.7098816497520246,0.0,0.0,0.0,1.0
1717756699.141626,map,True,False,7,2,0.0,0.0,1.7110843658447266,-2.203965187072754,0.0,0.0,0.0,0.03299303574484615,0.99945558689458,4.766244177054311,-3.96819845793547,0.7098816497520246,0.0,0.0,0.0,1.0
1717756699.2447364,map,True,False,7,2,0.0,0.0,1.7110843658447266,-2.203965187072754,0.0,0.0,0.0,0.03299303574484615,0.99945558689458,4.766244177054311,-3.96819845793547,0.7098816497520246,0.0,0.0,0.0,1.0
1717756699.341761,map,True,False,7,2,0.0,0.0,1.7110843658447266,-2.203965187072754,0.0,0.0,0.0,0.03299303574484615,0.99945558689458,4.766244177054311,-3.96819845793547,0.7098816497520246,0.0,0.0,0.0,1.0
1717756699.3911269,map,True,False,7,2,0.0,0.0,1.7110843658447266,-2.203965187072754,0.0,0.0,0.0,0.03299303574484615,0.99945558689458,4.642408123923396,-3.749038196835315,0.6947901365450353,0.0,0.0,0.0,1.0
1717756699.4914796,map,True,False,7,2,0.0,0.0,1.7110843658447266,-2.203965187072754,0.0,0.0,0.0,0.03299303574484615,0.99945558689458,4.642408123923396,-3.749038196835315,0.6947901365450353,0.0,0.0,0.0,1.0
1717756699.591136,map,True,False,7,2,0.0,0.0,1.797215461730957,-2.2176923751831055,0.0,0.0,0.0,0.03374456136585154,0.9994304942647142,4.642408123923396,-3.749038196835315,0.6947901365450353,0.0,0.0,0.0,1.0
1717756699.6410737,map,True,False,7,2,0.0,0.0,1.797215461730957,-2.2176923751831055,0.0,0.0,0.0,0.03374456136585154,0.9994304942647142,4.642408123923396,-3.749038196835315,0.6947901365450353,0.0,0.0,0.0,1.0
1717756699.7473493,map,True,False,7,1,0.0,0.0,1.797215461730957,-2.2176923751831055,0.0,0.0,0.0,0.03374456136585154,0.9994304942647142,4.722759782119316,-3.4940101425880847,0.6818338532190225,0.0,0.0,0.0,1.0
1717756700.0484588,map,True,False,7,1,0.0,0.0,1.797215461730957,-2.2176923751831055,0.0,0.0,0.0,0.03374456136585154,0.9994304942647142,4.82102818679129,-3.4243551179820555,0.6531036477704946,0.0,0.0,0.0,1.0
1717756700.1451993,map,True,False,7,1,0.0,0.0,1.797215461730957,-2.2176923751831055,0.0,0.0,0.0,0.03374456136585154,0.9994304942647142,4.82102818679129,-3.4243551179820555,0.6531036477704946,0.0,0.0,0.0,1.0
1717756700.1944547,map,True,False,7,1,0.0,0.0,1.797215461730957,-2.2176923751831055,0.0,0.0,0.0,0.03374456136585154,0.9994304942647142,4.82102818679129,-3.4243551179820555,0.6531036477704946,0.0,0.0,0.0,1.0
1717756700.2941096,map,True,False,6,1,0.0,0.0,1.8918743133544922,-2.2368650436401367,0.0,0.0,0.0,0.03487780802826017,0.9993915793145243,4.82102818679129,-3.4243551179820555,0.6531036477704946,0.0,0.0,0.0,1.0
1717756700.3447685,map,True,False,6,1,0.0,0.0,1.8918743133544922,-2.2368650436401367,0.0,0.0,0.0,0.03487780802826017,0.9993915793145243,4.82102818679129,-3.4243551179820555,0.6531036477704946,0.0,0.0,0.0,1.0
1717756700.444792,map,True,False,6,1,0.0,0.0,1.8918743133544922,-2.2368650436401367,0.0,0.0,0.0,0.03487780802826017,0.9993915793145243,4.82102818679129,-3.4243551179820555,0.6531036477704946,0.0,0.0,0.0,1.0
1717756700.494452,map,True,False,6,1,0.0,0.0,1.8918743133544922,-2.2368650436401367,0.0,0.0,0.0,0.03487780802826017,0.9993915793145243,4.82102818679129,-3.4243551179820555,0.6531036477704946,0.0,0.0,0.0,1.0
1717756700.5455537,map,True,False,6,1,0.0,0.0,1.8918743133544922,-2.2368650436401367,0.0,0.0,0.0,0.03487780802826017,0.9993915793145243,4.82102818679129,-3.4243551179820555,0.6531036477704946,0.0,0.0,0.0,1.0
1717756700.5945754,map,True,False,6,1,0.0,0.0,1.8918743133544922,-2.2368650436401367,0.0,0.0,0.0,0.03487780802826017,0.9993915793145243,4.82102818679129,-3.4243551179820555,0.6531036477704946,0.0,0.0,0.0,1.0
1717756700.6949966,map,True,False,6,1,0.0,0.0,1.8918743133544922,-2.2368650436401367,0.0,0.0,0.0,0.03487780802826017,0.9993915793145243,4.82102818679129,-3.4243551179820555,0.6531036477704946,0.0,0.0,0.0,1.0
1717756700.7450163,map,True,False,6,1,0.0,0.0,1.8918743133544922,-2.2368650436401367,0.0,0.0,0.0,0.03487780802826017,0.9993915793145243,4.82102818679129,-3.4243551179820555,0.6531036477704946,0.0,0.0,0.0,1.0
