car_pos_meter , car_pos_cell, car_speed, ped_pos_meter, ped_pos_cell, ped_speed
-10.25, 10, 2, 3.99736, 10, 1
-10.20835, 10, 2, 3.989768, 10, 1
-10.1667, 10, 2, 3.974324, 10, 1
-9.958451, 9, 2, 3.895752, 10, 1
-8.917206, 8, 2, 3.396274, 9, 1
-7.87596, 7, 2, 2.839702, 7, 1
-6.834715, 6, 2, 2.264885, 6, 1
-5.793469, 5, 2, 1.683192, 4, 1
-4.752224, 4, 2, 1.14447, 3, 1
-3.710977, 3, 2, 0.6576233, 1, 1
-2.669725, 2, 2, 0.1197729, 0, 1
-1.628474, 1, 2, -0.2600188, 0, 1
-0.5872229, 0, 2, -0.5172729, -1, 1
0.454027, 0, 2, -0.6005845, -1, 1
1.453628, -1, 2, -0.5968614, -1, 1
2.494879, -2, 2, -0.6409369, -1, 1
3.53613, -3, 2, -0.6656809, -1, 1
