timestamp_sec,frame_id,game_played,yielding,player1discrete,player2discrete,player1yieldprob,player2yieldprob,player1_pose_x,player1_pose_y,player1_pose_z,player1_pose_orient_x,player1_pose_orient_y,player1_pose_orient_z,player1_pose_orient_w,player2_pose_x,player2_pose_y,player2_pose_z,player2_pose_orient_x,player2_pose_orient_y,player2_pose_orient_z,player2_pose_orient_w
1718034581.2849774,map,True,False,6,7,0.0,0.0,0.9981708526611328,-1.693613886833191,0.0,0.0,0.0,0.01381026789440938,0.9999046280204521,2.6532425040835155,-8.087398686635224,0.7793128443240996,0.0,0.0,0.0,1.0
1718034581.3371084,map,True,False,6,7,0.0,0.0,0.9981708526611328,-1.693613886833191,0.0,0.0,0.0,0.01381026789440938,0.9999046280204521,2.6532425040835155,-8.087398686635224,0.7793128443240996,0.0,0.0,0.0,1.0
1718034581.4359624,map,True,False,6,7,0.0,0.0,1.0004279613494873,-1.693198561668396,0.0,0.0,0.0,0.013608880445341162,0.9999073998969519,2.6532425040835155,-8.087398686635224,0.7793128443240996,0.0,0.0,0.0,1.0
1718034581.4863217,map,True,False,6,7,0.0,0.0,1.0004279613494873,-1.693198561668396,0.0,0.0,0.0,0.013608880445341162,0.9999073998969519,2.5681824635391757,-8.02182646689806,0.7873106637088959,0.0,0.0,0.0,1.0
1718034581.5372396,map,True,False,6,7,0.0,0.0,1.0004279613494873,-1.693198561668396,0.0,0.0,0.0,0.013608880445341162,0.9999073998969519,2.5747455297047885,-8.076716430103772,0.7882336382726173,0.0,0.0,0.0,1.0
1718034581.5879593,map,True,False,6,7,0.0,0.0,1.0004279613494873,-1.693198561668396,0.0,0.0,0.0,0.013608880445341162,0.9999073998969519,2.5747455297047885,-8.076716430103772,0.7882336382726173,0.0,0.0,0.0,1.0
1718034581.6867554,map,True,False,6,7,0.0,0.0,1.0004279613494873,-1.693198561668396,0.0,0.0,0.0,0.013608880445341162,0.9999073998969519,2.5747455297047885,-8.076716430103772,0.7882336382726173,0.0,0.0,0.0,1.0
1718034581.7868443,map,True,False,6,7,0.0,0.0,1.0004279613494873,-1.693198561668396,0.0,0.0,0.0,0.013608880445341162,0.9999073998969519,2.5747455297047885,-8.076716430103772,0.7882336382726173,0.0,0.0,0.0,1.0
1718034581.8369515,map,True,False,6,7,0.0,0.0,1.0004279613494873,-1.693198561668396,0.0,0.0,0.0,0.013608880445341162,0.9999073998969519,2.594876953499395,-8.183862553140667,0.7997109510808846,0.0,0.0,0.0,1.0
1718034582.1407242,map,True,False,6,7,0.0,0.0,0.996208667755127,-1.6942192316055298,0.0,0.0,0.0,0.01400008548907609,0.9999019902598735,2.605843993085752,-8.057141504958008,0.7880941913904478,0.0,0.0,0.0,1.0
1718034582.1912947,map,True,False,6,7,0.0,0.0,0.996208667755127,-1.6942192316055298,0.0,0.0,0.0,0.01400008548907609,0.9999019902598735,2.606978331489465,-8.056622148222544,0.7880941913904496,0.0,0.0,0.0,1.0
1718034582.2411573,map,True,False,6,7,0.0,0.0,0.996208667755127,-1.6942192316055298,0.0,0.0,0.0,0.01400008548907609,0.9999019902598735,2.606978331489465,-8.056622148222544,0.7880941913904496,0.0,0.0,0.0,1.0
1718034582.2918196,map,True,False,6,7,0.0,0.0,0.996208667755127,-1.6942192316055298,0.0,0.0,0.0,0.01400008548907609,0.9999019902598735,2.606978331489465,-8.056622148222544,0.7880941913904496,0.0,0.0,0.0,1.0
1718034582.3911657,map,True,False,6,7,0.0,0.0,0.996208667755127,-1.6942192316055298,0.0,0.0,0.0,0.01400008548907609,0.9999019902598735,2.606978331489465,-8.056622148222544,0.7880941913904496,0.0,0.0,0.0,1.0
1718034582.4414477,map,True,False,6,7,0.0,0.0,0.996208667755127,-1.6942192316055298,0.0,0.0,0.0,0.01400008548907609,0.9999019902598735,2.606978331489465,-8.056622148222544,0.7880941913904496,0.0,0.0,0.0,1.0
1718034582.4914641,map,True,False,6,7,0.0,0.0,0.9980311393737793,-1.6940339803695679,0.0,0.0,0.0,0.013780556639672497,0.9999050452926745,2.6279794558799408,-8.16264773075101,0.7899483692181477,0.0,0.0,0.0,1.0
1718034582.591201,map,True,False,6,7,0.0,0.0,0.9980311393737793,-1.6940339803695679,0.0,0.0,0.0,0.013780556639672497,0.9999050452926745,2.6542787767917186,-8.300137008344507,0.7923171869504906,0.0,0.0,0.0,1.0
1718034582.6909766,map,True,False,6,7,0.0,0.0,0.9980311393737793,-1.6940339803695679,0.0,0.0,0.0,0.013780556639672497,0.9999050452926745,2.6542787767917186,-8.300137008344507,0.7923171869504906,0.0,0.0,0.0,1.0
1718034582.7410045,map,True,False,6,7,0.0,0.0,0.9980311393737793,-1.6940339803695679,0.0,0.0,0.0,0.013780556639672497,0.9999050452926745,2.6542787767917186,-8.300137008344507,0.7923171869504906,0.0,0.0,0.0,1.0
1718034582.792125,map,True,False,6,7,0.0,0.0,0.9980311393737793,-1.6940339803695679,0.0,0.0,0.0,0.013780556639672497,0.9999050452926745,2.6542787767917186,-8.300137008344507,0.7923171869504906,0.0,0.0,0.0,1.0
1718034583.1437793,map,True,False,6,7,0.0,0.0,0.9985361099243164,-1.6947383880615234,0.0,0.0,0.0,0.013921630185066362,0.9999030930532783,2.6387486460086444,-8.247523409725819,0.7913674525860961,0.0,0.0,0.0,1.0
1718034583.1941562,map,True,False,6,7,0.0,0.0,0.9985361099243164,-1.6947383880615234,0.0,0.0,0.0,0.013921630185066362,0.9999030930532783,2.6387486460086444,-8.247523409725819,0.7913674525860961,0.0,0.0,0.0,1.0
1718034583.2447464,map,True,False,6,7,0.0,0.0,0.9985361099243164,-1.6947383880615234,0.0,0.0,0.0,0.013921630185066362,0.9999030930532783,2.6387486460086444,-8.247523409725819,0.7913674525860961,0.0,0.0,0.0,1.0
1718034583.3450754,map,True,False,6,7,0.0,0.0,0.9985361099243164,-1.6947383880615234,0.0,0.0,0.0,0.013921630185066362,0.9999030930532783,2.6387486460086444,-8.247523409725819,0.7913674525860961,0.0,0.0,0.0,1.0
1718034583.3947678,map,True,False,6,7,0.0,0.0,0.9985361099243164,-1.6947383880615234,0.0,0.0,0.0,0.013921630185066362,0.9999030930532783,2.6387486460086444,-8.247523409725819,0.7913674525860961,0.0,0.0,0.0,1.0
1718034583.4455485,map,True,False,6,7,0.0,0.0,0.9985361099243164,-1.6947383880615234,0.0,0.0,0.0,0.013921630185066362,0.9999030930532783,2.6387486460086444,-8.247523409725819,0.7913674525860961,0.0,0.0,0.0,1.0
1718034583.545681,map,True,False,6,7,0.0,0.0,0.9985361099243164,-1.6947383880615234,0.0,0.0,0.0,0.013921630185066362,0.9999030930532783,2.6239071573847195,-8.047719836081527,0.7974792683953283,0.0,0.0,0.0,1.0
1718034583.6458845,map,True,False,6,7,0.0,0.0,0.9985361099243164,-1.6947383880615234,0.0,0.0,0.0,0.013921630185066362,0.9999030930532783,2.6239071573847195,-8.047719836081527,0.7974792683953283,0.0,0.0,0.0,1.0
1718034583.696259,map,True,False,6,7,0.0,0.0,0.9972598552703857,-1.6934765577316284,0.0,0.0,0.0,0.013874468311724356,0.999903748767699,2.6239071573847195,-8.047719836081527,0.7974792683953283,0.0,0.0,0.0,1.0
1718034583.7466056,map,True,False,6,7,0.0,0.0,0.9972598552703857,-1.6934765577316284,0.0,0.0,0.0,0.013874468311724356,0.999903748767699,2.6239071573847195,-8.047719836081527,0.7974792683953283,0.0,0.0,0.0,1.0
1718034583.796749,map,True,False,6,7,0.0,0.0,0.9972598552703857,-1.6934765577316284,0.0,0.0,0.0,0.013874468311724356,0.999903748767699,2.6239071573847195,-8.047719836081527,0.7974792683953283,0.0,0.0,0.0,1.0
1718034584.2004232,map,True,False,6,7,0.0,0.0,0.9972598552703857,-1.6934765577316284,0.0,0.0,0.0,0.013874468311724356,0.999903748767699,2.6738393043056083,-8.22779283353523,0.7814784145363868,0.0,0.0,0.0,1.0
1718034584.2993255,map,True,False,6,7,0.0,0.0,0.9972598552703857,-1.6934765577316284,0.0,0.0,0.0,0.013874468311724356,0.999903748767699,2.6738393043056083,-8.22779283353523,0.7814784145363868,0.0,0.0,0.0,1.0
1718034584.4004629,map,True,False,6,7,0.0,0.0,0.9975497722625732,-1.692987322807312,0.0,0.0,0.0,0.013846766472138644,0.9999041362351093,2.6738393043056083,-8.22779283353523,0.7814784145363868,0.0,0.0,0.0,1.0
1718034584.4495208,map,True,False,6,7,0.0,0.0,0.9975497722625732,-1.692987322807312,0.0,0.0,0.0,0.013846766472138644,0.9999041362351093,2.6738393043056083,-8.22779283353523,0.7814784145363868,0.0,0.0,0.0,1.0
1718034584.5497918,map,True,False,6,7,0.0,0.0,0.9975497722625732,-1.692987322807312,0.0,0.0,0.0,0.013846766472138644,0.9999041362351093,2.6382409379944263,-8.096767989413951,0.7889197010520077,0.0,0.0,0.0,1.0
1718034584.6506789,map,True,False,6,7,0.0,0.0,0.9975497722625732,-1.692987322807312,0.0,0.0,0.0,0.013846766472138644,0.9999041362351093,2.6382409379944263,-8.096767989413951,0.7889197010520077,0.0,0.0,0.0,1.0
1718034584.7499087,map,True,False,6,7,0.0,0.0,0.9975497722625732,-1.692987322807312,0.0,0.0,0.0,0.013846766472138644,0.9999041362351093,2.6382409379944263,-8.096767989413951,0.7889197010520077,0.0,0.0,0.0,1.0
1718034584.8499699,map,True,False,6,7,0.0,0.0,0.9975497722625732,-1.692987322807312,0.0,0.0,0.0,0.013846766472138644,0.9999041362351093,2.678467494553518,-8.285563107676895,0.7823765386166752,0.0,0.0,0.0,1.0
1718034585.1416264,map,True,False,6,7,0.0,0.0,0.9976828098297119,-1.694196343421936,0.0,0.0,0.0,0.013891672945351678,0.9999035103261412,2.73800168258873,-8.44684773215912,0.7850477974640724,0.0,0.0,0.0,1.0
1718034585.145288,map,True,False,6,7,0.0,0.0,0.9976828098297119,-1.694196343421936,0.0,0.0,0.0,0.013891672945351678,0.9999035103261412,2.721149648126274,-8.324108629028396,0.7732326174327888,0.0,0.0,0.0,1.0
1718034585.149142,map,True,False,6,7,0.0,0.0,0.9976828098297119,-1.694196343421936,0.0,0.0,0.0,0.013891672945351678,0.9999035103261412,2.721149648126274,-8.324108629028396,0.7732326174327888,0.0,0.0,0.0,1.0
1718034585.1529984,map,True,False,6,7,0.0,0.0,0.9976828098297119,-1.694196343421936,0.0,0.0,0.0,0.013891672945351678,0.9999035103261412,2.721149648126274,-8.324108629028396,0.7732326174327888,0.0,0.0,0.0,1.0
1718034585.2036989,map,True,False,6,7,0.0,0.0,0.9976828098297119,-1.694196343421936,0.0,0.0,0.0,0.013891672945351678,0.9999035103261412,2.721279275472811,-8.2591696260595,0.7625314940805652,0.0,0.0,0.0,1.0
1718034585.3146665,map,True,False,6,7,0.0,0.0,0.9976828098297119,-1.694196343421936,0.0,0.0,0.0,0.013891672945351678,0.9999035103261412,2.721279275472811,-8.2591696260595,0.7625314940805652,0.0,0.0,0.0,1.0
1718034585.3551667,map,True,False,6,7,0.0,0.0,0.9976828098297119,-1.694196343421936,0.0,0.0,0.0,0.013891672945351678,0.9999035103261412,2.721279275472811,-8.2591696260595,0.7625314940805652,0.0,0.0,0.0,1.0
1718034585.4052045,map,True,False,6,7,0.0,0.0,0.9976828098297119,-1.694196343421936,0.0,0.0,0.0,0.013891672945351678,0.9999035103261412,2.721279275472811,-8.2591696260595,0.7625314940805652,0.0,0.0,0.0,1.0
1718034585.5058415,map,True,False,6,6,0.5957621508060097,0.5957621508060098,0.9976828098297119,-1.694196343421936,0.0,0.0,0.0,0.013891672945351678,0.9999035103261412,2.665637917049226,-7.904381302532048,0.7580701319555676,0.0,0.0,0.0,1.0
1718034585.5541108,map,True,True,6,6,0.5957621508060097,0.5957621508060098,0.9976828098297119,-1.694196343421936,0.0,0.0,0.0,0.013891672945351678,0.9999035103261412,2.665637917049226,-7.904381302532048,0.7580701319555676,0.0,0.0,0.0,1.0
1718034585.6055532,map,True,False,6,6,0.5957621508060097,0.5957621508060098,0.9976828098297119,-1.694196343421936,0.0,0.0,0.0,0.013891672945351678,0.9999035103261412,2.665637917049226,-7.904381302532048,0.7580701319555676,0.0,0.0,0.0,1.0
1718034585.6548433,map,True,True,6,6,0.5957621508060097,0.5957621508060098,0.9976828098297119,-1.694196343421936,0.0,0.0,0.0,0.013891672945351678,0.9999035103261412,2.665637917049226,-7.904381302532048,0.7580701319555676,0.0,0.0,0.0,1.0
1718034585.7051802,map,True,True,6,6,0.5957621508060097,0.5957621508060098,0.9964139461517334,-1.6936365365982056,0.0,0.0,0.0,0.013924050618185907,0.9999030483454612,2.665637917049226,-7.904381302532048,0.7580701319555676,0.0,0.0,0.0,1.0
1718034585.8062954,map,True,True,6,6,0.5957621508060097,0.5957621508060098,0.9964139461517334,-1.6936365365982056,0.0,0.0,0.0,0.013924050618185907,0.9999030483454612,2.665637917049226,-7.904381302532048,0.7580701319555676,0.0,0.0,0.0,1.0
1718034586.2057421,map,True,False,6,6,0.5957621508060097,0.5957621508060098,0.9964139461517334,-1.6936365365982056,0.0,0.0,0.0,0.013924050618185907,0.9999030483454612,2.675415577601842,-7.7509110338919855,0.7649951378907496,0.0,0.0,0.0,1.0
1718034586.2555285,map,True,True,6,6,0.5957621508060097,0.5957621508060098,0.9964139461517334,-1.6936365365982056,0.0,0.0,0.0,0.013924050618185907,0.9999030483454612,2.675415577601842,-7.7509110338919855,0.7649951378907496,0.0,0.0,0.0,1.0
1718034586.355276,map,True,False,6,6,0.5957621508060097,0.5957621508060098,1.029517412185669,-1.6967030763626099,0.0,0.0,0.0,0.013801290962858884,0.9999047621436855,2.675415577601842,-7.7509110338919855,0.7649951378907496,0.0,0.0,0.0,1.0
1718034586.405937,map,True,True,6,6,0.5957621508060097,0.5957621508060098,1.029517412185669,-1.6967030763626099,0.0,0.0,0.0,0.013801290962858884,0.9999047621436855,2.675415577601842,-7.7509110338919855,0.7649951378907496,0.0,0.0,0.0,1.0
1718034586.5081024,map,True,True,6,6,0.5957621508060097,0.5957621508060098,1.029517412185669,-1.6967030763626099,0.0,0.0,0.0,0.013801290962858884,0.9999047621436855,2.70065287574352,-7.680159974258029,0.7550450990861627,0.0,0.0,0.0,1.0
1718034586.557483,map,True,False,6,6,0.5957621508060097,0.5957621508060098,1.029517412185669,-1.6967030763626099,0.0,0.0,0.0,0.013801290962858884,0.9999047621436855,2.688720091294987,-7.532373288257383,0.7619437914310717,0.0,0.0,0.0,1.0
1718034586.610168,map,True,False,6,6,0.5957621508060097,0.5957621508060098,1.029517412185669,-1.6967030763626099,0.0,0.0,0.0,0.013801290962858884,0.9999047621436855,2.688720091294987,-7.532373288257383,0.7619437914310717,0.0,0.0,0.0,1.0
1718034586.658098,map,True,False,6,6,0.5957621508060097,0.5957621508060098,1.029517412185669,-1.6967030763626099,0.0,0.0,0.0,0.013801290962858884,0.9999047621436855,2.688720091294987,-7.532373288257383,0.7619437914310717,0.0,0.0,0.0,1.0
1718034586.7077975,map,True,True,6,6,0.5957621508060097,0.5957621508060098,1.029517412185669,-1.6967030763626099,0.0,0.0,0.0,0.013801290962858884,0.9999047621436855,2.688720091294987,-7.532373288257383,0.7619437914310717,0.0,0.0,0.0,1.0
1718034586.759457,map,True,True,6,6,0.5957621508060097,0.5957621508060098,1.029517412185669,-1.6967030763626099,0.0,0.0,0.0,0.013801290962858884,0.9999047621436855,2.688720091294987,-7.532373288257383,0.7619437914310717,0.0,0.0,0.0,1.0
1718034586.8086045,map,True,True,6,6,0.5957621508060097,0.5957621508060098,1.029517412185669,-1.6967030763626099,0.0,0.0,0.0,0.013801290962858884,0.9999047621436855,2.688720091294987,-7.532373288257383,0.7619437914310717,0.0,0.0,0.0,1.0
1718034586.8613963,map,True,True,6,6,0.5957621508060097,0.5957621508060098,1.029517412185669,-1.6967030763626099,0.0,0.0,0.0,0.013801290962858884,0.9999047621436855,2.774605177921837,-7.420895683951376,0.7518994546485509,0.0,0.0,0.0,1.0
1718034586.9104466,map,True,True,6,6,0.5957621508060097,0.5957621508060098,1.029517412185669,-1.6967030763626099,0.0,0.0,0.0,0.013801290962858884,0.9999047621436855,2.7753673890843222,-7.372041439655605,0.7428066884941924,0.0,0.0,0.0,1.0
1718034587.0104156,map,True,False,6,6,0.5957621508060097,0.5957621508060098,1.029517412185669,-1.6967030763626099,0.0,0.0,0.0,0.013801290962858884,0.9999047621436855,2.7753673890843222,-7.372041439655605,0.7428066884941924,0.0,0.0,0.0,1.0
1718034587.1094265,map,True,True,6,6,0.5957621508060097,0.5957621508060098,1.029517412185669,-1.6967030763626099,0.0,0.0,0.0,0.013801290962858884,0.9999047621436855,2.7753673890843222,-7.372041439655605,0.7428066884941924,0.0,0.0,0.0,1.0
1718034587.2094254,map,True,True,6,6,0.5957621508060097,0.5957621508060098,1.110034465789795,-1.7192093133926392,0.0,0.0,0.0,0.01414064130641734,0.9999000231118614,2.788952549801227,-7.303275637551763,0.7419602756406997,0.0,0.0,0.0,1.0
1718034587.3118167,map,True,False,6,6,0.5957621508060097,0.5957621508060098,1.110034465789795,-1.7192093133926392,0.0,0.0,0.0,0.01414064130641734,0.9999000231118614,2.788952549801227,-7.303275637551763,0.7419602756406997,0.0,0.0,0.0,1.0
1718034587.3651748,map,True,False,6,6,0.5957621508060097,0.5957621508060098,1.110034465789795,-1.7192093133926392,0.0,0.0,0.0,0.01414064130641734,0.9999000231118614,2.788952549801227,-7.303275637551763,0.7419602756406997,0.0,0.0,0.0,1.0
1718034587.4603593,map,True,True,6,6,0.5957621508060097,0.5957621508060098,1.110034465789795,-1.7192093133926392,0.0,0.0,0.0,0.01414064130641734,0.9999000231118614,2.788952549801227,-7.303275637551763,0.7419602756406997,0.0,0.0,0.0,1.0
1718034587.5131269,map,True,True,6,6,0.5957621508060097,0.5957621508060098,1.110034465789795,-1.7192093133926392,0.0,0.0,0.0,0.01414064130641734,0.9999000231118614,2.7746327074912984,-7.188910057898778,0.7324456525420476,0.0,0.0,0.0,1.0
1718034587.5632756,map,True,False,6,6,0.5957621508060097,0.5957621508060098,1.110034465789795,-1.7192093133926392,0.0,0.0,0.0,0.01414064130641734,0.9999000231118614,2.776858119921566,-7.133594072754043,0.7559970061612866,0.0,0.0,0.0,1.0
1718034587.6625812,map,True,True,6,6,0.5957621508060097,0.5957621508060098,1.110034465789795,-1.7192093133926392,0.0,0.0,0.0,0.01414064130641734,0.9999000231118614,2.776858119921566,-7.133594072754043,0.7559970061612866,0.0,0.0,0.0,1.0
1718034587.7119434,map,True,False,6,6,0.5957621508060097,0.5957621508060098,1.110034465789795,-1.7192093133926392,0.0,0.0,0.0,0.01414064130641734,0.9999000231118614,2.776858119921566,-7.133594072754043,0.7559970061612866,0.0,0.0,0.0,1.0
1718034587.8117409,map,True,True,6,6,0.5957621508060097,0.5957621508060098,1.1815204620361328,-1.7323349714279175,0.0,0.0,0.0,0.015088260408967552,0.9998861635502716,2.776858119921566,-7.133594072754043,0.7559970061612866,0.0,0.0,0.0,1.0
1718034587.8638692,map,True,True,6,6,0.5957621508060097,0.5957621508060098,1.1815204620361328,-1.7323349714279175,0.0,0.0,0.0,0.015088260408967552,0.9998861635502716,2.808725039220131,-7.229619139523512,0.7571862031230546,0.0,0.0,0.0,1.0
1718034588.2124698,map,True,True,6,6,0.5957621508060097,0.5957621508060098,1.1815204620361328,-1.7323349714279175,0.0,0.0,0.0,0.015088260408967552,0.9998861635502716,2.8759477929817807,-7.161661294298464,0.7483018123443518,0.0,0.0,0.0,1.0
1718034588.262867,map,True,False,6,6,0.5957621508060097,0.5957621508060098,1.1815204620361328,-1.7323349714279175,0.0,0.0,0.0,0.015088260408967552,0.9998861635502716,2.8759477929817807,-7.161661294298464,0.7483018123443518,0.0,0.0,0.0,1.0
1718034588.3634202,map,True,False,6,6,0.5957621508060097,0.5957621508060098,1.1815204620361328,-1.7323349714279175,0.0,0.0,0.0,0.015088260408967552,0.9998861635502716,2.8759477929817807,-7.161661294298464,0.7483018123443518,0.0,0.0,0.0,1.0
1718034588.4133008,map,True,False,5,6,0.0,0.0,1.2607860565185547,-1.7312829494476318,0.0,0.0,0.0,0.013004652105591256,0.9999154323343799,2.8759477929817807,-7.161661294298464,0.7483018123443518,0.0,0.0,0.0,1.0
1718034588.464013,map,True,False,5,6,0.0,0.0,1.2607860565185547,-1.7312829494476318,0.0,0.0,0.0,0.013004652105591256,0.9999154323343799,2.8759477929817807,-7.161661294298464,0.7483018123443518,0.0,0.0,0.0,1.0
1718034588.5138226,map,True,False,5,6,0.0,0.0,1.2607860565185547,-1.7312829494476318,0.0,0.0,0.0,0.013004652105591256,0.9999154323343799,2.903879639302899,-6.999655872229635,0.7304449433646059,0.0,0.0,0.0,1.0
1718034588.6145787,map,True,False,5,5,0.612995793784914,0.612995793784914,1.2607860565185547,-1.7312829494476318,0.0,0.0,0.0,0.013004652105591256,0.9999154323343799,2.919809562993037,-6.959946397740348,0.737951598075838,0.0,0.0,0.0,1.0
1718034588.6644711,map,True,False,5,5,0.612995793784914,0.612995793784914,1.2607860565185547,-1.7312829494476318,0.0,0.0,0.0,0.013004652105591256,0.9999154323343799,2.919809562993037,-6.959946397740348,0.737951598075838,0.0,0.0,0.0,1.0
1718034588.7142248,map,True,True,5,5,0.612995793784914,0.612995793784914,1.2607860565185547,-1.7312829494476318,0.0,0.0,0.0,0.013004652105591256,0.9999154323343799,2.919809562993037,-6.959946397740348,0.737951598075838,0.0,0.0,0.0,1.0
1718034588.815091,map,True,False,5,5,0.612995793784914,0.612995793784914,1.2607860565185547,-1.7312829494476318,0.0,0.0,0.0,0.013004652105591256,0.9999154323343799,2.919809562993037,-6.959946397740348,0.737951598075838,0.0,0.0,0.0,1.0
1718034588.866673,map,True,True,5,5,0.612995793784914,0.612995793784914,1.2607860565185547,-1.7312829494476318,0.0,0.0,0.0,0.013004652105591256,0.9999154323343799,2.9530473937080064,-6.686034673707886,0.7274673175350687,0.0,0.0,0.0,1.0
1718034588.9165788,map,True,True,5,5,0.612995793784914,0.612995793784914,1.2607860565185547,-1.7312829494476318,0.0,0.0,0.0,0.013004652105591256,0.9999154323343799,2.9324132273431083,-6.594478885620445,0.7338928027775745,0.0,0.0,0.0,1.0
1718034588.9677851,map,True,True,5,5,0.612995793784914,0.612995793784914,1.2607860565185547,-1.7312829494476318,0.0,0.0,0.0,0.013004652105591256,0.9999154323343799,2.9324132273431083,-6.594478885620445,0.7338928027775745,0.0,0.0,0.0,1.0
1718034589.0658562,map,True,True,5,5,0.612995793784914,0.612995793784914,1.3581624031066895,-1.7284400463104248,0.0,0.0,0.0,0.012047929690710871,0.9999274138094473,2.9324132273431083,-6.594478885620445,0.7338928027775745,0.0,0.0,0.0,1.0
1718034589.1162915,map,True,True,5,5,0.612995793784914,0.612995793784914,1.3581624031066895,-1.7284400463104248,0.0,0.0,0.0,0.012047929690710871,0.9999274138094473,2.9324132273431083,-6.594478885620445,0.7338928027775745,0.0,0.0,0.0,1.0
1718034589.1673768,map,True,True,5,5,0.612995793784914,0.612995793784914,1.3581624031066895,-1.7284400463104248,0.0,0.0,0.0,0.012047929690710871,0.9999274138094473,2.9324132273431083,-6.594478885620445,0.7338928027775745,0.0,0.0,0.0,1.0
1718034589.218612,map,True,True,5,5,0.612995793784914,0.612995793784914,1.3581624031066895,-1.7284400463104248,0.0,0.0,0.0,0.012047929690710871,0.9999274138094473,2.9706632378579623,-6.4820620323666125,0.711186617555342,0.0,0.0,0.0,1.0
1718034589.2700937,map,True,False,5,5,0.612995793784914,0.612995793784914,1.3581624031066895,-1.7284400463104248,0.0,0.0,0.0,0.012047929690710871,0.9999274138094473,2.9706632378579623,-6.4820620323666125,0.711186617555342,0.0,0.0,0.0,1.0
1718034589.3695347,map,True,True,5,5,0.612995793784914,0.612995793784914,1.3581624031066895,-1.7284400463104248,0.0,0.0,0.0,0.012047929690710871,0.9999274138094473,2.9706632378579623,-6.4820620323666125,0.711186617555342,0.0,0.0,0.0,1.0
1718034589.4694638,map,True,True,5,5,0.612995793784914,0.612995793784914,1.3581624031066895,-1.7284400463104248,0.0,0.0,0.0,0.012047929690710871,0.9999274138094473,2.9706632378579623,-6.4820620323666125,0.711186617555342,0.0,0.0,0.0,1.0
1718034589.569164,map,True,False,5,5,0.612995793784914,0.612995793784914,1.3581624031066895,-1.7284400463104248,0.0,0.0,0.0,0.012047929690710871,0.9999274138094473,2.9505446356035248,-6.088355051785028,0.7086598778898777,0.0,0.0,0.0,1.0
1718034589.6190891,map,True,False,5,5,0.612995793784914,0.612995793784914,1.3581624031066895,-1.7284400463104248,0.0,0.0,0.0,0.012047929690710871,0.9999274138094473,2.9505446356035248,-6.088355051785028,0.7086598778898777,0.0,0.0,0.0,1.0
1718034589.6711023,map,True,True,5,5,0.612995793784914,0.612995793784914,1.4204299449920654,-1.7768657207489014,0.0,0.0,0.0,0.015578085333793594,0.9998786524817884,2.9505446356035248,-6.088355051785028,0.7086598778898777,0.0,0.0,0.0,1.0
1718034589.770922,map,True,True,5,5,0.612995793784914,0.612995793784914,1.4204299449920654,-1.7768657207489014,0.0,0.0,0.0,0.015578085333793594,0.9998786524817884,2.9505446356035248,-6.088355051785028,0.7086598778898777,0.0,0.0,0.0,1.0
1718034589.8196917,map,True,True,5,5,0.612995793784914,0.612995793784914,1.4204299449920654,-1.7768657207489014,0.0,0.0,0.0,0.015578085333793594,0.9998786524817884,2.9505446356035248,-6.088355051785028,0.7086598778898777,0.0,0.0,0.0,1.0
1718034589.9221933,map,True,True,5,5,0.612995793784914,0.612995793784914,1.4204299449920654,-1.7768657207489014,0.0,0.0,0.0,0.015578085333793594,0.9998786524817884,3.0415020581146353,-6.1841350138339894,0.7092551056170852,0.0,0.0,0.0,1.0
1718034590.0223894,map,True,True,5,5,0.612995793784914,0.612995793784914,1.4204299449920654,-1.7768657207489014,0.0,0.0,0.0,0.015578085333793594,0.9998786524817884,3.0415020581146353,-6.1841350138339894,0.7092551056170852,0.0,0.0,0.0,1.0
1718034590.1211324,map,True,True,5,5,0.612995793784914,0.612995793784914,1.4204299449920654,-1.7768657207489014,0.0,0.0,0.0,0.015578085333793594,0.9998786524817884,3.0415020581146353,-6.1841350138339894,0.7092551056170852,0.0,0.0,0.0,1.0
1718034590.1739619,map,True,False,5,5,0.612995793784914,0.612995793784914,1.4204299449920654,-1.7768657207489014,0.0,0.0,0.0,0.015578085333793594,0.9998786524817884,3.0415020581146353,-6.1841350138339894,0.7092551056170852,0.0,0.0,0.0,1.0
1718034590.2223701,map,True,True,5,5,0.612995793784914,0.612995793784914,1.4204299449920654,-1.7768657207489014,0.0,0.0,0.0,0.015578085333793594,0.9998786524817884,3.138590465874718,-6.116794641466942,0.7019780741261726,0.0,0.0,0.0,1.0
1718034590.2731905,map,True,False,5,5,0.612995793784914,0.612995793784914,1.4204299449920654,-1.7768657207489014,0.0,0.0,0.0,0.015578085333793594,0.9998786524817884,3.138590465874718,-6.116794641466942,0.7019780741261726,0.0,0.0,0.0,1.0
1718034590.3755074,map,True,True,5,5,0.612995793784914,0.612995793784914,1.4204299449920654,-1.7768657207489014,0.0,0.0,0.0,0.015578085333793594,0.9998786524817884,3.138590465874718,-6.116794641466942,0.7019780741261726,0.0,0.0,0.0,1.0
1718034590.4732382,map,True,False,5,5,0.612995793784914,0.612995793784914,1.464905023574829,-1.7848948240280151,0.0,0.0,0.0,0.0159617694595435,0.9998726018578105,3.138590465874718,-6.116794641466942,0.7019780741261726,0.0,0.0,0.0,1.0
1718034590.524032,map,True,True,5,5,0.612995793784914,0.612995793784914,1.464905023574829,-1.7848948240280151,0.0,0.0,0.0,0.0159617694595435,0.9998726018578105,3.2159786950628364,-5.998035084438989,0.7078228272805256,0.0,0.0,0.0,1.0
1718034590.6229846,map,True,False,5,4,0.0,0.0,1.464905023574829,-1.7848948240280151,0.0,0.0,0.0,0.0159617694595435,0.9998726018578105,3.2085577810909003,-5.87382121343067,0.681545462124622,0.0,0.0,0.0,1.0
1718034590.6746879,map,True,False,5,4,0.0,0.0,1.464905023574829,-1.7848948240280151,0.0,0.0,0.0,0.0159617694595435,0.9998726018578105,3.2085577810909003,-5.87382121343067,0.681545462124622,0.0,0.0,0.0,1.0
1718034590.774844,map,True,False,5,4,0.0,0.0,1.464905023574829,-1.7848948240280151,0.0,0.0,0.0,0.0159617694595435,0.9998726018578105,3.2085577810909003,-5.87382121343067,0.681545462124622,0.0,0.0,0.0,1.0
1718034590.8239188,map,True,False,5,4,0.0,0.0,1.464905023574829,-1.7848948240280151,0.0,0.0,0.0,0.0159617694595435,0.9998726018578105,3.2085577810909003,-5.87382121343067,0.681545462124622,0.0,0.0,0.0,1.0
1718034590.8756297,map,True,False,5,4,0.0,0.0,1.464905023574829,-1.7848948240280151,0.0,0.0,0.0,0.0159617694595435,0.9998726018578105,3.2215000207541813,-5.666884387261064,0.6570717045971881,0.0,0.0,0.0,1.0
1718034590.9253008,map,True,False,5,4,0.0,0.0,1.464905023574829,-1.7848948240280151,0.0,0.0,0.0,0.0159617694595435,0.9998726018578105,3.2215000207541813,-5.666884387261064,0.6570717045971881,0.0,0.0,0.0,1.0
1718034590.97578,map,True,False,5,4,0.0,0.0,1.5233485698699951,-1.7966660261154175,0.0,0.0,0.0,0.016416154224961975,0.9998652397191574,3.2215000207541813,-5.666884387261064,0.6570717045971881,0.0,0.0,0.0,1.0
1718034591.0265362,map,True,False,5,4,0.0,0.0,1.5233485698699951,-1.7966660261154175,0.0,0.0,0.0,0.016416154224961975,0.9998652397191574,3.2215000207541813,-5.666884387261064,0.6570717045971881,0.0,0.0,0.0,1.0
1718034591.125587,map,True,False,5,4,0.0,0.0,1.5233485698699951,-1.7966660261154175,0.0,0.0,0.0,0.016416154224961975,0.9998652397191574,3.2215000207541813,-5.666884387261064,0.6570717045971881,0.0,0.0,0.0,1.0
1718034591.2279954,map,True,False,5,4,0.0,0.0,1.5233485698699951,-1.7966660261154175,0.0,0.0,0.0,0.016416154224961975,0.9998652397191574,3.2359657109330535,-5.520224628952954,0.6929765987991693,0.0,0.0,0.0,1.0
1718034591.2754624,map,True,False,5,4,0.0,0.0,1.5233485698699951,-1.7966660261154175,0.0,0.0,0.0,0.016416154224961975,0.9998652397191574,3.2359657109330535,-5.520224628952954,0.6929765987991693,0.0,0.0,0.0,1.0
1718034591.3760843,map,True,False,5,4,0.0,0.0,1.5233485698699951,-1.7966660261154175,0.0,0.0,0.0,0.016416154224961975,0.9998652397191574,3.2359657109330535,-5.520224628952954,0.6929765987991693,0.0,0.0,0.0,1.0
1718034591.4265876,map,True,False,5,4,0.0,0.0,1.5233485698699951,-1.7966660261154175,0.0,0.0,0.0,0.016416154224961975,0.9998652397191574,3.2359657109330535,-5.520224628952954,0.6929765987991693,0.0,0.0,0.0,1.0
1718034591.479188,map,True,False,5,4,0.0,0.0,1.5233485698699951,-1.7966660261154175,0.0,0.0,0.0,0.016416154224961975,0.9998652397191574,3.2213279640779655,-5.442380675646241,0.6984327158538152,0.0,0.0,0.0,1.0
1718034591.5274136,map,True,False,5,4,0.0,0.0,1.5233485698699951,-1.7966660261154175,0.0,0.0,0.0,0.016416154224961975,0.9998652397191574,3.2754139777112155,-5.38133364700321,0.7093237792899582,0.0,0.0,0.0,1.0
1718034591.5775275,map,True,True,4,4,0.5922520728754596,0.5922520728754596,1.6166470050811768,-1.78041410446167,0.0,0.0,0.0,0.013484041502729612,0.9999090838826862,3.2754139777112155,-5.38133364700321,0.7093237792899582,0.0,0.0,0.0,1.0
1718034591.6284542,map,True,False,4,4,0.5922520728754596,0.5922520728754596,1.6166470050811768,-1.78041410446167,0.0,0.0,0.0,0.013484041502729612,0.9999090838826862,3.2754139777112155,-5.38133364700321,0.7093237792899582,0.0,0.0,0.0,1.0
1718034591.6781735,map,True,True,4,4,0.5922520728754596,0.5922520728754596,1.6166470050811768,-1.78041410446167,0.0,0.0,0.0,0.013484041502729612,0.9999090838826862,3.2754139777112155,-5.38133364700321,0.7093237792899582,0.0,0.0,0.0,1.0
1718034591.7295494,map,True,False,4,4,0.5922520728754596,0.5922520728754596,1.6166470050811768,-1.78041410446167,0.0,0.0,0.0,0.013484041502729612,0.9999090838826862,3.2754139777112155,-5.38133364700321,0.7093237792899582,0.0,0.0,0.0,1.0
1718034591.781098,map,True,False,4,4,0.5922520728754596,0.5922520728754596,1.6166470050811768,-1.78041410446167,0.0,0.0,0.0,0.013484041502729612,0.9999090838826862,3.2754139777112155,-5.38133364700321,0.7093237792899582,0.0,0.0,0.0,1.0
1718034592.1805544,map,True,False,4,3,0.0,0.0,1.6166470050811768,-1.78041410446167,0.0,0.0,0.0,0.013484041502729612,0.9999090838826862,3.3497321618205436,-4.964037482501439,0.6858875849957421,0.0,0.0,0.0,1.0
1718034592.279219,map,True,False,4,3,0.0,0.0,1.667536735534668,-1.8270690441131592,0.0,0.0,0.0,0.018721210669445112,0.9998247469875512,3.3500169082520346,-4.906109201152562,0.6510966658527412,0.0,0.0,0.0,1.0
1718034592.3298793,map,True,False,4,3,0.0,0.0,1.667536735534668,-1.8270690441131592,0.0,0.0,0.0,0.018721210669445112,0.9998247469875512,3.3500169082520346,-4.906109201152562,0.6510966658527412,0.0,0.0,0.0,1.0
1718034592.4326963,map,True,False,4,3,0.0,0.0,1.667536735534668,-1.8270690441131592,0.0,0.0,0.0,0.018721210669445112,0.9998247469875512,3.3500169082520346,-4.906109201152562,0.6510966658527412,0.0,0.0,0.0,1.0
1718034592.4816017,map,True,False,4,3,0.0,0.0,1.667536735534668,-1.8270690441131592,0.0,0.0,0.0,0.018721210669445112,0.9998247469875512,3.3500169082520346,-4.906109201152562,0.6510966658527412,0.0,0.0,0.0,1.0
1718034592.5801868,map,True,False,4,3,0.0,0.0,1.667536735534668,-1.8270690441131592,0.0,0.0,0.0,0.018721210669445112,0.9998247469875512,3.362405080363116,-4.775188441567159,0.6334800652292792,0.0,0.0,0.0,1.0
1718034592.679917,map,True,False,4,3,0.0,0.0,1.667536735534668,-1.8270690441131592,0.0,0.0,0.0,0.018721210669445112,0.9998247469875512,3.362405080363116,-4.775188441567159,0.6334800652292792,0.0,0.0,0.0,1.0
1718034592.7303271,map,True,False,4,3,0.0,0.0,1.667536735534668,-1.8270690441131592,0.0,0.0,0.0,0.018721210669445112,0.9998247469875512,3.362405080363116,-4.775188441567159,0.6334800652292792,0.0,0.0,0.0,1.0
1718034592.8302248,map,True,False,4,3,0.0,0.0,1.667536735534668,-1.8270690441131592,0.0,0.0,0.0,0.018721210669445112,0.9998247469875512,3.362405080363116,-4.775188441567159,0.6334800652292792,0.0,0.0,0.0,1.0
1718034592.88172,map,True,False,4,3,0.0,0.0,1.7433381080627441,-1.8430559635162354,0.0,0.0,0.0,0.0199850703278543,0.9998002746925808,3.322894954814963,-4.5576440909624,0.667740380851626,0.0,0.0,0.0,1.0
1718034592.932117,map,True,False,4,3,0.0,0.0,1.7433381080627441,-1.8430559635162354,0.0,0.0,0.0,0.0199850703278543,0.9998002746925808,3.322894954814963,-4.5576440909624,0.667740380851626,0.0,0.0,0.0,1.0
1718034592.982487,map,True,False,4,3,0.0,0.0,1.7433381080627441,-1.8430559635162354,0.0,0.0,0.0,0.0199850703278543,0.9998002746925808,3.322894954814963,-4.5576440909624,0.667740380851626,0.0,0.0,0.0,1.0
1718034593.0811493,map,True,False,4,3,0.0,0.0,1.7433381080627441,-1.8430559635162354,0.0,0.0,0.0,0.0199850703278543,0.9998002746925808,3.322894954814963,-4.5576440909624,0.667740380851626,0.0,0.0,0.0,1.0
1718034593.1315825,map,True,False,4,3,0.0,0.0,1.7433381080627441,-1.8430559635162354,0.0,0.0,0.0,0.0199850703278543,0.9998002746925808,3.322894954814963,-4.5576440909624,0.667740380851626,0.0,0.0,0.0,1.0
1718034593.1827595,map,True,False,4,3,0.0,0.0,1.7433381080627441,-1.8430559635162354,0.0,0.0,0.0,0.0199850703278543,0.9998002746925808,3.3426064359926535,-4.474538397668612,0.6807666678996614,0.0,0.0,0.0,1.0
1718034593.2315514,map,True,False,4,3,0.0,0.0,1.7433381080627441,-1.8430559635162354,0.0,0.0,0.0,0.0199850703278543,0.9998002746925808,3.373901740171253,-4.426952913918168,0.6807437933944452,0.0,0.0,0.0,1.0
1718034593.2835822,map,True,False,4,3,0.0,0.0,1.7433381080627441,-1.8430559635162354,0.0,0.0,0.0,0.0199850703278543,0.9998002746925808,3.373901740171253,-4.426952913918168,0.6807437933944452,0.0,0.0,0.0,1.0
1718034593.3814664,map,True,False,4,3,0.0,0.0,1.8339452743530273,-1.862378478050232,0.0,0.0,0.0,0.021253394694479028,0.9997741175883529,3.373901740171253,-4.426952913918168,0.6807437933944452,0.0,0.0,0.0,1.0
1718034593.4320748,map,True,False,4,3,0.0,0.0,1.8339452743530273,-1.862378478050232,0.0,0.0,0.0,0.021253394694479028,0.9997741175883529,3.373901740171253,-4.426952913918168,0.6807437933944452,0.0,0.0,0.0,1.0
1718034593.4820228,map,True,False,4,3,0.0,0.0,1.8339452743530273,-1.862378478050232,0.0,0.0,0.0,0.021253394694479028,0.9997741175883529,3.373901740171253,-4.426952913918168,0.6807437933944452,0.0,0.0,0.0,1.0
1718034593.5836298,map,True,False,4,3,0.0,0.0,1.8339452743530273,-1.862378478050232,0.0,0.0,0.0,0.021253394694479028,0.9997741175883529,3.465303923840555,-4.289570440013037,0.6804527433990812,0.0,0.0,0.0,1.0
1718034593.6824093,map,True,False,4,3,0.0,0.0,1.8339452743530273,-1.862378478050232,0.0,0.0,0.0,0.021253394694479028,0.9997741175883529,3.465303923840555,-4.289570440013037,0.6804527433990812,0.0,0.0,0.0,1.0
1718034593.7331548,map,True,False,4,3,0.0,0.0,1.8339452743530273,-1.862378478050232,0.0,0.0,0.0,0.021253394694479028,0.9997741175883529,3.465303923840555,-4.289570440013037,0.6804527433990812,0.0,0.0,0.0,1.0
1718034593.7829137,map,True,False,4,3,0.0,0.0,1.8339452743530273,-1.862378478050232,0.0,0.0,0.0,0.021253394694479028,0.9997741175883529,3.465303923840555,-4.289570440013037,0.6804527433990812,0.0,0.0,0.0,1.0
1718034593.8334656,map,True,False,4,3,0.0,0.0,1.8339452743530273,-1.862378478050232,0.0,0.0,0.0,0.021253394694479028,0.9997741175883529,3.465303923840555,-4.289570440013037,0.6804527433990812,0.0,0.0,0.0,1.0
1718034593.88493,map,True,False,4,3,0.0,0.0,1.8339452743530273,-1.862378478050232,0.0,0.0,0.0,0.021253394694479028,0.9997741175883529,3.451198851110901,-4.021491530000095,0.6627972311534241,0.0,0.0,0.0,1.0
1718034593.935226,map,True,False,4,3,0.0,0.0,1.9086174964904785,-1.876127004623413,0.0,0.0,0.0,0.02266841976517561,0.9997430411647742,3.451198851110901,-4.021491530000095,0.6627972311534241,0.0,0.0,0.0,1.0
1718034594.0345979,map,True,False,4,3,0.0,0.0,1.9086174964904785,-1.876127004623413,0.0,0.0,0.0,0.02266841976517561,0.9997430411647742,3.451198851110901,-4.021491530000095,0.6627972311534241,0.0,0.0,0.0,1.0
1718034594.1335511,map,True,False,4,3,0.0,0.0,1.9086174964904785,-1.876127004623413,0.0,0.0,0.0,0.02266841976517561,0.9997430411647742,3.451198851110901,-4.021491530000095,0.6627972311534241,0.0,0.0,0.0,1.0
1718034594.1851497,map,True,False,4,3,0.0,0.0,1.9086174964904785,-1.876127004623413,0.0,0.0,0.0,0.02266841976517561,0.9997430411647742,3.451198851110901,-4.021491530000095,0.6627972311534241,0.0,0.0,0.0,1.0
1718034594.2835484,map,True,False,4,2,0.0,0.0,1.9086174964904785,-1.876127004623413,0.0,0.0,0.0,0.02266841976517561,0.9997430411647742,3.476092847118681,-3.892081658010815,0.6572685995172013,0.0,0.0,0.0,1.0
1718034594.3341794,map,True,False,4,2,0.0,0.0,1.9086174964904785,-1.876127004623413,0.0,0.0,0.0,0.02266841976517561,0.9997430411647742,3.476092847118681,-3.892081658010815,0.6572685995172013,0.0,0.0,0.0,1.0
1718034594.3843942,map,True,False,4,2,0.0,0.0,1.9086174964904785,-1.876127004623413,0.0,0.0,0.0,0.02266841976517561,0.9997430411647742,3.476092847118681,-3.892081658010815,0.6572685995172013,0.0,0.0,0.0,1.0
1718034594.4354794,map,True,False,4,2,0.0,0.0,1.9086174964904785,-1.876127004623413,0.0,0.0,0.0,0.02266841976517561,0.9997430411647742,3.476092847118681,-3.892081658010815,0.6572685995172013,0.0,0.0,0.0,1.0
1718034594.485839,map,True,False,3,2,0.0,0.0,2.004934072494507,-1.905653715133667,0.0,0.0,0.0,0.02469598286412302,0.9996950012240412,3.476092847118681,-3.892081658010815,0.6572685995172013,0.0,0.0,0.0,1.0
1718034594.5856345,map,True,False,3,2,0.0,0.0,2.004934072494507,-1.905653715133667,0.0,0.0,0.0,0.02469598286412302,0.9996950012240412,3.4967075248857213,-3.75244916833427,0.6864293984654258,0.0,0.0,0.0,1.0
1718034594.6862426,map,True,False,3,2,0.0,0.0,2.004934072494507,-1.905653715133667,0.0,0.0,0.0,0.02469598286412302,0.9996950012240412,3.4967075248857213,-3.75244916833427,0.6864293984654258,0.0,0.0,0.0,1.0
1718034594.736431,map,True,False,3,2,0.0,0.0,2.004934072494507,-1.905653715133667,0.0,0.0,0.0,0.02469598286412302,0.9996950012240412,3.4967075248857213,-3.75244916833427,0.6864293984654258,0.0,0.0,0.0,1.0
1718034594.787096,map,True,False,3,2,0.0,0.0,2.004934072494507,-1.905653715133667,0.0,0.0,0.0,0.02469598286412302,0.9996950012240412,3.4967075248857213,-3.75244916833427,0.6864293984654258,0.0,0.0,0.0,1.0
1718034594.8377357,map,True,False,3,2,0.0,0.0,2.004934072494507,-1.905653715133667,0.0,0.0,0.0,0.02469598286412302,0.9996950012240412,3.4967075248857213,-3.75244916833427,0.6864293984654258,0.0,0.0,0.0,1.0
1718034594.8886395,map,True,False,3,2,0.0,0.0,2.004934072494507,-1.905653715133667,0.0,0.0,0.0,0.02469598286412302,0.9996950012240412,3.4819689868238397,-3.6267679390481193,0.6860786872099116,0.0,0.0,0.0,1.0
1718034594.939141,map,True,False,3,2,0.0,0.0,2.004934072494507,-1.905653715133667,0.0,0.0,0.0,0.02469598286412302,0.9996950012240412,3.4819689868238397,-3.6267679390481193,0.6860786872099116,0.0,0.0,0.0,1.0
1718034594.9890687,map,True,False,3,2,0.0,0.0,2.1170084476470947,-1.935823917388916,0.0,0.0,0.0,0.02541251484626135,0.999677054591222,3.4819689868238397,-3.6267679390481193,0.6860786872099116,0.0,0.0,0.0,1.0
1718034595.0393863,map,True,False,3,2,0.0,0.0,2.1170084476470947,-1.935823917388916,0.0,0.0,0.0,0.02541251484626135,0.999677054591222,3.4819689868238397,-3.6267679390481193,0.6860786872099116,0.0,0.0,0.0,1.0
1718034595.1444528,map,True,False,3,2,0.0,0.0,2.1170084476470947,-1.935823917388916,0.0,0.0,0.0,0.02541251484626135,0.999677054591222,3.4819689868238397,-3.6267679390481193,0.6860786872099116,0.0,0.0,0.0,1.0
1718034595.1936712,map,True,False,3,2,0.0,0.0,2.1170084476470947,-1.935823917388916,0.0,0.0,0.0,0.02541251484626135,0.999677054591222,3.550520702173099,-3.5719696281506743,0.6857819516694637,0.0,0.0,0.0,1.0
1718034595.2439337,map,True,False,3,2,0.0,0.0,2.1170084476470947,-1.935823917388916,0.0,0.0,0.0,0.02541251484626135,0.999677054591222,3.5655110880424274,-3.572296318266879,0.6830259883030222,0.0,0.0,0.0,1.0
1718034595.2944994,map,True,False,3,2,0.0,0.0,2.1170084476470947,-1.935823917388916,0.0,0.0,0.0,0.02541251484626135,0.999677054591222,3.5655110880424274,-3.572296318266879,0.6830259883030222,0.0,0.0,0.0,1.0
1718034595.3453414,map,True,False,3,2,0.0,0.0,2.1170084476470947,-1.935823917388916,0.0,0.0,0.0,0.02541251484626135,0.999677054591222,3.5655110880424274,-3.572296318266879,0.6830259883030222,0.0,0.0,0.0,1.0
1718034595.3949032,map,True,False,3,2,0.0,0.0,2.1170084476470947,-1.935823917388916,0.0,0.0,0.0,0.02541251484626135,0.999677054591222,3.5655110880424274,-3.572296318266879,0.6830259883030222,0.0,0.0,0.0,1.0
1718034595.4950695,map,True,False,3,2,0.0,0.0,2.1170084476470947,-1.935823917388916,0.0,0.0,0.0,0.02541251484626135,0.999677054591222,3.5655110880424274,-3.572296318266879,0.6830259883030222,0.0,0.0,0.0,1.0
1718034595.545767,map,True,False,3,2,0.0,0.0,2.196025848388672,-1.9541419744491577,0.0,0.0,0.0,0.027103611449235628,0.99963263379877,3.679157609645965,-3.3905076816626103,0.6849262195463829,0.0,0.0,0.0,1.0
1718034595.595483,map,True,False,3,2,0.0,0.0,2.196025848388672,-1.9541419744491577,0.0,0.0,0.0,0.027103611449235628,0.99963263379877,3.679157609645965,-3.3905076816626103,0.6849262195463829,0.0,0.0,0.0,1.0
1718034595.6968553,map,True,False,3,2,0.0,0.0,2.196025848388672,-1.9541419744491577,0.0,0.0,0.0,0.027103611449235628,0.99963263379877,3.679157609645965,-3.3905076816626103,0.6849262195463829,0.0,0.0,0.0,1.0
1718034595.7457657,map,True,False,3,2,0.0,0.0,2.196025848388672,-1.9541419744491577,0.0,0.0,0.0,0.027103611449235628,0.99963263379877,3.679157609645965,-3.3905076816626103,0.6849262195463829,0.0,0.0,0.0,1.0
1718034595.846274,map,True,False,3,2,0.0,0.0,2.196025848388672,-1.9541419744491577,0.0,0.0,0.0,0.027103611449235628,0.99963263379877,3.679157609645965,-3.3905076816626103,0.6849262195463829,0.0,0.0,0.0,1.0
1718034595.8964458,map,True,False,3,2,0.0,0.0,2.196025848388672,-1.9541419744491577,0.0,0.0,0.0,0.027103611449235628,0.99963263379877,3.754760365052383,-3.225267479951625,0.6842438319559208,0.0,0.0,0.0,1.0
1718034595.9970324,map,True,False,3,2,0.0,0.0,2.196025848388672,-1.9541419744491577,0.0,0.0,0.0,0.027103611449235628,0.99963263379877,3.754760365052383,-3.225267479951625,0.6842438319559208,0.0,0.0,0.0,1.0
1718034596.095947,map,True,False,3,2,0.0,0.0,2.285306215286255,-1.9699878692626953,0.0,0.0,0.0,0.02720543961461768,0.9996298611603704,3.754760365052383,-3.225267479951625,0.6842438319559208,0.0,0.0,0.0,1.0
1718034596.147239,map,True,False,3,2,0.0,0.0,2.285306215286255,-1.9699878692626953,0.0,0.0,0.0,0.02720543961461768,0.9996298611603704,3.754760365052383,-3.225267479951625,0.6842438319559208,0.0,0.0,0.0,1.0
1718034596.2461686,map,True,False,3,2,0.0,0.0,2.285306215286255,-1.9699878692626953,0.0,0.0,0.0,0.02720543961461768,0.9996298611603704,3.796594473738333,-3.032612910365607,0.6834888471173489,0.0,0.0,0.0,1.0
1718034596.296466,map,True,False,3,2,0.0,0.0,2.285306215286255,-1.9699878692626953,0.0,0.0,0.0,0.02720543961461768,0.9996298611603704,3.796594473738333,-3.032612910365607,0.6834888471173489,0.0,0.0,0.0,1.0
1718034596.3467674,map,True,False,3,2,0.0,0.0,2.285306215286255,-1.9699878692626953,0.0,0.0,0.0,0.02720543961461768,0.9996298611603704,3.796594473738333,-3.032612910365607,0.6834888471173489,0.0,0.0,0.0,1.0
1718034596.3976655,map,True,False,3,2,0.0,0.0,2.285306215286255,-1.9699878692626953,0.0,0.0,0.0,0.02720543961461768,0.9996298611603704,3.796594473738333,-3.032612910365607,0.6834888471173489,0.0,0.0,0.0,1.0
1718034596.4483855,map,True,False,3,2,0.0,0.0,2.285306215286255,-1.9699878692626953,0.0,0.0,0.0,0.02720543961461768,0.9996298611603704,3.796594473738333,-3.032612910365607,0.6834888471173489,0.0,0.0,0.0,1.0
1718034596.499007,map,True,False,3,2,0.0,0.0,2.285306215286255,-1.9699878692626953,0.0,0.0,0.0,0.02720543961461768,0.9996298611603704,3.796594473738333,-3.032612910365607,0.6834888471173489,0.0,0.0,0.0,1.0
1718034596.5987754,map,True,False,2,2,0.49874686716791977,0.49874686716791977,2.3693106174468994,-1.9878795146942139,0.0,0.0,0.0,0.02868575163621963,0.9995884793636596,3.8464234627122895,-2.8421178697625757,0.681024390705636,0.0,0.0,0.0,1.0
1718034596.6496954,map,True,True,2,2,0.49874686716791977,0.49874686716791977,2.3693106174468994,-1.9878795146942139,0.0,0.0,0.0,0.02868575163621963,0.9995884793636596,3.8464234627122895,-2.8421178697625757,0.681024390705636,0.0,0.0,0.0,1.0
1718034596.7033257,map,True,True,2,2,0.49874686716791977,0.49874686716791977,2.3693106174468994,-1.9878795146942139,0.0,0.0,0.0,0.02868575163621963,0.9995884793636596,3.8464234627122895,-2.8421178697625757,0.681024390705636,0.0,0.0,0.0,1.0
1718034596.7522929,map,True,False,2,2,0.49874686716791977,0.49874686716791977,2.3693106174468994,-1.9878795146942139,0.0,0.0,0.0,0.02868575163621963,0.9995884793636596,3.8464234627122895,-2.8421178697625757,0.681024390705636,0.0,0.0,0.0,1.0
1718034596.8011904,map,True,True,2,2,0.49874686716791977,0.49874686716791977,2.3693106174468994,-1.9878795146942139,0.0,0.0,0.0,0.02868575163621963,0.9995884793636596,3.8464234627122895,-2.8421178697625757,0.681024390705636,0.0,0.0,0.0,1.0
1718034596.8533926,map,True,False,2,1,0.0,0.0,2.3693106174468994,-1.9878795146942139,0.0,0.0,0.0,0.02868575163621963,0.9995884793636596,3.841453459482376,-2.705993100419376,0.6808270569161918,0.0,0.0,0.0,1.0
1718034596.904267,map,True,False,2,1,0.0,0.0,2.3693106174468994,-1.9878795146942139,0.0,0.0,0.0,0.02868575163621963,0.9995884793636596,3.853126860856449,-2.6357461843868992,0.6806708345750202,0.0,0.0,0.0,1.0
1718034596.9532275,map,True,False,2,1,0.0,0.0,2.3693106174468994,-1.9878795146942139,0.0,0.0,0.0,0.02868575163621963,0.9995884793636596,3.853126860856449,-2.6357461843868992,0.6806708345750202,0.0,0.0,0.0,1.0
1718034597.0036929,map,True,False,2,1,0.0,0.0,2.468445301055908,-1.992873191833496,0.0,0.0,0.0,0.028748576273230523,0.9995866755792339,3.853126860856449,-2.6357461843868992,0.6806708345750202,0.0,0.0,0.0,1.0
1718034597.0535252,map,True,False,2,1,0.0,0.0,2.468445301055908,-1.992873191833496,0.0,0.0,0.0,0.028748576273230523,0.9995866755792339,3.853126860856449,-2.6357461843868992,0.6806708345750202,0.0,0.0,0.0,1.0
1718034597.155055,map,True,False,2,1,0.0,0.0,2.468445301055908,-1.992873191833496,0.0,0.0,0.0,0.028748576273230523,0.9995866755792339,3.853126860856449,-2.6357461843868992,0.6806708345750202,0.0,0.0,0.0,1.0
1718034597.2054293,map,True,False,2,1,0.0,0.0,2.468445301055908,-1.992873191833496,0.0,0.0,0.0,0.028748576273230523,0.9995866755792339,3.914449767965652,-2.483808653123645,0.6802401952764399,0.0,0.0,0.0,1.0
1718034597.3044243,map,True,False,2,1,0.0,0.0,2.468445301055908,-1.992873191833496,0.0,0.0,0.0,0.028748576273230523,0.9995866755792339,3.899583513933791,-2.4624678630395023,0.6814174191554777,0.0,0.0,0.0,1.0
1718034597.4045548,map,True,False,2,1,0.0,0.0,2.5397942066192627,-1.9987074136734009,0.0,0.0,0.0,0.029430508973813222,0.999566833735717,3.899583513933791,-2.4624678630395023,0.6814174191554777,0.0,0.0,0.0,1.0
1718034597.4543462,map,True,False,2,1,0.0,0.0,2.5397942066192627,-1.9987074136734009,0.0,0.0,0.0,0.029430508973813222,0.999566833735717,3.899583513933791,-2.4624678630395023,0.6814174191554777,0.0,0.0,0.0,1.0
1718034597.5054922,map,True,False,2,1,0.0,0.0,2.5397942066192627,-1.9987074136734009,0.0,0.0,0.0,0.029430508973813222,0.999566833735717,3.899583513933791,-2.4624678630395023,0.6814174191554777,0.0,0.0,0.0,1.0
1718034597.606064,map,True,False,2,1,0.0,0.0,2.5397942066192627,-1.9987074136734009,0.0,0.0,0.0,0.029430508973813222,0.999566833735717,3.931918693639334,-2.371151506599355,0.6810349835937646,0.0,0.0,0.0,1.0
1718034597.655069,map,True,False,2,1,0.0,0.0,2.5397942066192627,-1.9987074136734009,0.0,0.0,0.0,0.029430508973813222,0.999566833735717,3.931918693639334,-2.371151506599355,0.6810349835937646,0.0,0.0,0.0,1.0
1718034597.7066128,map,True,False,2,1,0.0,0.0,2.5397942066192627,-1.9987074136734009,0.0,0.0,0.0,0.029430508973813222,0.999566833735717,3.931918693639334,-2.371151506599355,0.6810349835937646,0.0,0.0,0.0,1.0
1718034597.75605,map,True,False,2,1,0.0,0.0,2.5397942066192627,-1.9987074136734009,0.0,0.0,0.0,0.029430508973813222,0.999566833735717,3.931918693639334,-2.371151506599355,0.6810349835937646,0.0,0.0,0.0,1.0
1718034597.8586507,map,True,False,2,1,0.0,0.0,2.5397942066192627,-1.9987074136734009,0.0,0.0,0.0,0.029430508973813222,0.999566833735717,3.9648543641263085,-2.3303470784768354,0.6807958014733511,0.0,0.0,0.0,1.0
