car_pos_meter , car_pos_cell, car_speed, ped_pos_meter, ped_pos_cell, ped_speed
-15.76923, 15, 1, 3.990369, 15, 1
-15.73731, 15, 2, 3.982064, 15, 1
-15.67323, 15, 2, 3.964873, 15, 1
-15.60915, 15, 1, 3.948115, 15, 1
-15.57723, 15, 2, 3.931153, 15, 1
-15.51315, 15, 2, 3.914024, 15, 1
-15.44908, 15, 2, 3.905904, 15, 1
-15.385, 15, 2, 3.889243, 15, 1
-15.32092, 15, 1, 3.872845, 15, 1
-15.289, 15, 2, 3.856488, 15, 1
-15.22493, 15, 1, 3.839992, 15, 1
-15.193, 15, 2, 3.831883, 15, 1
-15.12893, 15, 2, 3.815502, 15, 1
-15.06485, 15, 1, 3.799408, 15, 1
-15.03293, 15, 2, 3.782982, 15, 1
-14.96885, 14, 2, 3.766196, 15, 1
-14.90477, 14, 2, 3.758075, 15, 1
-14.8407, 14, 2, 3.741855, 14, 1
-14.77662, 14, 1, 3.725851, 14, 1
-14.7447, 14, 1, 3.709888, 14, 1
-14.71277, 14, 2, 3.693846, 14, 1
-14.6487, 14, 2, 3.685988, 14, 1
-14.58462, 14, 2, 3.670401, 14, 1
-14.52054, 14, 2, 3.655474, 14, 1
-14.45647, 14, 2, 3.640574, 14, 1
-14.39239, 14, 2, 3.625054, 14, 1
-14.32831, 14, 2, 3.617579, 14, 1
-14.26424, 14, 1, 3.602258, 14, 1
-14.23231, 14, 1, 3.587578, 14, 1
-14.20039, 14, 1, 3.572764, 14, 1
-14.16847, 14, 2, 3.558367, 14, 1
-14.10439, 14, 2, 3.551461, 14, 1
-14.04031, 14, 2, 3.537347, 14, 1
-13.97624, 13, 2, 3.523626, 14, 1
-13.91216, 13, 2, 3.509594, 14, 1
-13.84808, 13, 2, 3.495118, 13, 1
-13.78401, 13, 2, 3.488062, 13, 1
-13.71993, 13, 1, 3.473754, 13, 1
-13.68801, 13, 2, 3.459578, 13, 1
-13.62393, 13, 2, 3.444678, 13, 1
-13.55985, 13, 2, 3.429767, 13, 1
-13.49578, 13, 2, 3.422475, 13, 1
-13.4317, 13, 2, 3.407674, 13, 1
-13.36762, 13, 2, 3.392947, 13, 1
-13.30355, 13, 1, 3.37801, 13, 1
-13.27162, 13, 2, 3.362613, 13, 1
-13.20755, 13, 2, 3.354974, 13, 1
-13.14347, 13, 1, 3.339357, 13, 1
-13.11155, 13, 2, 3.324087, 13, 1
-13.04747, 13, 2, 3.308709, 13, 1
-12.98339, 12, 2, 3.293147, 13, 1
-12.91932, 12, 2, 3.285634, 13, 1
-12.85524, 12, 2, 3.270176, 13, 1
-12.79116, 12, 2, 3.255353, 13, 1
-12.72709, 12, 1, 3.240902, 12, 1
-12.69516, 12, 1, 3.226343, 12, 1
-12.66324, 12, 1, 3.219072, 12, 1
-12.63132, 12, 1, 3.204219, 12, 1
-12.5994, 12, 2, 3.189863, 12, 1
-12.53532, 12, 1, 3.175602, 12, 1
-12.5034, 12, 2, 3.161224, 12, 1
-12.43932, 12, 2, 3.154374, 12, 1
-12.37524, 12, 1, 3.141174, 12, 1
-12.34332, 12, 1, 3.128419, 12, 1
-12.3114, 12, 2, 3.116238, 12, 1
-12.24732, 12, 2, 3.103732, 12, 1
-12.18324, 12, 1, 3.097671, 12, 1
-12.15132, 12, 2, 3.085621, 12, 1
-12.08724, 12, 2, 3.073687, 12, 1
-12.02317, 12, 2, 3.061945, 12, 1
-11.95909, 11, 2, 3.049996, 12, 1
-11.89501, 11, 2, 3.044315, 12, 1
-11.83094, 11, 2, 3.032745, 12, 1
-11.76686, 11, 2, 3.021503, 12, 1
-11.70278, 11, 2, 3.010142, 12, 1
-11.63871, 11, 2, 2.998813, 11, 1
-11.57463, 11, 1, 2.993328, 11, 1
-11.54271, 11, 2, 2.982164, 11, 1
-11.47863, 11, 2, 2.971379, 11, 1
-11.41455, 11, 2, 2.960939, 11, 1
-11.35048, 11, 2, 2.95007, 11, 1
-11.2864, 11, 1, 2.944749, 11, 1
-11.25448, 11, 1, 2.93398, 11, 1
-11.22255, 11, 2, 2.92323, 11, 1
-11.15848, 11, 2, 2.912687, 11, 1
-11.0944, 11, 2, 2.907284, 11, 1
-11.03032, 11, 1, 2.897083, 11, 1
-10.9984, 10, 2, 2.886872, 11, 1
-10.93432, 10, 2, 2.877242, 11, 1
-10.87025, 10, 2, 2.867476, 11, 1
-10.80617, 10, 2, 2.858291, 11, 1
-10.74209, 10, 2, 2.853587, 11, 1
-10.67802, 10, 2, 2.84443, 11, 1
-10.61394, 10, 2, 2.835627, 11, 1
-10.54986, 10, 2, 2.827163, 11, 1
-10.48579, 10, 2, 2.818764, 11, 1
-10.42171, 10, 2, 2.814875, 11, 1
-10.35763, 10, 2, 2.806838, 11, 1
-10.29356, 10, 2, 2.799573, 11, 1
-10.22948, 10, 2, 2.79263, 11, 1
-10.1654, 10, 2, 2.785838, 11, 1
-10.10133, 10, 2, 2.782745, 11, 1
-10.03725, 10, 2, 2.776675, 11, 1
-9.973174, 9, 2, 2.771303, 11, 1
-9.909098, 9, 2, 2.766262, 11, 1
-9.845021, 9, 2, 2.761164, 11, 1
-9.780944, 9, 2, 2.758716, 11, 1
-9.716867, 9, 2, 2.753782, 11, 1
-9.652791, 9, 2, 2.749013, 10, 1
-9.588715, 9, 2, 2.744454, 10, 1
-9.524638, 9, 2, 2.739948, 10, 1
-9.460561, 9, 2, 2.737848, 10, 1
-9.396484, 9, 2, 2.733535, 10, 1
-9.332408, 9, 2, 2.729608, 10, 1
-9.268332, 9, 2, 2.725833, 10, 1
-9.204254, 9, 2, 2.722113, 10, 1
-9.140178, 9, 2, 2.720567, 10, 1
-9.076101, 9, 2, 2.717303, 10, 1
-9.012025, 9, 2, 2.71417, 10, 1
-8.947948, 8, 2, 2.711182, 10, 1
-8.883871, 8, 2, 2.708285, 10, 1
-8.819795, 8, 2, 2.707097, 10, 1
-8.755718, 8, 2, 2.704245, 10, 1
-8.691641, 8, 2, 2.701911, 10, 1
-8.627564, 8, 2, 2.699807, 10, 1
-8.563488, 8, 2, 2.697604, 10, 1
-8.499412, 8, 2, 2.696502, 10, 1
-8.435335, 8, 2, 2.694331, 10, 1
-8.371258, 8, 2, 2.692141, 10, 1
-8.307181, 8, 2, 2.690078, 10, 1
-8.243105, 8, 2, 2.687954, 10, 1
-8.179029, 8, 2, 2.686959, 10, 1
-8.114951, 8, 2, 2.685114, 10, 1
-8.050875, 8, 2, 2.683591, 10, 1
-7.986798, 7, 2, 2.681815, 10, 1
-7.922721, 7, 2, 2.680732, 10, 1
-7.858645, 7, 2, 2.680312, 10, 1
-7.794568, 7, 2, 2.679323, 10, 1
-7.730492, 7, 2, 2.678245, 10, 1
-7.666415, 7, 2, 2.677279, 10, 1
-7.602338, 7, 2, 2.676328, 10, 1
-7.538262, 7, 2, 2.67602, 10, 1
-7.474185, 7, 2, 2.675168, 10, 1
-7.410109, 7, 2, 2.674557, 10, 1
-7.346032, 7, 2, 2.674119, 10, 1
-7.281955, 7, 2, 2.673923, 10, 1
-7.217878, 7, 2, 2.673766, 10, 1
-7.153802, 7, 2, 2.673276, 10, 1
-7.089725, 7, 2, 2.672925, 10, 1
-7.025649, 7, 2, 2.672538, 10, 1
-6.961572, 6, 2, 2.672143, 10, 1
-6.897495, 6, 2, 2.672107, 10, 1
-6.833418, 6, 2, 2.672049, 10, 1
-6.769342, 6, 2, 2.672124, 10, 1
-6.705266, 6, 2, 2.672353, 10, 1
-6.641189, 6, 2, 2.672844, 10, 1
-6.577112, 6, 2, 2.672948, 10, 1
-6.513035, 6, 2, 2.673342, 10, 1
-6.448959, 6, 2, 2.673562, 10, 1
-6.384882, 6, 2, 2.673395, 10, 1
-6.320806, 6, 2, 2.673687, 10, 1
-6.256729, 6, 2, 2.673839, 10, 1
-6.192652, 6, 2, 2.674246, 10, 1
-6.128575, 6, 2, 2.675011, 10, 1
-6.064498, 6, 2, 2.675247, 10, 1
-6.000421, 6, 2, 2.675988, 10, 1
-5.936344, 5, 2, 2.676421, 10, 1
-5.872267, 5, 2, 2.677364, 10, 1
-5.80819, 5, 2, 2.67807, 10, 1
-5.744113, 5, 2, 2.678645, 10, 1
-5.680036, 5, 2, 2.679104, 10, 1
-5.615959, 5, 2, 2.67937, 10, 1
-5.551882, 5, 2, 2.679932, 10, 1
-5.487805, 5, 2, 2.680558, 10, 1
-5.423728, 5, 2, 2.68126, 10, 1
-5.359651, 5, 2, 2.681881, 10, 1
-5.295574, 5, 2, 2.682076, 10, 1
-5.231497, 5, 2, 2.682629, 10, 1
-5.16742, 5, 2, 2.683304, 10, 1
-5.103343, 5, 2, 2.683835, 10, 1
-5.039266, 5, 2, 2.684349, 10, 1
-4.975189, 4, 2, 2.684691, 10, 1
-4.911112, 4, 2, 2.685377, 10, 1
-4.847035, 4, 2, 2.685912, 10, 1
-4.782958, 4, 2, 2.686715, 10, 1
-4.718881, 4, 2, 2.687308, 10, 1
-4.654804, 4, 2, 2.687628, 10, 1
-4.590727, 4, 2, 2.68822, 10, 1
-4.52665, 4, 2, 2.688809, 10, 1
-4.462573, 4, 2, 2.689513, 10, 1
-4.398496, 4, 2, 2.690022, 10, 1
-4.334419, 4, 2, 2.69036, 10, 1
-4.270342, 4, 2, 2.690775, 10, 1
-4.206264, 4, 2, 2.691007, 10, 1
-4.142188, 4, 2, 2.691254, 10, 1
-4.078111, 4, 2, 2.691901, 10, 1
-4.014034, 4, 2, 2.691993, 10, 1
-3.949957, 3, 2, 2.692109, 10, 1
-3.88588, 3, 2, 2.692436, 10, 1
-3.821803, 3, 2, 2.692642, 10, 1
-3.757726, 3, 2, 2.692938, 10, 1
-3.693649, 3, 2, 2.692983, 10, 1
-3.629572, 3, 2, 2.69289, 10, 1
-3.565495, 3, 2, 2.693021, 10, 1
-3.501418, 3, 2, 2.692713, 10, 1
-3.43734, 3, 2, 2.692607, 10, 1
-3.373264, 3, 2, 2.69262, 10, 1
-3.309186, 3, 2, 2.692764, 10, 1
-3.24511, 3, 2, 2.692884, 10, 1
-3.181032, 3, 2, 2.693059, 10, 1
-3.116956, 3, 2, 2.693119, 10, 1
-3.052878, 3, 2, 2.693047, 10, 1
-2.988801, 2, 2, 2.692908, 10, 1
-2.924725, 2, 2, 2.692852, 10, 1
-2.860647, 2, 2, 2.692905, 10, 1
-2.796571, 2, 2, 2.692964, 10, 1
-2.732493, 2, 2, 2.692941, 10, 1
-2.668417, 2, 2, 2.692783, 10, 1
-2.604339, 2, 2, 2.692444, 10, 1
-2.540262, 2, 2, 2.692384, 10, 1
-2.476185, 2, 2, 2.692401, 10, 1
-2.412108, 2, 2, 2.692287, 10, 1
-2.348031, 2, 2, 2.691716, 10, 1
-2.283954, 2, 2, 2.691461, 10, 1
-2.219877, 2, 2, 2.691371, 10, 1
-2.1558, 2, 2, 2.691068, 10, 1
-2.091723, 2, 2, 2.690835, 10, 1
-2.027646, 2, 2, 2.690499, 10, 1
-1.963569, 1, 2, 2.690159, 10, 1
-1.899492, 1, 2, 2.689652, 10, 1
-1.835415, 1, 2, 2.68938, 10, 1
-1.771338, 1, 2, 2.689009, 10, 1
-1.707261, 1, 2, 2.688833, 10, 1
-1.643184, 1, 2, 2.688484, 10, 1
-1.579107, 1, 2, 2.68803, 10, 1
-1.51503, 1, 2, 2.687721, 10, 1
-1.450953, 1, 2, 2.68725, 10, 1
-1.386876, 1, 2, 2.686823, 10, 1
-1.3228, 1, 2, 2.686167, 10, 1
-1.258723, 1, 2, 2.685712, 10, 1
-1.194646, 1, 2, 2.685273, 10, 1
-1.130569, 1, 2, 2.685073, 10, 1
-1.066492, 1, 2, 2.684612, 10, 1
-1.002415, 1, 2, 2.684215, 10, 1
-0.938338, 0, 2, 2.683519, 10, 1
-0.8742611, 0, 2, 2.683081, 10, 1
-0.8101841, 0, 2, 2.682702, 10, 1
-0.7461072, 0, 2, 2.682591, 10, 1
-0.6820303, 0, 2, 2.68214, 10, 1
-0.6179534, 0, 2, 2.68172, 10, 1
-0.5538765, 0, 2, 2.681245, 10, 1
-0.4897995, 0, 2, 2.680748, 10, 1
-0.4257226, 0, 2, 2.680623, 10, 1
-0.3616457, 0, 2, 2.680297, 10, 1
-0.2975688, 0, 2, 2.679813, 10, 1
-0.2334919, 0, 2, 2.679531, 10, 1
-0.1694149, 0, 2, 2.679113, 10, 1
-0.105338, 0, 2, 2.678938, 10, 1
-0.04126109, 0, 2, 2.678291, 10, 1
0.02281583, 0, 2, 2.677862, 10, 1
0.08689275, 0, 2, 2.677328, 10, 1
0.1509697, 0, 2, 2.676939, 10, 1
0.2150466, 0, 2, 2.676759, 10, 1
0.2791235, 0, 2, 2.67618, 10, 1
0.3432004, 0, 2, 2.675674, 10, 1
0.4072774, 0, 2, 2.675137, 10, 1
0.4713543, 0, 2, 2.674845, 10, 1
0.5354312, 0, 2, 2.674927, 10, 1
0.5995081, 0, 2, 2.674411, 10, 1
0.6635851, 0, 2, 2.673913, 10, 1
0.727662, 0, 2, 2.673271, 10, 1
0.7917389, 0, 2, 2.672648, 10, 1
0.8558158, 0, 2, 2.672238, 10, 1
0.9198927, 0, 2, 2.671778, 10, 1
0.9839696, 0, 2, 2.670881, 10, 1
1.048047, -1, 2, 2.670233, 10, 1
1.112123, -1, 2, 2.669047, 10, 1
1.1762, -1, 2, 2.66822, 10, 1
1.240277, -1, 2, 2.666911, 10, 1
1.304354, -1, 2, 2.665533, 10, 1
1.368431, -1, 2, 2.663458, 10, 1
1.432508, -1, 2, 2.661096, 10, 1
1.496585, -1, 2, 2.659988, 10, 1
1.560662, -1, 2, 2.656858, 10, 1
1.624739, -1, 2, 2.653057, 10, 1
1.688816, -1, 2, 2.648736, 10, 1
1.752893, -1, 2, 2.643524, 10, 1
1.81697, -1, 2, 2.640647, 10, 1
1.881047, -1, 2, 2.63418, 10, 1
1.945124, -1, 2, 2.626524, 10, 1
2.009201, -2, 2, 2.618723, 10, 1
2.073278, -2, 2, 2.610365, 10, 1
2.137355, -2, 2, 2.60622, 10, 1
2.201432, -2, 2, 2.597256, 10, 1
2.265509, -2, 2, 2.587975, 10, 1
2.329586, -2, 2, 2.579741, 10, 1
2.393663, -2, 2, 2.571442, 10, 1
2.45774, -2, 2, 2.567343, 10, 1
2.521817, -2, 2, 2.559142, 10, 1
2.585894, -2, 2, 2.551297, 10, 1
2.649971, -2, 2, 2.543536, 10, 1
2.714048, -2, 2, 2.536021, 10, 1
2.778125, -2, 2, 2.532475, 10, 1
2.842202, -2, 2, 2.524692, 10, 1
2.906279, -2, 2, 2.516786, 10, 1
2.970356, -2, 2, 2.508241, 10, 1
3.034433, -3, 2, 2.499745, 9, 1
3.09851, -3, 2, 2.495046, 9, 1
3.162587, -3, 2, 2.485816, 9, 1
3.226664, -3, 2, 2.476811, 9, 1
3.290741, -3, 2, 2.467628, 9, 1
3.354818, -3, 2, 2.458146, 9, 1
3.418895, -3, 2, 2.453058, 9, 1
3.482972, -3, 2, 2.442919, 9, 1
3.54705, -3, 2, 2.43228, 9, 1
3.611126, -3, 2, 2.420872, 9, 1
3.675204, -3, 2, 2.409383, 9, 1
3.73928, -3, 2, 2.403425, 9, 1
3.803358, -3, 2, 2.39123, 9, 1
3.867435, -3, 2, 2.378899, 9, 1
3.931511, -3, 2, 2.366469, 9, 1
3.995589, -3, 2, 2.353487, 9, 1
4.059666, -4, 2, 2.34669, 9, 1
4.123743, -4, 2, 2.332661, 9, 1
4.187819, -4, 2, 2.318581, 9, 1
4.251896, -4, 2, 2.303873, 9, 1
4.315974, -4, 2, 2.289211, 9, 1
4.380051, -4, 2, 2.281906, 9, 1
4.444128, -4, 2, 2.267987, 9, 1
4.508204, -4, 2, 2.254925, 9, 1
4.572282, -4, 2, 2.241968, 8, 1
4.636359, -4, 2, 2.229271, 8, 1
4.700436, -4, 2, 2.2231, 8, 1
4.764513, -4, 2, 2.210184, 8, 1
4.82859, -4, 2, 2.197206, 8, 1
4.892667, -4, 2, 2.18334, 8, 1
4.956744, -4, 2, 2.16972, 8, 1
5.020821, -5, 2, 2.162563, 8, 1
5.084898, -5, 2, 2.148695, 8, 1
5.148975, -5, 2, 2.134677, 8, 1
5.213052, -5, 2, 2.12059, 8, 1
5.277129, -5, 2, 2.106358, 8, 1
5.341206, -5, 2, 2.09881, 8, 1
5.405283, -5, 2, 2.083762, 8, 1
5.46936, -5, 2, 2.068963, 8, 1
5.533437, -5, 2, 2.05354, 8, 1
5.597514, -5, 2, 2.038142, 8, 1
5.661591, -5, 2, 2.030653, 8, 1
5.725668, -5, 2, 2.015352, 8, 1
5.789745, -5, 2, 1.999425, 7, 1
5.853822, -5, 2, 1.983606, 7, 1
5.917899, -5, 2, 1.967903, 7, 1
5.981976, -5, 2, 1.960428, 7, 1
6.046053, -6, 2, 1.944356, 7, 1
6.11013, -6, 2, 1.927906, 7, 1
6.174207, -6, 2, 1.911015, 7, 1
6.238283, -6, 2, 1.893429, 7, 1
6.30236, -6, 2, 1.884083, 7, 1
6.366436, -6, 2, 1.864679, 7, 1
6.430513, -6, 2, 1.845218, 7, 1
6.49459, -6, 2, 1.825434, 7, 1
6.558667, -6, 2, 1.806628, 7, 1
6.622743, -6, 2, 1.797906, 7, 1
6.68682, -6, 2, 1.780404, 7, 1
6.750896, -6, 2, 1.763031, 7, 1
6.814973, -6, 2, 1.74625, 6, 1
6.87905, -6, 2, 1.729496, 6, 1
6.943126, -6, 2, 1.721014, 6, 1
7.007203, -7, 2, 1.704812, 6, 1
7.07128, -7, 2, 1.68876, 6, 1
7.135356, -7, 2, 1.672981, 6, 1
7.199433, -7, 2, 1.657429, 6, 1
7.26351, -7, 2, 1.649689, 6, 1
7.327586, -7, 2, 1.634195, 6, 1
7.391663, -7, 2, 1.618614, 6, 1
7.455739, -7, 2, 1.602804, 6, 1
7.519816, -7, 2, 1.586721, 6, 1
7.583893, -7, 2, 1.578227, 6, 1
7.647969, -7, 2, 1.561879, 6, 1
7.712046, -7, 2, 1.54538, 6, 1
7.776123, -7, 2, 1.528421, 6, 1
7.840199, -7, 2, 1.511866, 6, 1
7.904276, -7, 2, 1.503285, 6, 1
7.968353, -7, 2, 1.486652, 5, 1
8.03243, -8, 2, 1.469793, 5, 1
8.096506, -8, 2, 1.451715, 5, 1
8.160583, -8, 2, 1.43343, 5, 1
8.224659, -8, 2, 1.424767, 5, 1
8.288736, -8, 2, 1.407375, 5, 1
8.352813, -8, 2, 1.388397, 5, 1
8.416889, -8, 2, 1.369953, 5, 1
8.480966, -8, 2, 1.351222, 5, 1
8.545042, -8, 2, 1.341672, 5, 1
8.609119, -8, 2, 1.324075, 5, 1
8.673196, -8, 2, 1.306973, 5, 1
8.737272, -8, 2, 1.289898, 5, 1
8.801349, -8, 2, 1.273014, 5, 1
8.865426, -8, 2, 1.264954, 5, 1
8.929502, -8, 2, 1.249153, 4, 1
8.993579, -8, 2, 1.233665, 4, 1
9.057655, -9, 2, 1.219155, 4, 1
9.121733, -9, 2, 1.204603, 4, 1
9.185809, -9, 2, 1.196725, 4, 1
9.249886, -9, 2, 1.181414, 4, 1
9.313962, -9, 2, 1.165472, 4, 1
9.378039, -9, 2, 1.149563, 4, 1
9.442116, -9, 2, 1.133933, 4, 1
9.506192, -9, 2, 1.125907, 4, 1
9.570269, -9, 2, 1.110081, 4, 1
9.634345, -9, 2, 1.093642, 4, 1
9.698422, -9, 2, 1.077628, 4, 1
9.762499, -9, 2, 1.061644, 4, 1
9.826575, -9, 2, 1.053507, 4, 1
9.890652, -9, 2, 1.037264, 4, 1
9.954729, -9, 2, 1.020013, 4, 1
10.01881, -10, 2, 1.002906, 4, 1
10.08288, -10, 2, 0.9856172, 3, 1
10.14696, -10, 2, 0.9765234, 3, 1
10.21104, -10, 2, 0.9593635, 3, 1
10.27511, -10, 2, 0.9420161, 3, 1
10.33919, -10, 2, 0.9247346, 3, 1
10.40326, -10, 2, 0.9069033, 3, 1
10.46734, -10, 2, 0.8979912, 3, 1
10.53142, -10, 2, 0.8806231, 3, 1
10.5955, -10, 2, 0.863739, 3, 1
10.65957, -10, 2, 0.8474202, 3, 1
10.72365, -10, 2, 0.8312311, 3, 1
10.78773, -10, 2, 0.8232386, 3, 1
10.8518, -10, 2, 0.8088176, 3, 1
10.91588, -10, 2, 0.7953315, 3, 1
10.97995, -10, 2, 0.7827978, 3, 1
11.04403, -11, 2, 0.7703073, 3, 1
11.10811, -11, 2, 0.7640867, 3, 1
11.17218, -11, 2, 0.7521329, 3, 1
11.23626, -11, 2, 0.7402897, 2, 1
11.30034, -11, 2, 0.7294369, 2, 1
11.36442, -11, 2, 0.7191045, 2, 1
11.42849, -11, 2, 0.7137029, 2, 1
11.49257, -11, 2, 0.7041502, 2, 1
11.55664, -11, 2, 0.6940582, 2, 1
11.62072, -11, 2, 0.6852708, 2, 1
11.6848, -11, 2, 0.6774497, 2, 1
11.74887, -11, 2, 0.6737485, 2, 1
11.81295, -11, 2, 0.6668642, 2, 1
11.87703, -11, 2, 0.6604354, 2, 1
11.9411, -11, 2, 0.6551065, 2, 1
12.00518, -12, 2, 0.6503761, 2, 1
12.06926, -12, 2, 0.6483507, 2, 1
12.13334, -12, 2, 0.6446538, 2, 1
12.19741, -12, 2, 0.641423, 2, 1
12.26149, -12, 2, 0.6383295, 2, 1
12.32556, -12, 2, 0.6352677, 2, 1
12.38964, -12, 2, 0.6338243, 2, 1
12.45372, -12, 2, 0.6307986, 2, 1
12.51779, -12, 2, 0.6279235, 2, 1
12.58187, -12, 2, 0.6249974, 2, 1
12.64595, -12, 2, 0.6221156, 2, 1
12.71002, -12, 2, 0.6210613, 2, 1
12.7741, -12, 2, 0.619041, 2, 1
12.83818, -12, 2, 0.6173024, 2, 1
12.90225, -12, 2, 0.6161728, 2, 1
12.96633, -12, 2, 0.6157844, 2, 1
13.03041, -13, 2, 0.6158559, 2, 1
13.09448, -13, 2, 0.6163237, 2, 1
13.15856, -13, 2, 0.6169448, 2, 1
13.22264, -13, 2, 0.6181591, 2, 1
13.28671, -13, 2, 0.6193941, 2, 1
13.35079, -13, 2, 0.6199672, 2, 1
13.41487, -13, 2, 0.6213338, 2, 1
13.47894, -13, 2, 0.6227088, 2, 1
13.54302, -13, 2, 0.6237705, 2, 1
13.6071, -13, 2, 0.6247211, 2, 1
13.67117, -13, 2, 0.6260993, 2, 1
13.73525, -13, 2, 0.6267908, 2, 1
13.79933, -13, 2, 0.6288593, 2, 1
13.8634, -13, 2, 0.6309588, 2, 1
13.92748, -13, 2, 0.6335454, 2, 1
13.99156, -13, 2, 0.6363726, 2, 1
14.05563, -14, 2, 0.6380119, 2, 1
14.11971, -14, 2, 0.6410861, 2, 1
14.18379, -14, 2, 0.644968, 2, 1
14.24786, -14, 2, 0.6488056, 2, 1
14.31194, -14, 2, 0.6506703, 2, 1
14.37602, -14, 2, 0.6553605, 2, 1
14.44009, -14, 2, 0.659945, 2, 1
14.50417, -14, 2, 0.6648736, 2, 1
14.56825, -14, 2, 0.6712053, 2, 1
14.63232, -14, 2, 0.6780794, 2, 1
14.6964, -14, 2, 0.6817048, 2, 1
14.76048, -14, 2, 0.6899636, 2, 1
14.82455, -14, 2, 0.6980224, 2, 1
14.88863, -14, 2, 0.7091861, 2, 1
14.95271, -14, 2, 0.7209051, 2, 1
15.01678, -15, 2, 0.7271781, 2, 1
15.08086, -15, 2, 0.7414739, 2, 1
15.14494, -15, 2, 0.7561369, 3, 1
15.20901, -15, 2, 0.7728968, 3, 1
15.27309, -15, 2, 0.788877, 3, 1
15.33717, -15, 2, 0.7968702, 3, 1
15.40124, -15, 2, 0.8122644, 3, 1
15.46532, -15, 2, 0.8253505, 3, 1
15.5294, -15, 2, 0.840292, 3, 1
15.59347, -15, 2, 0.8552217, 3, 1
15.65755, -15, 2, 0.8620756, 3, 1
15.72163, -15, 2, 0.877053, 3, 1
15.7857, -15, 2, 0.8907824, 3, 1
15.84978, -15, 2, 0.9061377, 3, 1
15.91386, -15, 2, 0.9209783, 3, 1
15.97793, -15, 2, 0.928468, 3, 1
16.04201, -16, 2, 0.9435024, 3, 1
16.10609, -16, 2, 0.9570839, 3, 1
16.17016, -16, 2, 0.9727893, 3, 1
16.23424, -16, 2, 0.9869337, 3, 1
16.29832, -16, 2, 0.993959, 3, 1
16.36239, -16, 2, 1.007826, 4, 1
16.42647, -16, 2, 1.021358, 4, 1
16.49055, -16, 2, 1.035161, 4, 1
16.55462, -16, 2, 1.049486, 4, 1
16.6187, -16, 2, 1.05692, 4, 1
16.68278, -16, 2, 1.070516, 4, 1
16.74685, -16, 2, 1.084455, 4, 1
16.81093, -16, 2, 1.098166, 4, 1
16.87501, -16, 2, 1.111169, 4, 1
16.93908, -16, 2, 1.118064, 4, 1
17.00316, -17, 2, 1.130986, 4, 1
17.06724, -17, 2, 1.145039, 4, 1
17.13131, -17, 2, 1.158444, 4, 1
17.19539, -17, 2, 1.133426, 4, 1
17.25947, -17, 2, 1.147257, 4, 1
17.32354, -17, 2, 1.157456, 4, 1
17.38762, -17, 2, 1.171104, 4, 1
17.4517, -17, 2, 1.186683, 4, 1
17.51577, -17, 2, 1.203449, 4, 1
17.57985, -17, 2, 1.211566, 4, 1
17.64393, -17, 2, 1.228502, 4, 1
17.708, -17, 2, 1.246106, 4, 1
17.77208, -17, 2, 1.264302, 5, 1
17.83616, -17, 2, 1.283146, 5, 1
17.90023, -17, 2, 1.292925, 5, 1
17.96431, -17, 2, 1.313577, 5, 1
18.02839, -18, 2, 1.334306, 5, 1
18.09246, -18, 2, 1.355611, 5, 1
18.15654, -18, 2, 1.377018, 5, 1
18.22062, -18, 2, 1.388574, 5, 1
18.28469, -18, 2, 1.410417, 5, 1
18.34877, -18, 2, 1.433357, 5, 1
18.41285, -18, 2, 1.456738, 5, 1
18.47692, -18, 2, 1.481226, 5, 1
18.541, -18, 2, 1.493174, 5, 1
18.60508, -18, 2, 1.517259, 6, 1
18.66915, -18, 2, 1.541064, 6, 1
18.73323, -18, 2, 1.564969, 6, 1
18.79731, -18, 2, 1.588807, 6, 1
18.86138, -18, 2, 1.60063, 6, 1
