timestamp_sec,frame_id,game_played,yielding,player1discrete,player2discrete,player1yieldprob,player2yieldprob,player1_pose_x,player1_pose_y,player1_pose_z,player1_pose_orient_x,player1_pose_orient_y,player1_pose_orient_z,player1_pose_orient_w,player2_pose_x,player2_pose_y,player2_pose_z,player2_pose_orient_x,player2_pose_orient_y,player2_pose_orient_z,player2_pose_orient_w
1718111792.7938,map,True,False,6,6,0.5957621508060097,0.5957621508060098,0.9896603226661682,-1.6188476085662842,0.0,0.0,0.0,0.0448380603996789,0.9989942619113115,2.943911044594947,-7.742426872535676,0.8021138584395618,0.0,0.0,0.0,1.0
1718111792.8442144,map,True,True,6,6,0.5957621508060097,0.5957621508060098,1.0466039180755615,-1.626530647277832,0.0,0.0,0.0,0.04437861087186418,0.9990147863406885,2.9593578932838622,-7.788519393570475,0.8121999367165204,0.0,0.0,0.0,1.0
1718111792.9447062,map,True,False,6,6,0.5957621508060097,0.5957621508060098,1.0466039180755615,-1.626530647277832,0.0,0.0,0.0,0.04437861087186418,0.9990147863406885,2.9593578932838622,-7.788519393570475,0.8121999367165204,0.0,0.0,0.0,1.0
1718111793.043966,map,True,True,6,6,0.5957621508060097,0.5957621508060098,1.0466039180755615,-1.626530647277832,0.0,0.0,0.0,0.04437861087186418,0.9990147863406885,2.9593578932838622,-7.788519393570475,0.8121999367165204,0.0,0.0,0.0,1.0
1718111793.1508398,map,True,True,6,6,0.5957621508060097,0.5957621508060098,1.0466039180755615,-1.626530647277832,0.0,0.0,0.0,0.04437861087186418,0.9990147863406885,3.003354898628496,-7.370762179672108,0.8374302063871044,0.0,0.0,0.0,1.0
1718111793.2473032,map,True,False,6,6,0.5957621508060097,0.5957621508060098,1.0466039180755615,-1.626530647277832,0.0,0.0,0.0,0.04437861087186418,0.9990147863406885,2.948473259121002,-7.173322211463154,0.8153775591603314,0.0,0.0,0.0,1.0
1718111793.5460804,map,True,True,6,6,0.5957621508060097,0.5957621508060098,1.0466039180755615,-1.626530647277832,0.0,0.0,0.0,0.04437861087186418,0.9990147863406885,3.013856670091953,-7.106742038197508,0.8385754509713581,0.0,0.0,0.0,1.0
1718111793.5953279,map,True,False,6,6,0.5957621508060097,0.5957621508060098,1.0466039180755615,-1.626530647277832,0.0,0.0,0.0,0.04437861087186418,0.9990147863406885,3.0275222933716046,-7.143128439284791,0.831528743043878,0.0,0.0,0.0,1.0
1718111793.6491158,map,True,True,6,6,0.5957621508060097,0.5957621508060098,1.0466039180755615,-1.626530647277832,0.0,0.0,0.0,0.04437861087186418,0.9990147863406885,3.0275222933716046,-7.143128439284791,0.831528743043878,0.0,0.0,0.0,1.0
1718111793.6958447,map,True,False,5,6,0.0,0.0,1.2001310586929321,-1.660422444343567,0.0,0.0,0.0,0.04487298236514949,0.9989926957129743,3.0275222933716046,-7.143128439284791,0.831528743043878,0.0,0.0,0.0,1.0
1718111793.748733,map,True,False,5,6,0.0,0.0,1.2001310586929321,-1.660422444343567,0.0,0.0,0.0,0.04487298236514949,0.9989926957129743,3.0275222933716046,-7.143128439284791,0.831528743043878,0.0,0.0,0.0,1.0
1718111793.798432,map,True,False,5,6,0.0,0.0,1.2001310586929321,-1.660422444343567,0.0,0.0,0.0,0.04487298236514949,0.9989926957129743,3.0275222933716046,-7.143128439284791,0.831528743043878,0.0,0.0,0.0,1.0
1718111793.851538,map,True,False,5,6,0.0,0.0,1.2001310586929321,-1.660422444343567,0.0,0.0,0.0,0.04487298236514949,0.9989926957129743,3.0275222933716046,-7.143128439284791,0.831528743043878,0.0,0.0,0.0,1.0
1718111793.8971503,map,True,False,5,5,0.612995793784914,0.612995793784914,1.2001310586929321,-1.660422444343567,0.0,0.0,0.0,0.04487298236514949,0.9989926957129743,3.0422822075466023,-6.704461415532581,0.8123972452362165,0.0,0.0,0.0,1.0
1718111793.997469,map,True,False,5,5,0.612995793784914,0.612995793784914,1.2001310586929321,-1.660422444343567,0.0,0.0,0.0,0.04487298236514949,0.9989926957129743,2.939539313731535,-6.348587504223524,0.8027148437238751,0.0,0.0,0.0,1.0
1718111794.0513723,map,True,True,5,5,0.612995793784914,0.612995793784914,1.2001310586929321,-1.660422444343567,0.0,0.0,0.0,0.04487298236514949,0.9989926957129743,2.939539313731535,-6.348587504223524,0.8027148437238751,0.0,0.0,0.0,1.0
1718111794.1147046,map,True,True,5,5,0.612995793784914,0.612995793784914,1.2001310586929321,-1.660422444343567,0.0,0.0,0.0,0.04487298236514949,0.9989926957129743,2.939539313731535,-6.348587504223524,0.8027148437238751,0.0,0.0,0.0,1.0
1718111794.1523266,map,True,False,5,5,0.612995793784914,0.612995793784914,1.2001310586929321,-1.660422444343567,0.0,0.0,0.0,0.04487298236514949,0.9989926957129743,2.939539313731535,-6.348587504223524,0.8027148437238751,0.0,0.0,0.0,1.0
1718111794.2011454,map,True,True,5,5,0.612995793784914,0.612995793784914,1.2001310586929321,-1.660422444343567,0.0,0.0,0.0,0.04487298236514949,0.9989926957129743,2.939539313731535,-6.348587504223524,0.8027148437238751,0.0,0.0,0.0,1.0
1718111794.3020287,map,True,True,5,5,0.612995793784914,0.612995793784914,1.2001310586929321,-1.660422444343567,0.0,0.0,0.0,0.04487298236514949,0.9989926957129743,3.0498366700259245,-6.225762879357877,0.7791331932477549,0.0,0.0,0.0,1.0
1718111794.4004548,map,True,True,5,5,0.612995793784914,0.612995793784914,1.2001310586929321,-1.660422444343567,0.0,0.0,0.0,0.04487298236514949,0.9989926957129743,3.0498366700259245,-6.225762879357877,0.7791331932477549,0.0,0.0,0.0,1.0
1718111794.4508395,map,True,False,5,5,0.612995793784914,0.612995793784914,1.2001310586929321,-1.660422444343567,0.0,0.0,0.0,0.04487298236514949,0.9989926957129743,3.0498366700259245,-6.225762879357877,0.7791331932477549,0.0,0.0,0.0,1.0
1718111794.5513449,map,True,True,5,5,0.612995793784914,0.612995793784914,1.2001310586929321,-1.660422444343567,0.0,0.0,0.0,0.04487298236514949,0.9989926957129743,3.0498366700259245,-6.225762879357877,0.7791331932477549,0.0,0.0,0.0,1.0
1718111794.6513295,map,True,False,5,5,0.612995793784914,0.612995793784914,1.2321267127990723,-1.6678311824798584,0.0,0.0,0.0,0.04525896286454575,0.998975288371864,3.1625552245705646,-6.453756837402537,0.8061405416950146,0.0,0.0,0.0,1.0
1718111794.7512403,map,True,False,5,5,0.612995793784914,0.612995793784914,1.2321267127990723,-1.6678311824798584,0.0,0.0,0.0,0.04525896286454575,0.998975288371864,3.1625552245705646,-6.453756837402537,0.8061405416950146,0.0,0.0,0.0,1.0
1718111794.8017921,map,True,False,5,5,0.612995793784914,0.612995793784914,1.2321267127990723,-1.6678311824798584,0.0,0.0,0.0,0.04525896286454575,0.998975288371864,3.1625552245705646,-6.453756837402537,0.8061405416950146,0.0,0.0,0.0,1.0
1718111794.8523924,map,True,True,5,5,0.612995793784914,0.612995793784914,1.2321267127990723,-1.6678311824798584,0.0,0.0,0.0,0.04525896286454575,0.998975288371864,3.1625552245705646,-6.453756837402537,0.8061405416950146,0.0,0.0,0.0,1.0
1718111794.9033172,map,True,True,5,5,0.612995793784914,0.612995793784914,1.2321267127990723,-1.6678311824798584,0.0,0.0,0.0,0.04525896286454575,0.998975288371864,3.1625552245705646,-6.453756837402537,0.8061405416950146,0.0,0.0,0.0,1.0
1718111794.9586504,map,True,False,5,4,0.0,0.0,1.2321267127990723,-1.6678311824798584,0.0,0.0,0.0,0.04525896286454575,0.998975288371864,3.112119094793421,-5.750021720383035,0.7814371577791096,0.0,0.0,0.0,1.0
1718111795.00367,map,True,False,5,4,0.0,0.0,1.2321267127990723,-1.6678311824798584,0.0,0.0,0.0,0.04525896286454575,0.998975288371864,3.112119094793421,-5.750021720383035,0.7814371577791096,0.0,0.0,0.0,1.0
1718111795.1029522,map,True,False,5,4,0.0,0.0,1.2321267127990723,-1.6678311824798584,0.0,0.0,0.0,0.04525896286454575,0.998975288371864,3.112119094793421,-5.750021720383035,0.7814371577791096,0.0,0.0,0.0,1.0
1718111795.15369,map,True,False,5,4,0.0,0.0,1.2321267127990723,-1.6678311824798584,0.0,0.0,0.0,0.04525896286454575,0.998975288371864,3.112119094793421,-5.750021720383035,0.7814371577791096,0.0,0.0,0.0,1.0
1718111795.2036364,map,True,False,5,4,0.0,0.0,1.2321267127990723,-1.6678311824798584,0.0,0.0,0.0,0.04525896286454575,0.998975288371864,3.112119094793421,-5.750021720383035,0.7814371577791096,0.0,0.0,0.0,1.0
1718111795.6049309,map,True,False,5,4,0.0,0.0,1.4210740327835083,-1.7013307809829712,0.0,0.0,0.0,0.045670233533939154,0.9989565680564158,3.3363184887659294,-5.573369566648538,0.7906653582732378,0.0,0.0,0.0,1.0
1718111795.6562157,map,True,False,5,4,0.0,0.0,1.4210740327835083,-1.7013307809829712,0.0,0.0,0.0,0.045670233533939154,0.9989565680564158,3.3363184887659294,-5.573369566648538,0.7906653582732378,0.0,0.0,0.0,1.0
1718111795.7060752,map,True,False,5,4,0.0,0.0,1.4210740327835083,-1.7013307809829712,0.0,0.0,0.0,0.045670233533939154,0.9989565680564158,3.3363184887659294,-5.573369566648538,0.7906653582732378,0.0,0.0,0.0,1.0
1718111795.7562234,map,True,False,5,4,0.0,0.0,1.4210740327835083,-1.7013307809829712,0.0,0.0,0.0,0.045670233533939154,0.9989565680564158,3.3363184887659294,-5.573369566648538,0.7906653582732378,0.0,0.0,0.0,1.0
1718111795.8565948,map,True,False,5,4,0.0,0.0,1.4210740327835083,-1.7013307809829712,0.0,0.0,0.0,0.045670233533939154,0.9989565680564158,3.3363184887659294,-5.573369566648538,0.7906653582732378,0.0,0.0,0.0,1.0
1718111795.9139662,map,True,False,5,4,0.0,0.0,1.4210740327835083,-1.7013307809829712,0.0,0.0,0.0,0.045670233533939154,0.9989565680564158,3.2281953585430285,-5.03185923096947,0.7699881218674718,0.0,0.0,0.0,1.0
1718111795.965847,map,True,False,5,3,0.0,0.0,1.4210740327835083,-1.7013307809829712,0.0,0.0,0.0,0.045670233533939154,0.9989565680564158,3.2682385569554566,-4.844895954959253,0.766081424185733,0.0,0.0,0.0,1.0
1718111796.0108254,map,True,False,5,3,0.0,0.0,1.4210740327835083,-1.7013307809829712,0.0,0.0,0.0,0.045670233533939154,0.9989565680564158,3.255697151955312,-4.729333413375672,0.7583798744016108,0.0,0.0,0.0,1.0
1718111796.0613115,map,True,False,5,3,0.0,0.0,1.4210740327835083,-1.7013307809829712,0.0,0.0,0.0,0.045670233533939154,0.9989565680564158,3.2625144151433845,-4.703461707844826,0.7482974031152825,0.0,0.0,0.0,1.0
1718111796.1612892,map,True,False,5,3,0.0,0.0,1.5581384897232056,-1.7355742454528809,0.0,0.0,0.0,0.04669046363437586,0.9989094002559303,3.2625144151433845,-4.703461707844826,0.7482974031152825,0.0,0.0,0.0,1.0
1718111796.211562,map,True,False,5,3,0.0,0.0,1.5581384897232056,-1.7355742454528809,0.0,0.0,0.0,0.04669046363437586,0.9989094002559303,3.2625144151433845,-4.703461707844826,0.7482974031152825,0.0,0.0,0.0,1.0
1718111796.3103273,map,True,False,5,3,0.0,0.0,1.5581384897232056,-1.7355742454528809,0.0,0.0,0.0,0.04669046363437586,0.9989094002559303,3.2952200141622985,-4.481419686873879,0.7437011040290307,0.0,0.0,0.0,1.0
1718111796.4101822,map,True,False,5,3,0.0,0.0,1.5581384897232056,-1.7355742454528809,0.0,0.0,0.0,0.04669046363437586,0.9989094002559303,3.2952200141622985,-4.481419686873879,0.7437011040290307,0.0,0.0,0.0,1.0
1718111796.4600663,map,True,False,5,3,0.0,0.0,1.5581384897232056,-1.7355742454528809,0.0,0.0,0.0,0.04669046363437586,0.9989094002559303,3.2952200141622985,-4.481419686873879,0.7437011040290307,0.0,0.0,0.0,1.0
1718111796.5603971,map,True,False,5,3,0.0,0.0,1.5581384897232056,-1.7355742454528809,0.0,0.0,0.0,0.04669046363437586,0.9989094002559303,3.2952200141622985,-4.481419686873879,0.7437011040290307,0.0,0.0,0.0,1.0
1718111796.6108289,map,True,False,5,3,0.0,0.0,1.5581384897232056,-1.7355742454528809,0.0,0.0,0.0,0.04669046363437586,0.9989094002559303,3.488585429912844,-4.535373200838058,0.759459063807828,0.0,0.0,0.0,1.0
1718111796.6604836,map,True,False,5,3,0.0,0.0,1.5806007385253906,-1.744673490524292,0.0,0.0,0.0,0.046858149338713684,0.9989015536568588,3.393826268882345,-4.1181227540051975,0.7522045375704054,0.0,0.0,0.0,1.0
1718111796.710852,map,True,False,5,3,0.0,0.0,1.5806007385253906,-1.744673490524292,0.0,0.0,0.0,0.046858149338713684,0.9989015536568588,3.393826268882345,-4.1181227540051975,0.7522045375704054,0.0,0.0,0.0,1.0
1718111796.7605991,map,True,False,5,3,0.0,0.0,1.5806007385253906,-1.744673490524292,0.0,0.0,0.0,0.046858149338713684,0.9989015536568588,3.393826268882345,-4.1181227540051975,0.7522045375704054,0.0,0.0,0.0,1.0
1718111796.8122687,map,True,False,5,3,0.0,0.0,1.5806007385253906,-1.744673490524292,0.0,0.0,0.0,0.046858149338713684,0.9989015536568588,3.393826268882345,-4.1181227540051975,0.7522045375704054,0.0,0.0,0.0,1.0
1718111796.9137573,map,True,False,5,3,0.0,0.0,1.5806007385253906,-1.744673490524292,0.0,0.0,0.0,0.046858149338713684,0.9989015536568588,3.393826268882345,-4.1181227540051975,0.7522045375704054,0.0,0.0,0.0,1.0
1718111796.9626977,map,True,False,5,3,0.0,0.0,1.5806007385253906,-1.744673490524292,0.0,0.0,0.0,0.046858149338713684,0.9989015536568588,3.502416187498822,-3.9949470562877676,0.7301633080771306,0.0,0.0,0.0,1.0
1718111797.013628,map,True,False,5,3,0.0,0.0,1.5806007385253906,-1.744673490524292,0.0,0.0,0.0,0.046858149338713684,0.9989015536568588,3.502416187498822,-3.9949470562877676,0.7301633080771306,0.0,0.0,0.0,1.0
1718111797.0646226,map,True,False,5,3,0.0,0.0,1.5806007385253906,-1.744673490524292,0.0,0.0,0.0,0.046858149338713684,0.9989015536568588,3.502416187498822,-3.9949470562877676,0.7301633080771306,0.0,0.0,0.0,1.0
1718111797.1689317,map,True,False,5,3,0.0,0.0,1.5806007385253906,-1.744673490524292,0.0,0.0,0.0,0.046858149338713684,0.9989015536568588,3.502416187498822,-3.9949470562877676,0.7301633080771306,0.0,0.0,0.0,1.0
1718111797.2690775,map,True,False,4,2,0.0,0.0,1.7627214193344116,-1.7792986631393433,0.0,0.0,0.0,0.04812655550168756,0.9988412401921904,3.482633660799396,-3.879928492738315,0.7166925198683318,0.0,0.0,0.0,1.0
1718111797.3649573,map,True,False,4,2,0.0,0.0,1.7627214193344116,-1.7792986631393433,0.0,0.0,0.0,0.04812655550168756,0.9988412401921904,3.512456113915904,-3.8157095349191237,0.687125724880121,0.0,0.0,0.0,1.0
1718111797.4156642,map,True,False,4,2,0.0,0.0,1.7627214193344116,-1.7792986631393433,0.0,0.0,0.0,0.04812655550168756,0.9988412401921904,3.512456113915904,-3.8157095349191237,0.687125724880121,0.0,0.0,0.0,1.0
1718111797.5155938,map,True,False,4,2,0.0,0.0,1.7627214193344116,-1.7792986631393433,0.0,0.0,0.0,0.04812655550168756,0.9988412401921904,3.512456113915904,-3.8157095349191237,0.687125724880121,0.0,0.0,0.0,1.0
1718111797.5669584,map,True,False,4,2,0.0,0.0,1.7627214193344116,-1.7792986631393433,0.0,0.0,0.0,0.04812655550168756,0.9988412401921904,3.512456113915904,-3.8157095349191237,0.687125724880121,0.0,0.0,0.0,1.0
1718111797.6182754,map,True,False,4,2,0.0,0.0,1.7627214193344116,-1.7792986631393433,0.0,0.0,0.0,0.04812655550168756,0.9988412401921904,3.5362286459737433,-3.5867354024298783,0.6830290449005864,0.0,0.0,0.0,1.0
1718111797.6712132,map,True,False,4,2,0.0,0.0,1.7627214193344116,-1.7792986631393433,0.0,0.0,0.0,0.04812655550168756,0.9988412401921904,3.5533208110584424,-3.601505259879281,0.6830219694890777,0.0,0.0,0.0,1.0
1718111797.768397,map,True,False,4,2,0.0,0.0,1.7627214193344116,-1.7792986631393433,0.0,0.0,0.0,0.04812655550168756,0.9988412401921904,3.5533208110584424,-3.601505259879281,0.6830219694890777,0.0,0.0,0.0,1.0
1718111797.868054,map,True,False,4,2,0.0,0.0,1.7627214193344116,-1.7792986631393433,0.0,0.0,0.0,0.04812655550168756,0.9988412401921904,3.5533208110584424,-3.601505259879281,0.6830219694890777,0.0,0.0,0.0,1.0
1718111797.9742475,map,True,False,4,2,0.0,0.0,1.7627214193344116,-1.7792986631393433,0.0,0.0,0.0,0.04812655550168756,0.9988412401921904,3.5533208110584424,-3.601505259879281,0.6830219694890777,0.0,0.0,0.0,1.0
1718111798.0251274,map,True,False,4,2,0.0,0.0,1.7627214193344116,-1.7792986631393433,0.0,0.0,0.0,0.04812655550168756,0.9988412401921904,3.576555286555411,-3.330054092467223,0.6823940906936825,0.0,0.0,0.0,1.0
1718111798.0718515,map,True,False,4,2,0.0,0.0,1.7627214193344116,-1.7792986631393433,0.0,0.0,0.0,0.04812655550168756,0.9988412401921904,3.4794017678240223,-3.274755043777672,0.6825092138578422,0.0,0.0,0.0,1.0
1718111798.1711087,map,True,False,4,2,0.0,0.0,1.8636162281036377,-1.8110836744308472,0.0,0.0,0.0,0.049272676396702,0.9987853690414829,3.4794017678240223,-3.274755043777672,0.6825092138578422,0.0,0.0,0.0,1.0
1718111798.221254,map,True,False,4,2,0.0,0.0,1.8636162281036377,-1.8110836744308472,0.0,0.0,0.0,0.049272676396702,0.9987853690414829,3.4794017678240223,-3.274755043777672,0.6825092138578422,0.0,0.0,0.0,1.0
1718111798.3705664,map,True,False,4,2,0.0,0.0,1.8636162281036377,-1.8110836744308472,0.0,0.0,0.0,0.049272676396702,0.9987853690414829,3.7263162735492648,-3.0349052986659544,0.6814683454663775,0.0,0.0,0.0,1.0
1718111798.4736311,map,True,False,4,1,0.0,0.0,1.8636162281036377,-1.8110836744308472,0.0,0.0,0.0,0.049272676396702,0.9987853690414829,3.5678202223317017,-2.873294334701974,0.6814681519186816,0.0,0.0,0.0,1.0
1718111798.5735655,map,True,False,4,1,0.0,0.0,1.8636162281036377,-1.8110836744308472,0.0,0.0,0.0,0.049272676396702,0.9987853690414829,3.719767281858376,-2.5947010716496335,0.6822216075219365,0.0,0.0,0.0,1.0
1718111798.6720037,map,True,False,4,1,0.0,0.0,1.8636162281036377,-1.8110836744308472,0.0,0.0,0.0,0.049272676396702,0.9987853690414829,3.719767281858376,-2.5947010716496335,0.6822216075219365,0.0,0.0,0.0,1.0
1718111798.7247663,map,True,False,4,1,0.0,0.0,1.8636162281036377,-1.8110836744308472,0.0,0.0,0.0,0.049272676396702,0.9987853690414829,3.719767281858376,-2.5947010716496335,0.6822216075219365,0.0,0.0,0.0,1.0
1718111798.7741332,map,True,False,4,1,0.0,0.0,1.8636162281036377,-1.8110836744308472,0.0,0.0,0.0,0.049272676396702,0.9987853690414829,3.795706484175324,-2.5332263281633147,0.6818876874501965,0.0,0.0,0.0,1.0
1718111798.822968,map,True,False,4,1,0.0,0.0,1.8636162281036377,-1.8110836744308472,0.0,0.0,0.0,0.049272676396702,0.9987853690414829,3.7955706688434114,-2.4639520036457503,0.6799019546190512,0.0,0.0,0.0,1.0
1718111798.9235215,map,True,False,3,1,0.0,0.0,2.054558515548706,-1.8440892696380615,0.0,0.0,0.0,0.04898770608761223,0.9987993781496128,3.7955706688434114,-2.4639520036457503,0.6799019546190512,0.0,0.0,0.0,1.0
1718111799.02343,map,True,False,3,1,0.0,0.0,2.054558515548706,-1.8440892696380615,0.0,0.0,0.0,0.04898770608761223,0.9987993781496128,3.7955706688434114,-2.4639520036457503,0.6799019546190512,0.0,0.0,0.0,1.0
1718111799.1250842,map,True,False,3,1,0.0,0.0,2.054558515548706,-1.8440892696380615,0.0,0.0,0.0,0.04898770608761223,0.9987993781496128,3.7955706688434114,-2.4639520036457503,0.6799019546190512,0.0,0.0,0.0,1.0
1718111799.1755757,map,True,False,3,1,0.0,0.0,2.054558515548706,-1.8440892696380615,0.0,0.0,0.0,0.04898770608761223,0.9987993781496128,3.7955706688434114,-2.4639520036457503,0.6799019546190512,0.0,0.0,0.0,1.0
1718111799.2253811,map,True,False,3,1,0.0,0.0,2.054558515548706,-1.8440892696380615,0.0,0.0,0.0,0.04898770608761223,0.9987993781496128,3.7955706688434114,-2.4639520036457503,0.6799019546190512,0.0,0.0,0.0,1.0
