car_pos_meter , car_pos_cell, car_speed, ped_pos_meter, ped_pos_cell, ped_speed
-41, 40, 2, 3.987998, 39, 1

-40.8334, 39, 2, 3.987998, 39, 1

-40.6668, 39, 2, 3.988076, 39, 1

-40.5002, 39, 2, 3.988076, 39, 1

-40.3336, 39, 2, 3.988076, 39, 1

-40.167, 39, 2, 3.988076, 39, 1

-40.0004, 39, 2, 3.988076, 39, 1

-39.83381, 38, 2, 3.943597, 39, 2

-39.66721, 38, 2, 3.943597, 39, 1

-39.50061, 38, 2, 3.942286, 39, 1

-39.33401, 38, 2, 3.94257, 39, 1

-39.16741, 38, 2, 3.942327, 39, 1

-39.00081, 38, 2, 3.942114, 39, 1

-38.83421, 37, 2, 3.941575, 39, 1

-38.66761, 37, 2, 3.941261, 39, 1

-38.50101, 37, 2, 3.940599, 39, 1

-38.33441, 37, 2, 3.939855, 39, 1

-38.16781, 37, 2, 3.938655, 39, 1

-38.00121, 37, 2, 3.937514, 39, 1

-37.83461, 36, 2, 3.936783, 39, 1

-37.66801, 36, 2, 3.935422, 39, 1

-37.50142, 36, 2, 3.933787, 39, 1

-37.33482, 36, 2, 3.932047, 39, 1

-37.16822, 36, 2, 3.930217, 39, 1

-37.00162, 36, 2, 3.929267, 39, 1

-36.83502, 35, 2, 3.927382, 39, 1

-36.66842, 35, 2, 3.925338, 39, 1

-36.50182, 35, 2, 3.923008, 39, 1

-36.33522, 35, 2, 3.920836, 39, 1

-36.16862, 35, 2, 3.919589, 39, 1

-36.00202, 35, 2, 3.917359, 39, 1

-35.83542, 34, 2, 3.915113, 39, 1

-35.66882, 34, 2, 3.912563, 39, 1

-35.50222, 34, 2, 3.910236, 39, 1

-35.33562, 34, 2, 3.908967, 39, 1

-35.16903, 34, 2, 3.906125, 39, 1

-35.00243, 34, 2, 3.903245, 39, 1

-34.83583, 33, 2, 3.900278, 39, 1

-34.66923, 33, 2, 3.897758, 38, 1

-34.50263, 33, 2, 3.896491, 38, 1

-34.33603, 33, 2, 3.894212, 38, 1

-34.16943, 33, 2, 3.892431, 38, 1

-34.00283, 33, 2, 3.891106, 38, 1

-33.83623, 32, 2, 3.890131, 38, 1

-33.66963, 32, 2, 3.889579, 38, 1

-33.50303, 32, 2, 3.888505, 38, 1

-33.33643, 32, 2, 3.887242, 38, 1

-33.16983, 32, 2, 3.886021, 38, 1

-33.00323, 32, 2, 3.882868, 38, 1

-32.83664, 31, 2, 3.882868, 38, 1

-32.67004, 31, 2, 3.879701, 38, 1

-32.50344, 31, 2, 3.87589, 38, 1

-32.33684, 31, 2, 3.872931, 38, 1

-32.17024, 31, 2, 3.869231, 38, 1

-32.00364, 31, 2, 3.867029, 38, 1

-31.83704, 30, 2, 3.862073, 38, 1

-31.67044, 30, 2, 3.855845, 38, 1

-31.50384, 30, 2, 3.84867, 38, 1

-31.33724, 30, 2, 3.836206, 38, 1

-31.17064, 30, 2, 3.836206, 38, 1

-31.00404, 30, 2, 3.826127, 38, 1

-30.83744, 29, 2, 3.815173, 38, 1

-30.67085, 29, 2, 3.802907, 38, 1

-30.50425, 29, 2, 3.789684, 37, 1

-30.33765, 29, 2, 3.782825, 37, 1

-30.17105, 29, 2, 3.76901, 37, 1

-30.00445, 29, 2, 3.754405, 37, 1

-29.83785, 28, 2, 3.739177, 37, 1

-29.67125, 28, 2, 3.731753, 37, 1

-29.50465, 28, 2, 3.7085, 37, 2

-29.33805, 28, 2, 3.70045, 37, 1

-29.17145, 28, 2, 3.684282, 36, 1

-29.00485, 28, 2, 3.667438, 36, 1

-28.83825, 27, 2, 3.650442, 36, 1

-28.67165, 27, 2, 3.64179, 36, 1

-28.50505, 27, 2, 3.624707, 36, 1

-28.33846, 27, 2, 3.607161, 36, 1

-28.17186, 27, 2, 3.588121, 35, 1

-28.00526, 27, 2, 3.569729, 35, 1

-27.83866, 26, 2, 3.560451, 35, 1

-27.67206, 26, 2, 3.543106, 35, 1

-27.50546, 26, 2, 3.526872, 35, 1

-27.33886, 26, 2, 3.511693, 35, 1

-27.17226, 26, 2, 3.497727, 34, 1

-27.00566, 26, 2, 3.490047, 34, 1

-26.83906, 25, 2, 3.475198, 34, 1

-26.67246, 25, 2, 3.460262, 34, 1

-26.50586, 25, 2, 3.446179, 34, 1

-26.33926, 25, 2, 3.432316, 34, 1

-26.17266, 25, 2, 3.425195, 34, 1

-26.00607, 25, 2, 3.411858, 34, 1

-25.83947, 24, 2, 3.398768, 33, 1

-25.67287, 24, 2, 3.385671, 33, 1

-25.50627, 24, 2, 3.372786, 33, 1

-25.33967, 24, 2, 3.366176, 33, 1

-25.17307, 24, 2, 3.353752, 33, 1

-25.00647, 24, 2, 3.34094, 33, 1

-24.83987, 23, 2, 3.32808, 33, 1

-24.67327, 23, 2, 3.315265, 33, 1

-24.50667, 23, 2, 3.308799, 33, 1

-24.34007, 23, 2, 3.295991, 32, 1

-24.17347, 23, 2, 3.282583, 32, 1

-24.00687, 23, 2, 3.269028, 32, 1

-23.84027, 22, 2, 3.255097, 32, 1

-23.67368, 22, 2, 3.24807, 32, 1

-23.50708, 22, 2, 3.233677, 32, 1

-23.34048, 22, 2, 3.218848, 32, 1

-23.17388, 22, 2, 3.203977, 32, 1

-23.00728, 22, 2, 3.196705, 31, 1

-22.84068, 21, 2, 3.181784, 31, 1

-22.67408, 21, 2, 3.166929, 31, 1

-22.50748, 21, 2, 3.151982, 31, 1

-22.34088, 21, 2, 3.136842, 31, 1

-22.17428, 21, 2, 3.120748, 31, 1

-22.00768, 21, 2, 3.112559, 31, 1

-21.84108, 20, 2, 3.096558, 30, 1

-21.67448, 20, 2, 3.080056, 30, 1

-21.50788, 20, 2, 3.064081, 30, 1

-21.34129, 20, 2, 3.049108, 30, 1

-21.17469, 20, 2, 3.04184, 30, 1

-21.00809, 20, 2, 3.019491, 30, 2

-20.84149, 19, 2, 3.012108, 30, 1

-20.67489, 19, 2, 2.997176, 29, 1

-20.50829, 19, 2, 2.982869, 29, 1

-20.34169, 19, 2, 2.975709, 29, 1

-20.17509, 19, 2, 2.961328, 29, 1

-20.00849, 19, 2, 2.946769, 29, 1

-19.84189, 18, 2, 2.932697, 29, 1

-19.67529, 18, 2, 2.918802, 29, 1

-19.50869, 18, 2, 2.911928, 29, 1

-19.34209, 18, 2, 2.891045, 28, 1

-19.1755, 18, 2, 2.883953, 28, 1

-19.0089, 18, 2, 2.870156, 28, 1

-18.8423, 17, 2, 2.855723, 28, 1

-18.6757, 17, 2, 2.848576, 28, 1

-18.5091, 17, 2, 2.834003, 28, 1

-18.3425, 17, 2, 2.819833, 28, 1

-18.1759, 17, 2, 2.805779, 28, 1

-18.0093, 17, 2, 2.79153, 27, 1

-17.8427, 16, 2, 2.784355, 27, 1

-17.6761, 16, 2, 2.769887, 27, 1

-17.5095, 16, 2, 2.755365, 27, 1

-17.3429, 16, 2, 2.740742, 27, 1

-17.1763, 16, 2, 2.725655, 27, 1

-17.0097, 16, 2, 2.718036, 27, 1

-16.84311, 15, 2, 2.702898, 27, 1

-16.67651, 15, 2, 2.687908, 26, 1

-16.50991, 15, 2, 2.672937, 26, 1

-16.34331, 15, 2, 2.657119, 26, 1

-16.17671, 15, 2, 2.649472, 26, 1

-16.01011, 15, 2, 2.633997, 26, 1

-15.84351, 14, 2, 2.619399, 26, 1

-15.67691, 14, 2, 2.60572, 26, 1

-15.51031, 14, 2, 2.592761, 25, 1

-15.34371, 14, 2, 2.586421, 25, 1

-15.17711, 14, 2, 2.574124, 25, 1

-15.01051, 14, 2, 2.561816, 25, 1

-14.84391, 13, 2, 2.550529, 25, 1

-14.67731, 13, 2, 2.539808, 25, 1

-14.51071, 13, 2, 2.53525, 25, 1

-14.34411, 13, 2, 2.525722, 25, 1

-14.17751, 13, 2, 2.51267, 25, 1

-14.01091, 13, 2, 2.508716, 25, 1

-13.84431, 12, 2, 2.500895, 25, 1

-13.6777, 12, 2, 2.497377, 24, 1

-13.5111, 12, 2, 2.490913, 24, 1

-13.3445, 12, 2, 2.484922, 24, 1

-13.1779, 12, 2, 2.479691, 24, 1

-13.0113, 12, 2, 2.477425, 24, 1

-12.8447, 11, 2, 2.4726, 24, 1

-12.6781, 11, 2, 2.468298, 24, 1

-12.5115, 11, 2, 2.461165, 24, 1

-12.3449, 11, 2, 2.459005, 24, 1

-12.1783, 11, 2, 2.453977, 24, 1

-12.0117, 11, 2, 2.451323, 24, 1

-11.8451, 10, 2, 2.446762, 24, 1

-11.6785, 10, 2, 2.44217, 24, 1

-11.5119, 10, 2, 2.437542, 24, 1

-11.3453, 10, 2, 2.432826, 24, 1

-11.1787, 10, 2, 2.430762, 24, 1

-11.0121, 10, 2, 2.427189, 24, 1

-10.8455, 9, 2, 2.423331, 24, 1

-10.6789, 9, 2, 2.420002, 24, 1

-10.5123, 9, 2, 2.416879, 24, 1

-10.3457, 9, 2, 2.415562, 24, 1

-10.1791, 9, 2, 2.412791, 24, 1

-10.0125, 9, 2, 2.409595, 24, 1

-9.8459, 8, 2, 2.406448, 24, 1

-9.679299, 8, 2, 2.403147, 24, 1

-9.512699, 8, 2, 2.401606, 24, 1

-9.346099, 8, 2, 2.398031, 23, 1

-9.179499, 8, 2, 2.394471, 23, 1

-9.012898, 8, 2, 2.389924, 23, 1

-8.846298, 7, 2, 2.388446, 23, 1

-8.679698, 7, 2, 2.385822, 23, 1

-8.513098, 7, 2, 2.384287, 23, 1

-8.346498, 7, 2, 2.381843, 23, 1

-8.179897, 7, 2, 2.379249, 23, 1

-8.013297, 7, 2, 2.376452, 23, 1

-7.846697, 6, 2, 2.374035, 23, 1

-7.680097, 6, 2, 2.372817, 23, 1

-7.513496, 6, 2, 2.370633, 23, 1

-7.346896, 6, 2, 2.367038, 23, 1

-7.180296, 6, 2, 2.36588, 23, 1

-7.013696, 6, 2, 2.363204, 23, 1

-6.847095, 5, 2, 2.36177, 23, 1

-6.680495, 5, 2, 2.359177, 23, 1

-6.513895, 5, 2, 2.35668, 23, 1

-6.347295, 5, 2, 2.3542, 23, 1

-6.180695, 5, 2, 2.352916, 23, 1

-6.014094, 5, 2, 2.350254, 23, 1

-5.847494, 4, 2, 2.347843, 23, 1

-5.680894, 4, 2, 2.344477, 23, 1

-5.514294, 4, 2, 2.343472, 23, 1

-5.347693, 4, 2, 2.341554, 23, 1

-5.181093, 4, 2, 2.34079, 23, 1

-5.014493, 4, 2, 2.338964, 23, 1

-4.847893, 3, 2, 2.337255, 23, 1

-4.681293, 3, 2, 2.335526, 23, 1

-4.514692, 3, 2, 2.33393, 23, 1

-4.348092, 3, 2, 2.333326, 23, 1

-4.181492, 3, 2, 2.331713, 23, 1

-4.014892, 3, 2, 2.330427, 23, 1

-3.848292, 2, 2, 2.328947, 23, 1

-3.681692, 2, 2, 2.327567, 23, 1

-3.515092, 2, 2, 2.326862, 23, 1

-3.348492, 2, 2, 2.325235, 23, 1

-3.181892, 2, 2, 2.324031, 23, 1

-3.015292, 2, 2, 2.322779, 23, 1

-2.848692, 1, 2, 2.321287, 23, 1

-2.682092, 1, 2, 2.320539, 23, 1

-2.515492, 1, 2, 2.319211, 23, 1

-2.348892, 1, 2, 2.317863, 23, 1

-2.182292, 1, 2, 2.317, 23, 1

-2.015692, 1, 2, 2.316031, 23, 1

-1.849092, 0, 2, 2.315522, 23, 1

-1.682492, 0, 2, 2.314368, 23, 1

-1.515892, 0, 2, 2.313107, 23, 1

-1.349292, 0, 2, 2.312526, 23, 1

-1.182692, 0, 2, 2.310032, 23, 1

-1.016092, 0, 2, 2.309282, 23, 1

-0.8494918, -1, 2, 2.307753, 23, 1

-0.6828918, -1, 2, 2.306008, 23, 1

-0.5162919, -1, 2, 2.304878, 23, 1

-0.3496919, -1, 2, 2.301418, 23, 1

-0.1830919, -1, 2, 2.300157, 23, 1

-0.01649189, -1, 2, 2.297956, 22, 1

0.1501081, -1, 2, 2.295687, 22, 1

0.3167081, -1, 2, 2.293224, 22, 1

0.4833081, -1, 2, 2.290241, 22, 1

0.6499081, -1, 2, 2.288686, 22, 1

0.8165081, -1, 2, 2.285267, 22, 1

0.983108, -1, 2, 2.281487, 22, 1

1.149708, -2, 2, 2.277564, 22, 1

1.316308, -2, 2, 2.275763, 22, 1

1.482908, -2, 2, 2.272568, 22, 1

1.649508, -2, 2, 2.269378, 22, 1

1.816108, -2, 2, 2.266765, 22, 1

1.982708, -2, 2, 2.264596, 22, 1

2.149308, -3, 2, 2.263386, 22, 1

2.315908, -3, 2, 2.262973, 22, 1

2.482508, -3, 2, 2.261992, 22, 1

2.649108, -3, 2, 2.261967, 22, 1

2.815708, -3, 2, 2.263089, 22, 1

2.982308, -3, 2, 2.264201, 22, 1

3.148908, -4, 2, 2.265969, 22, 1

3.315508, -4, 2, 2.268854, 22, 1

3.482108, -4, 2, 2.271939, 22, 1

3.648708, -4, 2, 2.275336, 22, 1

3.815308, -4, 2, 2.277431, 22, 1

3.981908, -4, 2, 2.281491, 22, 1

4.148508, -5, 2, 2.285844, 22, 1

4.315108, -5, 2, 2.290752, 22, 1

4.481709, -5, 2, 2.296517, 22, 1

4.648309, -5, 2, 2.305724, 23, 1

4.814909, -5, 2, 2.305724, 23, 1

4.981509, -5, 2, 2.311442, 23, 1

5.148109, -6, 2, 2.3177, 23, 1

5.31471, -6, 2, 2.323844, 23, 1

5.48131, -6, 2, 2.326919, 23, 1

5.64791, -6, 2, 2.333206, 23, 1

5.81451, -6, 2, 2.33925, 23, 1

5.981111, -6, 2, 2.345244, 23, 1

6.147711, -7, 2, 2.351264, 23, 1

6.314311, -7, 2, 2.359402, 23, 1

6.480911, -7, 2, 2.359402, 23, 1

6.647511, -7, 2, 2.364382, 23, 1

6.814112, -7, 2, 2.372976, 23, 1

6.980712, -7, 2, 2.376802, 23, 1

7.147312, -8, 2, 2.380212, 23, 1

7.313912, -8, 2, 2.381306, 23, 1

7.480513, -8, 2, 2.383389, 23, 1

7.647113, -8, 2, 2.384925, 23, 1

7.813713, -8, 2, 2.385597, 23, 1

7.980313, -8, 2, 2.385482, 23, 1

8.146914, -9, 2, 2.384544, 23, 1

8.313514, -9, 2, 2.384266, 23, 1

8.480114, -9, 2, 2.382642, 23, 1

8.646714, -9, 2, 2.380857, 23, 1

8.813314, -9, 2, 2.378503, 23, 1

8.979915, -9, 2, 2.37715, 23, 1

9.146515, -10, 2, 2.374359, 23, 1

9.313115, -10, 2, 2.370847, 23, 1

9.479715, -10, 2, 2.367054, 23, 1

9.646316, -10, 2, 2.362393, 23, 1

9.812916, -10, 2, 2.359967, 23, 1

9.979516, -10, 2, 2.354213, 23, 1

10.14612, -11, 2, 2.347826, 23, 1

10.31272, -11, 2, 2.340487, 23, 1

10.47932, -11, 2, 2.332304, 23, 1

10.64592, -11, 2, 2.327593, 23, 1

10.81252, -11, 2, 2.31763, 23, 1

10.97912, -11, 2, 2.306672, 23, 1

11.14572, -12, 2, 2.294827, 22, 1

11.31232, -12, 2, 2.288831, 22, 1

11.47892, -12, 2, 2.277108, 22, 1

11.64552, -12, 2, 2.266086, 22, 1

11.81212, -12, 2, 2.256422, 22, 1

11.97872, -12, 2, 2.24769, 22, 1

12.14532, -13, 2, 2.240044, 22, 1

12.31192, -13, 2, 2.237372, 22, 1

12.47852, -13, 2, 2.232802, 22, 1

12.64512, -13, 2, 2.228631, 22, 1

12.81172, -13, 2, 2.226995, 22, 1

12.97832, -13, 2, 2.22581, 22, 1

13.14492, -14, 2, 2.226613, 22, 1

13.31152, -14, 2, 2.22828, 22, 1

13.47812, -14, 2, 2.229051, 22, 1

13.64472, -14, 2, 2.23059, 22, 1

13.81132, -14, 2, 2.23178, 22, 1

13.97792, -14, 2, 2.232206, 22, 1

14.14452, -15, 2, 2.233222, 22, 1

14.31112, -15, 2, 2.232796, 22, 1

14.47772, -15, 2, 2.231596, 22, 1

14.64432, -15, 2, 2.229528, 22, 1

14.81092, -15, 2, 2.227927, 22, 1

14.97752, -15, 2, 2.224059, 22, 1

15.14412, -16, 2, 2.218952, 22, 1

15.31072, -16, 2, 2.212664, 22, 1

15.47732, -16, 2, 2.205644, 22, 1

15.64392, -16, 2, 2.201134, 22, 1

15.81052, -16, 2, 2.192565, 21, 1

15.97712, -16, 2, 2.182425, 21, 1

16.14372, -17, 2, 2.170985, 21, 1

16.31032, -17, 2, 2.159467, 21, 1

16.47692, -17, 2, 2.153229, 21, 1

16.64352, -17, 2, 2.140467, 21, 1

16.81012, -17, 2, 2.126838, 21, 1

16.97672, -17, 2, 2.112574, 21, 1

17.14332, -18, 2, 2.10533, 21, 1

17.30992, -18, 2, 2.090819, 20, 1

17.47652, -18, 2, 2.075895, 20, 1

17.64312, -18, 2, 2.060664, 20, 1

17.80972, -18, 2, 2.045776, 20, 1

17.97632, -18, 2, 2.037878, 20, 1

18.14292, -19, 2, 2.022298, 20, 1

18.30951, -19, 2, 2.014328, 20, 1

18.47611, -19, 2, 1.989982, 19, 2

18.64271, -19, 2, 1.973531, 19, 1

18.80931, -19, 2, 1.956149, 19, 1

18.97591, -19, 2, 1.947509, 19, 1

19.14251, -20, 2, 1.929758, 19, 1

19.30911, -20, 2, 1.911437, 19, 1

19.47571, -20, 2, 1.89214, 18, 1

19.64231, -20, 2, 1.872441, 18, 1

19.80891, -20, 2, 1.862474, 18, 1

19.97551, -20, 2, 1.842175, 18, 1

20.14211, -21, 2, 1.810064, 18, 2

20.30871, -21, 2, 1.798635, 17, 1

20.47531, -21, 2, 1.775419, 17, 2

20.6419, -21, 2, 1.764166, 17, 1

20.8085, -21, 2, 1.74265, 17, 1

20.9751, -21, 2, 1.721607, 17, 1

21.1417, -22, 2, 1.701155, 17, 1

21.3083, -22, 2, 1.682351, 16, 1

21.4749, -22, 2, 1.673209, 16, 1

21.6415, -22, 2, 1.653351, 16, 1

21.8081, -22, 2, 1.632174, 16, 1

21.9747, -22, 2, 1.611187, 16, 1

22.1413, -23, 2, 1.590314, 15, 1

22.3079, -23, 2, 1.580021, 15, 1

22.4745, -23, 2, 1.559051, 15, 1

22.6411, -23, 2, 1.53767, 15, 1

22.8077, -23, 2, 1.516746, 15, 1

22.97429, -23, 2, 1.495673, 14, 1

23.14089, -24, 2, 1.485562, 14, 1

23.30749, -24, 2, 1.464669, 14, 1

23.47409, -24, 2, 1.444374, 14, 1

23.64069, -24, 2, 1.412724, 14, 2

23.80729, -24, 2, 1.401591, 14, 1

23.97389, -24, 2, 1.390578, 13, 1

24.14049, -25, 2, 1.368229, 13, 2

24.30709, -25, 2, 1.344292, 13, 2

24.47369, -25, 2, 1.320103, 13, 2

24.64029, -25, 2, 1.294819, 12, 2

24.80689, -25, 2, 1.282069, 12, 1

24.97349, -25, 2, 1.255782, 12, 2

25.14009, -26, 2, 1.228801, 12, 2

25.30668, -26, 2, 1.200368, 12, 2

25.47328, -26, 2, 1.170277, 11, 2

25.63988, -26, 2, 1.155359, 11, 1

25.80648, -26, 2, 1.124801, 11, 2

25.97308, -26, 2, 1.095353, 10, 2

26.13968, -27, 2, 1.067281, 10, 2

26.30628, -27, 2, 1.041193, 10, 2

26.47288, -27, 2, 1.028081, 10, 1

26.63948, -27, 2, 1.001722, 10, 2

26.80608, -27, 2, 0.9765928, 9, 2

26.97268, -27, 2, 0.9515095, 9, 2

27.13928, -28, 2, 0.9132338, 9, 2

27.30588, -28, 2, 0.9132338, 9, 1

27.47248, -28, 2, 0.8883619, 8, 2

27.63907, -28, 2, 0.8628299, 8, 2

27.80567, -28, 2, 0.8377011, 8, 2

27.97227, -28, 2, 0.8126273, 8, 2

28.13887, -29, 2, 0.8000798, 8, 1

28.30547, -29, 2, 0.7753153, 7, 2

28.47207, -29, 2, 0.7495351, 7, 2

28.63867, -29, 2, 0.7234633, 7, 2

28.80527, -29, 2, 0.6965871, 6, 2

28.97187, -29, 2, 0.682869, 6, 1

29.13847, -30, 2, 0.6568673, 6, 2

29.30507, -30, 2, 0.6296473, 6, 2

29.47167, -30, 2, 0.602114, 6, 2

29.63827, -30, 2, 0.574532, 5, 2

29.80486, -30, 2, 0.5474885, 5, 2

29.97146, -30, 2, 0.5336084, 5, 1

30.13806, -31, 2, 0.5055094, 5, 2

30.30466, -31, 2, 0.4747458, 4, 2

30.47126, -31, 2, 0.4441786, 4, 2

30.63786, -31, 2, 0.42939, 4, 1

30.80446, -31, 2, 0.4017003, 4, 2

30.97106, -31, 2, 0.3749089, 3, 2

31.13766, -32, 2, 0.3471208, 3, 2

31.30426, -32, 2, 0.3199382, 3, 2

31.47086, -32, 2, 0.293484, 2, 2

31.63746, -32, 2, 0.2802081, 2, 1

31.80406, -32, 2, 0.2540722, 2, 2

31.97066, -32, 2, 0.2278311, 2, 2

32.13726, -33, 2, 0.2149167, 2, 1

32.30386, -33, 2, 0.1885817, 1, 2

32.47046, -33, 2, 0.1628354, 1, 2

32.63705, -33, 2, 0.1372368, 1, 2

32.80365, -33, 2, 0.1120329, 1, 2

32.97025, -33, 2, 0.08653474, 0, 2

33.13685, -34, 2, 0.06087971, 0, 2

33.30345, -34, 2, 0.04761982, 0, 1

33.47005, -34, 2, 0.02309895, 0, 2

33.63665, -34, 2, -0.002563477, 0, 2

33.80325, -34, 2, -0.0284183, 0, 2

33.96985, -34, 2, -0.04155064, 0, 1

34.13645, -35, 2, -0.08082438, 0, 2

34.30305, -35, 2, -0.093647, 0, 1

34.46965, -35, 2, -0.1204762, -1, 2

34.63625, -35, 2, -0.1477947, -1, 2

34.80285, -35, 2, -0.1750672, -1, 2

34.96944, -35, 2, -0.1878181, -1, 1

35.13604, -36, 2, -0.2109039, -2, 2

35.30264, -36, 2, -0.2326839, -2, 1

35.46924, -36, 2, -0.2542875, -2, 1

35.63584, -36, 2, -0.2647774, -2, 1

35.80244, -36, 2, -0.2938602, -2, 2

35.96904, -36, 2, -0.3027856, -3, 1

36.13564, -37, 2, -0.3213918, -3, 1

36.30224, -37, 2, -0.3392284, -3, 1

36.46884, -37, 2, -0.3571496, -3, 1

36.63544, -37, 2, -0.366205, -3, 1

36.80204, -37, 2, -0.3841801, -3, 1

36.96864, -37, 2, -0.4020185, -4, 1

37.13523, -38, 2, -0.4194341, -4, 1

37.30183, -38, 2, -0.4367657, -4, 1

37.46843, -38, 2, -0.4456592, -4, 1

37.63503, -38, 2, -0.4638412, -4, 1

37.80163, -38, 2, -0.4821115, -4, 1

37.96823, -38, 2, -0.5004501, -5, 1

38.13483, -39, 2, -0.5186801, -5, 1

38.30143, -39, 2, -0.5279567, -5, 1

38.46803, -39, 2, -0.5462298, -5, 1

38.63463, -39, 2, -0.5653839, -5, 1

38.80123, -39, 2, -0.5848098, -5, 1

38.96783, -39, 2, -0.6044393, -6, 1

39.13443, -40, 2, -0.6142979, -6, 1

39.30103, -40, 2, -0.6339374, -6, 1

39.46762, -40, 2, -0.6554966, -6, 1

39.63422, -40, 2, -0.6770797, -6, 1

39.80082, -40, 2, -0.6990395, -6, 1

39.96742, -40, 2, -0.7099628, -7, 1

40.13402, -41, 2, -0.7319474, -7, 1

40.30062, -41, 2, -0.7522092, -7, 1

40.46722, -41, 2, -0.7716331, -7, 1

40.63382, -41, 2, -0.7811522, -7, 1

40.80042, -41, 2, -0.8007708, -8, 1

40.96702, -41, 2, -0.8298864, -8, 2

41.13362, -42, 2, -0.8392205, -8, 1

41.30022, -42, 2, -0.8574595, -8, 1

41.46682, -42, 2, -0.8751416, -8, 1

41.63342, -42, 2, -0.8839965, -8, 1

41.80001, -42, 2, -0.9012957, -9, 1

41.96661, -42, 2, -0.9186563, -9, 1

42.13321, -43, 2, -0.935534, -9, 1

42.29981, -43, 2, -0.9522133, -9, 1

42.46641, -43, 2, -0.9604764, -9, 1

42.63301, -43, 2, -0.9769588, -9, 1

42.79961, -43, 2, -0.9934402, -9, 1

42.96621, -43, 2, -1.010337, -10, 1

43.13281, -44, 2, -1.027106, -10, 1

43.29941, -44, 2, -1.035652, -10, 1

43.46601, -44, 2, -1.052413, -10, 1

43.63261, -44, 2, -1.069612, -10, 1

43.79921, -44, 2, -1.086861, -10, 1

43.96581, -44, 2, -1.095321, -10, 1

44.1324, -45, 2, -1.11289, -11, 1

44.299, -45, 2, -1.129456, -11, 1

44.4656, -45, 2, -1.145446, -11, 1

44.6322, -45, 2, -1.161617, -11, 1

44.7988, -45, 2, -1.178307, -11, 1

44.9654, -45, 2, -1.186531, -11, 1

45.132, -46, 2, -1.202343, -12, 1

45.2986, -46, 2, -1.217522, -12, 1

45.4652, -46, 2, -1.230626, -12, 1

45.6318, -46, 2, -1.243362, -12, 1

45.7984, -46, 2, -1.250186, -12, 1

45.965, -46, 2, -1.263375, -12, 1

46.1316, -47, 2, -1.282352, -12, 1

46.29819, -47, 2, -1.288418, -12, 1

46.46479, -47, 2, -1.298975, -12, 1

46.63139, -47, 2, -1.304154, -13, 1

46.79799, -47, 2, -1.313861, -13, 1

46.96459, -47, 2, -1.323022, -13, 1

47.13119, -48, 2, -1.332119, -13, 1

47.29779, -48, 2, -1.340474, -13, 1

47.46439, -48, 2, -1.344948, -13, 1

47.63099, -48, 2, -1.352358, -13, 1

47.79759, -48, 2, -1.362689, -13, 1

47.96419, -48, 2, -1.365715, -13, 1

48.13079, -49, 2, -1.371178, -13, 1

48.29739, -49, 2, -1.373386, -13, 1

48.46399, -49, 2, -1.377742, -13, 1

48.63058, -49, 2, -1.381094, -13, 1

48.79718, -49, 2, -1.38381, -13, 1

48.96378, -49, 2, -1.38665, -13, 1

49.13038, -50, 2, -1.387573, -13, 1

49.29698, -50, 2, -1.39023, -13, 1

49.46358, -50, 2, -1.392193, -13, 1

49.63018, -50, 2, -1.394376, -13, 1

49.79678, -50, 2, -1.397537, -13, 1

49.96338, -50, 2, -1.399215, -13, 1

50.12998, -51, 2, -1.402103, -14, 1

50.29658, -51, 2, -1.403839, -14, 1

50.46318, -51, 2, -1.405678, -14, 1

50.62978, -51, 2, -1.407595, -14, 1

50.79638, -51, 2, -1.408547, -14, 1

50.96297, -51, 2, -1.410556, -14, 1

51.12957, -52, 2, -1.412946, -14, 1

51.29617, -52, 2, -1.415864, -14, 1

51.46277, -52, 2, -1.418384, -14, 1

51.62937, -52, 2, -1.41976, -14, 1

51.79597, -52, 2, -1.423097, -14, 1

51.96257, -52, 2, -1.426771, -14, 1

52.12917, -53, 2, -1.430513, -14, 1

52.29577, -53, 2, -1.434618, -14, 1

52.46237, -53, 2, -1.436779, -14, 1

52.62897, -53, 2, -1.441488, -14, 1

52.79557, -53, 2, -1.446239, -14, 1

52.96217, -53, 2, -1.450668, -14, 1

53.12877, -54, 2, -1.454461, -14, 1

53.29536, -54, 2, -1.456368, -14, 1

53.46196, -54, 2, -1.460299, -14, 1

53.62856, -54, 2, -1.464322, -14, 1

53.79516, -54, 2, -1.468602, -14, 1

53.96176, -54, 2, -1.473008, -14, 1

54.12836, -55, 2, -1.475065, -14, 1

54.29496, -55, 2, -1.478563, -14, 1

54.46156, -55, 2, -1.481929, -14, 1

54.62816, -55, 2, -1.488526, -14, 1

54.79476, -55, 2, -1.490274, -14, 1

54.96136, -55, 2, -1.492189, -14, 1

55.12796, -56, 2, -1.496283, -14, 1

55.29456, -56, 2, -1.500168, -15, 1

55.46115, -56, 2, -1.503593, -15, 1

55.62775, -56, 2, -1.50676, -15, 1

55.79435, -56, 2, -1.508829, -15, 1

55.96095, -56, 2, -1.511295, -15, 1

56.12755, -57, 2, -1.515206, -15, 1

56.29415, -57, 2, -1.521074, -15, 1

56.46075, -57, 2, -1.523286, -15, 1

56.62735, -57, 2, -1.525698, -15, 1

56.79395, -57, 2, -1.529606, -15, 1

56.96055, -57, 2, -1.534242, -15, 1

57.12715, -58, 2, -1.538267, -15, 1

57.29375, -58, 2, -1.542225, -15, 1

57.46035, -58, 2, -1.543793, -15, 1

57.62695, -58, 2, -1.546958, -15, 1

57.79354, -58, 2, -1.549185, -15, 1

57.96014, -58, 2, -1.551476, -15, 1

58.12674, -59, 2, -1.553921, -15, 1

58.29334, -59, 2, -1.556973, -15, 1

58.45994, -59, 2, -1.558178, -15, 1

58.62654, -59, 2, -1.56054, -15, 1

58.79314, -59, 2, -1.563285, -15, 1

58.95974, -59, 2, -1.566594, -15, 1

59.12634, -60, 2, -1.568192, -15, 1

59.29294, -60, 2, -1.570464, -15, 1

59.45954, -60, 2, -1.57159, -15, 1

59.62614, -60, 2, -1.572234, -15, 1

59.79274, -60, 2, -1.573024, -15, 1

59.95934, -60, 2, -1.573102, -15, 1

60.12593, -61, 2, -1.572289, -15, 1

60.29253, -61, 2, -1.570546, -15, 1

60.45913, -61, 2, -1.568897, -15, 1

60.62573, -61, 2, -1.567804, -15, 1

