timestamp_sec,frame_id,game_played,yielding,player1discrete,player2discrete,player1yieldprob,player2yieldprob,player1_pose_x,player1_pose_y,player1_pose_z,player1_pose_orient_x,player1_pose_orient_y,player1_pose_orient_z,player1_pose_orient_w,player2_pose_x,player2_pose_y,player2_pose_z,player2_pose_orient_x,player2_pose_orient_y,player2_pose_orient_z,player2_pose_orient_w
1718032299.3356328,map,True,False,5,6,0.0,0.0,1.3635590076446533,-1.6090333461761475,0.0,0.0,0.0,0.03208714425632268,0.999485077011394,3.1570653572693073,-7.9430538432996975,0.7499072068676178,0.0,0.0,0.0,1.0
1718032299.386697,map,True,False,5,6,0.0,0.0,1.3635590076446533,-1.6090333461761475,0.0,0.0,0.0,0.03208714425632268,0.999485077011394,3.154505766277022,-7.86081250601411,0.7306694691312414,0.0,0.0,0.0,1.0
1718032299.488572,map,True,False,5,6,0.0,0.0,1.3635590076446533,-1.6090333461761475,0.0,0.0,0.0,0.03208714425632268,0.999485077011394,3.154505766277022,-7.86081250601411,0.7306694691312414,0.0,0.0,0.0,1.0
1718032299.536466,map,True,False,5,6,0.0,0.0,1.3635590076446533,-1.6090333461761475,0.0,0.0,0.0,0.03208714425632268,0.999485077011394,3.154505766277022,-7.86081250601411,0.7306694691312414,0.0,0.0,0.0,1.0
1718032299.5864828,map,True,False,5,6,0.0,0.0,1.3635590076446533,-1.6090333461761475,0.0,0.0,0.0,0.03208714425632268,0.999485077011394,3.154505766277022,-7.86081250601411,0.7306694691312414,0.0,0.0,0.0,1.0
1718032299.6372693,map,True,False,5,6,0.0,0.0,1.3635590076446533,-1.6090333461761475,0.0,0.0,0.0,0.03208714425632268,0.999485077011394,3.154505766277022,-7.86081250601411,0.7306694691312414,0.0,0.0,0.0,1.0
1718032299.737116,map,True,False,5,6,0.0,0.0,1.3635590076446533,-1.6090333461761475,0.0,0.0,0.0,0.03208714425632268,0.999485077011394,3.1471395810674063,-7.27131544099415,0.7927447606487957,0.0,0.0,0.0,1.0
1718032299.7874248,map,True,False,5,6,0.0,0.0,1.3635590076446533,-1.6090333461761475,0.0,0.0,0.0,0.03208714425632268,0.999485077011394,3.1471395810674063,-7.27131544099415,0.7927447606487957,0.0,0.0,0.0,1.0
1718032299.8379502,map,True,False,5,6,0.0,0.0,1.3635590076446533,-1.6090333461761475,0.0,0.0,0.0,0.03208714425632268,0.999485077011394,3.1471395810674063,-7.27131544099415,0.7927447606487957,0.0,0.0,0.0,1.0
1718032299.9889271,map,True,False,5,6,0.0,0.0,1.5265891551971436,-1.6353753805160522,0.0,0.0,0.0,0.03366027860581066,0.9994333270946415,3.2336138797592238,-7.1289025249952065,0.814228079217289,0.0,0.0,0.0,1.0
1718032300.0401094,map,True,False,5,6,0.0,0.0,1.5265891551971436,-1.6353753805160522,0.0,0.0,0.0,0.03366027860581066,0.9994333270946415,3.221944368283489,-7.0479394299861955,0.7962376032160122,0.0,0.0,0.0,1.0
1718032300.0937772,map,True,False,5,6,0.0,0.0,1.5265891551971436,-1.6353753805160522,0.0,0.0,0.0,0.03366027860581066,0.9994333270946415,3.221944368283489,-7.0479394299861955,0.7962376032160122,0.0,0.0,0.0,1.0
1718032300.145606,map,True,False,5,6,0.0,0.0,1.5265891551971436,-1.6353753805160522,0.0,0.0,0.0,0.03366027860581066,0.9994333270946415,3.221944368283489,-7.0479394299861955,0.7962376032160122,0.0,0.0,0.0,1.0
1718032300.1947713,map,True,False,5,6,0.0,0.0,1.5265891551971436,-1.6353753805160522,0.0,0.0,0.0,0.03366027860581066,0.9994333270946415,3.221944368283489,-7.0479394299861955,0.7962376032160122,0.0,0.0,0.0,1.0
1718032300.2951171,map,True,False,5,6,0.0,0.0,1.5265891551971436,-1.6353753805160522,0.0,0.0,0.0,0.03366027860581066,0.9994333270946415,3.221944368283489,-7.0479394299861955,0.7962376032160122,0.0,0.0,0.0,1.0
1718032300.3463552,map,True,False,5,5,0.612995793784914,0.612995793784914,1.5265891551971436,-1.6353753805160522,0.0,0.0,0.0,0.03366027860581066,0.9994333270946415,3.254984353372127,-6.822786436483691,0.829856099684964,0.0,0.0,0.0,1.0
1718032300.4477086,map,True,False,5,5,0.612995793784914,0.612995793784914,1.5265891551971436,-1.6353753805160522,0.0,0.0,0.0,0.03366027860581066,0.9994333270946415,3.244247874905041,-6.750137322563475,0.8201998624883331,0.0,0.0,0.0,1.0
1718032300.5444627,map,True,False,5,5,0.612995793784914,0.612995793784914,1.5265891551971436,-1.6353753805160522,0.0,0.0,0.0,0.03366027860581066,0.9994333270946415,3.244247874905041,-6.750137322563475,0.8201998624883331,0.0,0.0,0.0,1.0
1718032300.5944848,map,True,False,4,5,0.0,0.0,1.6350483894348145,-1.6518186330795288,0.0,0.0,0.0,0.03427080400145934,0.9994125876118548,3.244247874905041,-6.750137322563475,0.8201998624883331,0.0,0.0,0.0,1.0
1718032300.6453989,map,True,False,4,5,0.0,0.0,1.6350483894348145,-1.6518186330795288,0.0,0.0,0.0,0.03427080400145934,0.9994125876118548,3.244247874905041,-6.750137322563475,0.8201998624883331,0.0,0.0,0.0,1.0
1718032300.695092,map,True,False,4,5,0.0,0.0,1.6350483894348145,-1.6518186330795288,0.0,0.0,0.0,0.03427080400145934,0.9994125876118548,3.270923868772451,-6.615984330498394,0.8017539309703391,0.0,0.0,0.0,1.0
1718032300.7474763,map,True,False,4,5,0.0,0.0,1.6350483894348145,-1.6518186330795288,0.0,0.0,0.0,0.03427080400145934,0.9994125876118548,3.270923868772451,-6.615984330498394,0.8017539309703391,0.0,0.0,0.0,1.0
1718032300.795439,map,True,False,4,5,0.0,0.0,1.6350483894348145,-1.6518186330795288,0.0,0.0,0.0,0.03427080400145934,0.9994125876118548,3.270923868772451,-6.615984330498394,0.8017539309703391,0.0,0.0,0.0,1.0
1718032300.8486636,map,True,False,4,5,0.0,0.0,1.6350483894348145,-1.6518186330795288,0.0,0.0,0.0,0.03427080400145934,0.9994125876118548,3.270923868772451,-6.615984330498394,0.8017539309703391,0.0,0.0,0.0,1.0
1718032300.9991093,map,True,False,4,5,0.0,0.0,1.6350483894348145,-1.6518186330795288,0.0,0.0,0.0,0.03427080400145934,0.9994125876118548,3.332732145675652,-6.389690821608407,0.7892205440469003,0.0,0.0,0.0,1.0
1718032301.049706,map,True,False,4,5,0.0,0.0,1.6350483894348145,-1.6518186330795288,0.0,0.0,0.0,0.03427080400145934,0.9994125876118548,3.322760910376167,-6.245390993901217,0.7860613751482274,0.0,0.0,0.0,1.0
1718032301.1480808,map,True,False,4,5,0.0,0.0,1.6350483894348145,-1.6518186330795288,0.0,0.0,0.0,0.03427080400145934,0.9994125876118548,3.322760910376167,-6.245390993901217,0.7860613751482274,0.0,0.0,0.0,1.0
1718032301.2486796,map,True,False,4,5,0.0,0.0,1.6350483894348145,-1.6518186330795288,0.0,0.0,0.0,0.03427080400145934,0.9994125876118548,3.322760910376167,-6.245390993901217,0.7860613751482274,0.0,0.0,0.0,1.0
1718032301.2991915,map,True,False,4,5,0.0,0.0,1.6350483894348145,-1.6518186330795288,0.0,0.0,0.0,0.03427080400145934,0.9994125876118548,3.322760910376167,-6.245390993901217,0.7860613751482274,0.0,0.0,0.0,1.0
1718032301.3513885,map,True,False,4,5,0.0,0.0,1.6350483894348145,-1.6518186330795288,0.0,0.0,0.0,0.03427080400145934,0.9994125876118548,3.3782139354283105,-6.197706252066737,0.7983737629370521,0.0,0.0,0.0,1.0
1718032301.4002535,map,True,False,4,5,0.0,0.0,1.6350483894348145,-1.6518186330795288,0.0,0.0,0.0,0.03427080400145934,0.9994125876118548,3.3782139354283105,-6.197706252066737,0.7983737629370521,0.0,0.0,0.0,1.0
1718032301.4505165,map,True,False,4,5,0.0,0.0,1.6350483894348145,-1.6518186330795288,0.0,0.0,0.0,0.03427080400145934,0.9994125876118548,3.3782139354283105,-6.197706252066737,0.7983737629370521,0.0,0.0,0.0,1.0
1718032301.5001554,map,True,False,4,5,0.0,0.0,1.6350483894348145,-1.6518186330795288,0.0,0.0,0.0,0.03427080400145934,0.9994125876118548,3.3782139354283105,-6.197706252066737,0.7983737629370521,0.0,0.0,0.0,1.0
1718032301.5998552,map,True,False,4,5,0.0,0.0,1.6350483894348145,-1.6518186330795288,0.0,0.0,0.0,0.03427080400145934,0.9994125876118548,3.3782139354283105,-6.197706252066737,0.7983737629370521,0.0,0.0,0.0,1.0
1718032301.652207,map,True,False,4,5,0.0,0.0,1.6350483894348145,-1.6518186330795288,0.0,0.0,0.0,0.03427080400145934,0.9994125876118548,3.4374013401837664,-6.170470094579895,0.7841399604711764,0.0,0.0,0.0,1.0
1718032301.753134,map,True,False,4,5,0.0,0.0,1.6350483894348145,-1.6518186330795288,0.0,0.0,0.0,0.03427080400145934,0.9994125876118548,3.4301384696162747,-6.088416649286186,0.815408420552369,0.0,0.0,0.0,1.0
1718032301.852558,map,True,False,4,5,0.0,0.0,1.8165581226348877,-1.681411623954773,0.0,0.0,0.0,0.03585181758145924,0.9993571211722769,3.4301384696162747,-6.088416649286186,0.815408420552369,0.0,0.0,0.0,1.0
1718032302.0530455,map,True,False,4,4,0.5922520728754596,0.5922520728754596,1.8165581226348877,-1.681411623954773,0.0,0.0,0.0,0.03585181758145924,0.9993571211722769,3.470142736946054,-5.909685414296553,0.7528141445785393,0.0,0.0,0.0,1.0
1718032302.102734,map,True,False,4,4,0.5922520728754596,0.5922520728754596,1.8165581226348877,-1.681411623954773,0.0,0.0,0.0,0.03585181758145924,0.9993571211722769,3.470142736946054,-5.909685414296553,0.7528141445785393,0.0,0.0,0.0,1.0
1718032302.1527026,map,True,True,4,4,0.5922520728754596,0.5922520728754596,1.8165581226348877,-1.681411623954773,0.0,0.0,0.0,0.03585181758145924,0.9993571211722769,3.470142736946054,-5.909685414296553,0.7528141445785393,0.0,0.0,0.0,1.0
1718032302.2029586,map,True,False,4,4,0.5922520728754596,0.5922520728754596,1.8165581226348877,-1.681411623954773,0.0,0.0,0.0,0.03585181758145924,0.9993571211722769,3.470142736946054,-5.909685414296553,0.7528141445785393,0.0,0.0,0.0,1.0
1718032302.254716,map,True,True,4,4,0.5922520728754596,0.5922520728754596,1.8165581226348877,-1.681411623954773,0.0,0.0,0.0,0.03585181758145924,0.9993571211722769,3.470142736946054,-5.909685414296553,0.7528141445785393,0.0,0.0,0.0,1.0
1718032302.304581,map,True,True,4,4,0.5922520728754596,0.5922520728754596,1.8165581226348877,-1.681411623954773,0.0,0.0,0.0,0.03585181758145924,0.9993571211722769,3.470142736946054,-5.909685414296553,0.7528141445785393,0.0,0.0,0.0,1.0
1718032302.3555527,map,True,False,4,4,0.5922520728754596,0.5922520728754596,1.8165581226348877,-1.681411623954773,0.0,0.0,0.0,0.03585181758145924,0.9993571211722769,3.4367118295420265,-5.274243604004888,0.7640380284394087,0.0,0.0,0.0,1.0
1718032302.4557102,map,True,True,4,4,0.5922520728754596,0.5922520728754596,1.9220263957977295,-1.6965935230255127,0.0,0.0,0.0,0.037602452812181573,0.9992927792277088,3.4367118295420265,-5.274243604004888,0.7640380284394087,0.0,0.0,0.0,1.0
1718032302.5053713,map,True,False,4,4,0.5922520728754596,0.5922520728754596,1.9220263957977295,-1.6965935230255127,0.0,0.0,0.0,0.037602452812181573,0.9992927792277088,3.4367118295420265,-5.274243604004888,0.7640380284394087,0.0,0.0,0.0,1.0
1718032302.605399,map,True,False,4,4,0.5922520728754596,0.5922520728754596,1.9220263957977295,-1.6965935230255127,0.0,0.0,0.0,0.037602452812181573,0.9992927792277088,3.4367118295420265,-5.274243604004888,0.7640380284394087,0.0,0.0,0.0,1.0
1718032302.7105622,map,True,True,4,4,0.5922520728754596,0.5922520728754596,1.9220263957977295,-1.6965935230255127,0.0,0.0,0.0,0.037602452812181573,0.9992927792277088,3.4956938933641117,-5.029962017850247,0.7176958551542773,0.0,0.0,0.0,1.0
1718032302.7555106,map,True,False,4,4,0.5922520728754596,0.5922520728754596,1.9220263957977295,-1.6965935230255127,0.0,0.0,0.0,0.037602452812181573,0.9992927792277088,3.4956938933641117,-5.029962017850247,0.7176958551542773,0.0,0.0,0.0,1.0
1718032302.8565364,map,True,False,4,4,0.5922520728754596,0.5922520728754596,1.9220263957977295,-1.6965935230255127,0.0,0.0,0.0,0.037602452812181573,0.9992927792277088,3.4956938933641117,-5.029962017850247,0.7176958551542773,0.0,0.0,0.0,1.0
1718032303.0548744,map,True,True,4,4,0.5922520728754596,0.5922520728754596,1.9220263957977295,-1.6965935230255127,0.0,0.0,0.0,0.037602452812181573,0.9992927792277088,3.532293850250805,-5.013513568447279,0.7325929925884206,0.0,0.0,0.0,1.0
1718032303.1058009,map,True,False,3,4,0.0,0.0,2.023480176925659,-1.71656334400177,0.0,0.0,0.0,0.03880735920631617,0.9992467159029258,3.532293850250805,-5.013513568447279,0.7325929925884206,0.0,0.0,0.0,1.0
1718032303.2052336,map,True,False,3,4,0.0,0.0,2.023480176925659,-1.71656334400177,0.0,0.0,0.0,0.03880735920631617,0.9992467159029258,3.532293850250805,-5.013513568447279,0.7325929925884206,0.0,0.0,0.0,1.0
1718032303.3055115,map,True,False,3,4,0.0,0.0,2.023480176925659,-1.71656334400177,0.0,0.0,0.0,0.03880735920631617,0.9992467159029258,3.532293850250805,-5.013513568447279,0.7325929925884206,0.0,0.0,0.0,1.0
1718032303.4056962,map,True,True,3,3,0.6616527499769684,0.6616527499769684,2.023480176925659,-1.71656334400177,0.0,0.0,0.0,0.03880735920631617,0.9992467159029258,3.5210762841164778,-4.567372635507937,0.7214998331231686,0.0,0.0,0.0,1.0
1718032303.4554665,map,True,False,3,3,0.6616527499769684,0.6616527499769684,2.023480176925659,-1.71656334400177,0.0,0.0,0.0,0.03880735920631617,0.9992467159029258,3.5210762841164778,-4.567372635507937,0.7214998331231686,0.0,0.0,0.0,1.0
1718032303.5061898,map,True,True,3,3,0.6616527499769684,0.6616527499769684,2.023480176925659,-1.71656334400177,0.0,0.0,0.0,0.03880735920631617,0.9992467159029258,3.5210762841164778,-4.567372635507937,0.7214998331231686,0.0,0.0,0.0,1.0
1718032303.55587,map,True,False,3,3,0.6616527499769684,0.6616527499769684,2.023480176925659,-1.71656334400177,0.0,0.0,0.0,0.03880735920631617,0.9992467159029258,3.5210762841164778,-4.567372635507937,0.7214998331231686,0.0,0.0,0.0,1.0
1718032303.6065154,map,True,True,3,3,0.6616527499769684,0.6616527499769684,2.023480176925659,-1.71656334400177,0.0,0.0,0.0,0.03880735920631617,0.9992467159029258,3.5210762841164778,-4.567372635507937,0.7214998331231686,0.0,0.0,0.0,1.0
1718032303.706767,map,True,True,3,3,0.6616527499769684,0.6616527499769684,2.11655330657959,-1.7324012517929077,0.0,0.0,0.0,0.03903034456795993,0.9992380219391327,3.585840550810243,-4.34111948911339,0.701927204592835,0.0,0.0,0.0,1.0
1718032303.8058493,map,True,True,3,3,0.6616527499769684,0.6616527499769684,2.11655330657959,-1.7324012517929077,0.0,0.0,0.0,0.03903034456795993,0.9992380219391327,3.585840550810243,-4.34111948911339,0.701927204592835,0.0,0.0,0.0,1.0
1718032303.8601224,map,True,True,3,3,0.6616527499769684,0.6616527499769684,2.11655330657959,-1.7324012517929077,0.0,0.0,0.0,0.03903034456795993,0.9992380219391327,3.585840550810243,-4.34111948911339,0.701927204592835,0.0,0.0,0.0,1.0
1718032304.058528,map,True,True,3,3,0.6616527499769684,0.6616527499769684,2.11655330657959,-1.7324012517929077,0.0,0.0,0.0,0.03903034456795993,0.9992380219391327,3.5667126398291815,-3.9574418137520775,0.6917401420161573,0.0,0.0,0.0,1.0
1718032304.1061263,map,True,False,3,2,0.0,0.0,2.11655330657959,-1.7324012517929077,0.0,0.0,0.0,0.03903034456795993,0.9992380219391327,3.6070579905552065,-3.8408640304128516,0.6910993310929636,0.0,0.0,0.0,1.0
1718032304.1562424,map,True,False,3,2,0.0,0.0,2.11655330657959,-1.7324012517929077,0.0,0.0,0.0,0.03903034456795993,0.9992380219391327,3.6070579905552065,-3.8408640304128516,0.6910993310929636,0.0,0.0,0.0,1.0
1718032304.2564533,map,True,False,3,2,0.0,0.0,2.1934478282928467,-1.7497036457061768,0.0,0.0,0.0,0.041048225208979654,0.9991571629612853,3.6070579905552065,-3.8408640304128516,0.6910993310929636,0.0,0.0,0.0,1.0
1718032304.3556056,map,True,False,3,2,0.0,0.0,2.1934478282928467,-1.7497036457061768,0.0,0.0,0.0,0.041048225208979654,0.9991571629612853,3.6070579905552065,-3.8408640304128516,0.6910993310929636,0.0,0.0,0.0,1.0
1718032304.4063935,map,True,False,3,2,0.0,0.0,2.1934478282928467,-1.7497036457061768,0.0,0.0,0.0,0.041048225208979654,0.9991571629612853,3.607902608059234,-3.7600793870527314,0.6874678947023997,0.0,0.0,0.0,1.0
1718032304.45707,map,True,False,3,2,0.0,0.0,2.1934478282928467,-1.7497036457061768,0.0,0.0,0.0,0.041048225208979654,0.9991571629612853,3.6076368861375077,-3.7590427592754256,0.687464335152988,0.0,0.0,0.0,1.0
1718032304.507704,map,True,False,3,2,0.0,0.0,2.1934478282928467,-1.7497036457061768,0.0,0.0,0.0,0.041048225208979654,0.9991571629612853,3.6076368861375077,-3.7590427592754256,0.687464335152988,0.0,0.0,0.0,1.0
1718032304.5580807,map,True,False,3,2,0.0,0.0,2.1934478282928467,-1.7497036457061768,0.0,0.0,0.0,0.041048225208979654,0.9991571629612853,3.6076368861375077,-3.7590427592754256,0.687464335152988,0.0,0.0,0.0,1.0
1718032304.6583314,map,True,False,3,2,0.0,0.0,2.1934478282928467,-1.7497036457061768,0.0,0.0,0.0,0.041048225208979654,0.9991571629612853,3.6076368861375077,-3.7590427592754256,0.687464335152988,0.0,0.0,0.0,1.0
1718032304.708193,map,True,False,3,2,0.0,0.0,2.1934478282928467,-1.7497036457061768,0.0,0.0,0.0,0.041048225208979654,0.9991571629612853,3.6076368861375077,-3.7590427592754256,0.687464335152988,0.0,0.0,0.0,1.0
1718032304.7587125,map,True,False,3,2,0.0,0.0,2.1934478282928467,-1.7497036457061768,0.0,0.0,0.0,0.041048225208979654,0.9991571629612853,3.682183235651906,-3.4897373035667116,0.6834513284883509,0.0,0.0,0.0,1.0
1718032304.8589919,map,True,False,3,2,0.0,0.0,2.2564339637756348,-1.7773354053497314,0.0,0.0,0.0,0.04195808082180839,0.999119370852109,3.6851539156159334,-3.4451389403673964,0.6833789335663706,0.0,0.0,0.0,1.0
1718032305.111009,map,True,False,3,2,0.0,0.0,2.2564339637756348,-1.7773354053497314,0.0,0.0,0.0,0.04195808082180839,0.999119370852109,3.7083969951477096,-3.2906694925216153,0.6830498972695602,0.0,0.0,0.0,1.0
1718032305.163459,map,True,False,3,2,0.0,0.0,2.2564339637756348,-1.7773354053497314,0.0,0.0,0.0,0.04195808082180839,0.999119370852109,3.7281399985510353,-3.183135057391886,0.6827697185165907,0.0,0.0,0.0,1.0
1718032305.2112777,map,True,False,3,2,0.0,0.0,2.2564339637756348,-1.7773354053497314,0.0,0.0,0.0,0.04195808082180839,0.999119370852109,3.6965725891289063,-3.0184731897117105,0.6846047528440337,0.0,0.0,0.0,1.0
1718032305.3112156,map,True,False,3,2,0.0,0.0,2.2564339637756348,-1.7773354053497314,0.0,0.0,0.0,0.04195808082180839,0.999119370852109,3.695079038604611,-2.9975073920363497,0.6845561469838325,0.0,0.0,0.0,1.0
1718032305.4111068,map,True,False,3,2,0.0,0.0,2.360245943069458,-1.7863750457763672,0.0,0.0,0.0,0.04297873521272425,0.9990759842254683,3.695079038604611,-2.9975073920363497,0.6845561469838325,0.0,0.0,0.0,1.0
1718032305.4652243,map,True,False,3,2,0.0,0.0,2.360245943069458,-1.7863750457763672,0.0,0.0,0.0,0.04297873521272425,0.9990759842254683,3.695079038604611,-2.9975073920363497,0.6845561469838325,0.0,0.0,0.0,1.0
1718032305.5127938,map,True,False,3,2,0.0,0.0,2.360245943069458,-1.7863750457763672,0.0,0.0,0.0,0.04297873521272425,0.9990759842254683,3.7040538387062023,-2.940878986483037,0.6843200972792266,0.0,0.0,0.0,1.0
1718032305.5624192,map,True,False,3,2,0.0,0.0,2.360245943069458,-1.7863750457763672,0.0,0.0,0.0,0.04297873521272425,0.9990759842254683,3.706493958475612,-2.9146296481347003,0.6842137044270001,0.0,0.0,0.0,1.0
1718032305.6615663,map,True,False,3,2,0.0,0.0,2.360245943069458,-1.7863750457763672,0.0,0.0,0.0,0.04297873521272425,0.9990759842254683,3.706493958475612,-2.9146296481347003,0.6842137044270001,0.0,0.0,0.0,1.0
1718032305.7119684,map,True,False,3,2,0.0,0.0,2.360245943069458,-1.7863750457763672,0.0,0.0,0.0,0.04297873521272425,0.9990759842254683,3.706493958475612,-2.9146296481347003,0.6842137044270001,0.0,0.0,0.0,1.0
1718032305.7619877,map,True,False,3,2,0.0,0.0,2.383336067199707,-1.7895992994308472,0.0,0.0,0.0,0.043284328207142876,0.9990627993289999,3.706493958475612,-2.9146296481347003,0.6842137044270001,0.0,0.0,0.0,1.0
1718032305.8633614,map,True,False,3,1,0.0,0.0,2.383336067199707,-1.7895992994308472,0.0,0.0,0.0,0.043284328207142876,0.9990627993289999,3.8288715867407936,-2.6744718423506426,0.6814669694133683,0.0,0.0,0.0,1.0
1718032306.1634617,map,True,False,3,1,0.0,0.0,2.383336067199707,-1.7895992994308472,0.0,0.0,0.0,0.043284328207142876,0.9990627993289999,3.837883244858771,-2.5050587461435283,0.6811065557633411,0.0,0.0,0.0,1.0
1718032306.2629304,map,True,False,2,1,0.0,0.0,2.5128939151763916,-1.7983778715133667,0.0,0.0,0.0,0.04456942464701756,0.9990062842663056,3.7375456277884176,-2.388706978494263,0.6810759875439442,0.0,0.0,0.0,1.0
1718032306.3130136,map,True,False,2,1,0.0,0.0,2.5128939151763916,-1.7983778715133667,0.0,0.0,0.0,0.04456942464701756,0.9990062842663056,3.7375456277884176,-2.388706978494263,0.6810759875439442,0.0,0.0,0.0,1.0
1718032306.3635728,map,True,False,2,1,0.0,0.0,2.5128939151763916,-1.7983778715133667,0.0,0.0,0.0,0.04456942464701756,0.9990062842663056,3.7375456277884176,-2.388706978494263,0.6810759875439442,0.0,0.0,0.0,1.0
1718032306.4159122,map,True,False,2,1,0.0,0.0,2.5128939151763916,-1.7983778715133667,0.0,0.0,0.0,0.04456942464701756,0.9990062842663056,3.7375456277884176,-2.388706978494263,0.6810759875439442,0.0,0.0,0.0,1.0
1718032306.5149775,map,True,False,2,1,0.0,0.0,2.5128939151763916,-1.7983778715133667,0.0,0.0,0.0,0.04456942464701756,0.9990062842663056,3.8380271344408143,-2.133073701304156,0.6813601739058576,0.0,0.0,0.0,1.0
1718032306.5640972,map,True,False,2,1,0.0,0.0,2.5128939151763916,-1.7983778715133667,0.0,0.0,0.0,0.04456942464701756,0.9990062842663056,3.8332552658513723,-2.106992126123157,0.6812669154530637,0.0,0.0,0.0,1.0
1718032306.6639915,map,True,False,2,1,0.0,0.0,2.5960023403167725,-1.7855424880981445,0.0,0.0,0.0,0.043830480556548874,0.9990389795669858,3.8332552658513723,-2.106992126123157,0.6812669154530637,0.0,0.0,0.0,1.0
1718032306.7639353,map,True,False,2,1,0.0,0.0,2.5960023403167725,-1.7855424880981445,0.0,0.0,0.0,0.043830480556548874,0.9990389795669858,3.8332552658513723,-2.106992126123157,0.6812669154530637,0.0,0.0,0.0,1.0
1718032306.8649008,map,True,False,2,1,0.0,0.0,2.5960023403167725,-1.7855424880981445,0.0,0.0,0.0,0.043830480556548874,0.9990389795669858,3.8227248268619776,-2.000966281753203,0.6814085163483109,0.0,0.0,0.0,1.0
1718032307.0154955,map,True,False,2,1,0.0,0.0,2.5960023403167725,-1.7855424880981445,0.0,0.0,0.0,0.043830480556548874,0.9990389795669858,3.66886900190123,-1.878521895908134,0.6805638062295216,0.0,0.0,0.0,1.0
1718032307.1137187,map,True,False,2,1,0.0,0.0,2.638404607772827,-1.798253059387207,0.0,0.0,0.0,0.04380888580604856,0.9990399341582283,3.66886900190123,-1.878521895908134,0.6805638062295216,0.0,0.0,0.0,1.0
1718032307.1637814,map,True,False,2,1,0.0,0.0,2.638404607772827,-1.798253059387207,0.0,0.0,0.0,0.04380888580604856,0.9990399341582283,3.66886900190123,-1.878521895908134,0.6805638062295216,0.0,0.0,0.0,1.0
1718032307.2200704,map,True,False,2,1,0.0,0.0,2.638404607772827,-1.798253059387207,0.0,0.0,0.0,0.04380888580604856,0.9990399341582283,3.66886900190123,-1.878521895908134,0.6805638062295216,0.0,0.0,0.0,1.0
1718032307.3135035,map,True,False,2,1,0.0,0.0,2.638404607772827,-1.798253059387207,0.0,0.0,0.0,0.04380888580604856,0.9990399341582283,3.66886900190123,-1.878521895908134,0.6805638062295216,0.0,0.0,0.0,1.0
1718032307.3638985,map,True,False,2,1,0.0,0.0,2.638404607772827,-1.798253059387207,0.0,0.0,0.0,0.04380888580604856,0.9990399341582283,3.66886900190123,-1.878521895908134,0.6805638062295216,0.0,0.0,0.0,1.0
1718032307.4638433,map,True,False,2,1,0.0,0.0,2.638404607772827,-1.798253059387207,0.0,0.0,0.0,0.04380888580604856,0.9990399341582283,3.66886900190123,-1.878521895908134,0.6805638062295216,0.0,0.0,0.0,1.0
1718032307.514174,map,True,False,2,1,0.0,0.0,2.638404607772827,-1.798253059387207,0.0,0.0,0.0,0.04380888580604856,0.9990399341582283,3.66886900190123,-1.878521895908134,0.6805638062295216,0.0,0.0,0.0,1.0
1718032307.6136503,map,True,False,2,1,0.0,0.0,2.7640883922576904,-1.8710027933120728,0.0,0.0,0.0,0.04739534311031535,0.99887620842242,3.66886900190123,-1.878521895908134,0.6805638062295216,0.0,0.0,0.0,1.0
1718032307.664259,map,True,False,2,1,0.0,0.0,2.7640883922576904,-1.8710027933120728,0.0,0.0,0.0,0.04739534311031535,0.99887620842242,3.66886900190123,-1.878521895908134,0.6805638062295216,0.0,0.0,0.0,1.0
1718032307.721189,map,True,False,2,1,0.0,0.0,2.7640883922576904,-1.8710027933120728,0.0,0.0,0.0,0.04739534311031535,0.99887620842242,3.66886900190123,-1.878521895908134,0.6805638062295216,0.0,0.0,0.0,1.0
1718032307.7654922,map,True,False,2,1,0.0,0.0,2.7640883922576904,-1.8710027933120728,0.0,0.0,0.0,0.04739534311031535,0.99887620842242,3.66886900190123,-1.878521895908134,0.6805638062295216,0.0,0.0,0.0,1.0
1718032307.814548,map,True,False,2,1,0.0,0.0,2.7640883922576904,-1.8710027933120728,0.0,0.0,0.0,0.04739534311031535,0.99887620842242,3.66886900190123,-1.878521895908134,0.6805638062295216,0.0,0.0,0.0,1.0
1718032307.8653314,map,True,False,2,1,0.0,0.0,2.7640883922576904,-1.8710027933120728,0.0,0.0,0.0,0.04739534311031535,0.99887620842242,3.66886900190123,-1.878521895908134,0.6805638062295216,0.0,0.0,0.0,1.0
