car_pos_meter , car_pos_cell, car_speed, ped_pos_meter, ped_pos_cell, ped_speed
-41, 40, 2, 4.073937, 40, 1

-40.8334, 39, 2, 4.073937, 40, 1

-40.6668, 39, 2, 4.07401, 40, 1

-40.5002, 39, 2, 4.07401, 40, 1

-40.3336, 39, 2, 4.07401, 40, 1

-40.167, 39, 2, 4.07401, 40, 1

-40.0004, 39, 2, 4.07401, 40, 1

-39.83381, 38, 2, 4.069001, 40, 1

-39.66721, 38, 2, 4.069001, 40, 1

-39.50061, 38, 2, 4.067717, 40, 1

-39.33401, 38, 2, 4.067728, 40, 1

-39.16741, 38, 2, 4.067803, 40, 1

-39.00081, 38, 2, 4.067855, 40, 1

-38.83421, 37, 2, 4.068146, 40, 1

-38.66761, 37, 2, 4.068211, 40, 1

-38.50101, 37, 2, 4.06837, 40, 1

-38.33441, 37, 2, 4.068525, 40, 1

-38.16781, 37, 2, 4.068554, 40, 1

-38.00121, 37, 2, 4.068798, 40, 1

-37.83461, 36, 2, 4.068946, 40, 1

-37.66801, 36, 2, 4.06919, 40, 1

-37.50142, 36, 2, 4.069285, 40, 1

-37.33482, 36, 2, 4.069486, 40, 1

-37.16822, 36, 2, 4.069774, 40, 1

-37.00162, 36, 2, 4.069972, 40, 1

-36.83502, 35, 2, 4.070345, 40, 1

-36.66842, 35, 2, 4.070627, 40, 1

-36.50182, 35, 2, 4.071382, 40, 1

-36.33522, 35, 2, 4.072466, 40, 1

-36.16862, 35, 2, 4.073791, 40, 1

-36.00202, 35, 2, 4.075315, 40, 1

-35.83542, 34, 2, 4.076113, 40, 1

-35.66882, 34, 2, 4.07805, 40, 1

-35.50222, 34, 2, 4.080125, 40, 1

-35.33562, 34, 2, 4.082337, 40, 1

-35.16903, 34, 2, 4.084396, 40, 1

-35.00243, 34, 2, 4.085487, 40, 1

-34.83583, 33, 2, 4.087806, 40, 1

-34.66923, 33, 2, 4.089819, 40, 1

-34.50263, 33, 2, 4.091845, 40, 1

-34.33603, 33, 2, 4.093777, 40, 1

-34.16943, 33, 2, 4.094721, 40, 1

-34.00283, 33, 2, 4.096391, 40, 1

-33.83623, 32, 2, 4.097761, 40, 1

-33.66963, 32, 2, 4.099122, 40, 1

-33.50303, 32, 2, 4.100187, 41, 1

-33.33643, 32, 2, 4.100805, 41, 1

-33.16983, 32, 2, 4.101734, 41, 1

-33.00323, 32, 2, 4.10243, 41, 1

-32.83664, 31, 2, 4.102912, 41, 1

-32.67004, 31, 2, 4.103288, 41, 1

-32.50344, 31, 2, 4.10338, 41, 1

-32.33684, 31, 2, 4.103481, 41, 1

-32.17024, 31, 2, 4.103196, 41, 1

-32.00364, 31, 2, 4.102878, 41, 1

-31.83704, 30, 2, 4.102351, 41, 1

-31.67044, 30, 2, 4.101307, 41, 1

-31.50384, 30, 2, 4.100851, 41, 1

-31.33724, 30, 2, 4.099235, 40, 1

-31.17064, 30, 2, 4.098557, 40, 1

-31.00404, 30, 2, 4.097226, 40, 1

-30.83744, 29, 2, 4.095634, 40, 1

-30.67085, 29, 2, 4.094976, 40, 1

-30.50425, 29, 2, 4.093251, 40, 1

-30.33765, 29, 2, 4.091687, 40, 1

-30.17105, 29, 2, 4.08993, 40, 1

-30.00445, 29, 2, 4.08779, 40, 1

-29.83785, 28, 2, 4.08681, 40, 1

-29.67125, 28, 2, 4.084435, 40, 1

-29.50465, 28, 2, 4.082017, 40, 1

-29.33805, 28, 2, 4.0793, 40, 1

-29.17145, 28, 2, 4.077781, 40, 1

-29.00485, 28, 2, 4.075019, 40, 1

-28.83825, 27, 2, 4.071885, 40, 1

-28.67165, 27, 2, 4.06852, 40, 1

-28.50505, 27, 2, 4.064993, 40, 1

-28.33846, 27, 2, 4.061172, 40, 1

-28.17186, 27, 2, 4.059279, 40, 1

-28.00526, 27, 2, 4.05542, 40, 1

-27.83866, 26, 2, 4.049861, 40, 1

-27.67206, 26, 2, 4.048067, 40, 1

-27.50546, 26, 2, 4.044338, 40, 1

-27.33886, 26, 2, 4.042593, 40, 1

-27.17226, 26, 2, 4.038705, 40, 1

-27.00566, 26, 2, 4.034565, 40, 1

-26.83906, 25, 2, 4.030291, 40, 1

-26.67246, 25, 2, 4.025668, 40, 1

-26.50586, 25, 2, 4.023449, 40, 1

-26.33926, 25, 2, 4.018476, 40, 1

-26.17266, 25, 2, 4.013323, 40, 1

-26.00607, 25, 2, 4.007683, 40, 1

-25.83947, 24, 2, 4.001594, 40, 1

-25.67287, 24, 2, 3.998456, 39, 1

-25.50627, 24, 2, 3.991631, 39, 1

-25.33967, 24, 2, 3.984868, 39, 1

-25.17307, 24, 2, 3.978058, 39, 1

-25.00647, 24, 2, 3.97095, 39, 1

-24.83987, 23, 2, 3.96748, 39, 1

-24.67327, 23, 2, 3.96011, 39, 1

-24.50667, 23, 2, 3.952633, 39, 1

-24.34007, 23, 2, 3.94497, 39, 1

-24.17347, 23, 2, 3.937071, 39, 1

-24.00687, 23, 2, 3.933383, 39, 1

-23.84027, 22, 2, 3.925399, 39, 1

-23.67368, 22, 2, 3.917766, 39, 1

-23.50708, 22, 2, 3.910219, 39, 1

-23.34048, 22, 2, 3.902213, 39, 1

-23.17388, 22, 2, 3.898457, 38, 1

-23.00728, 22, 2, 3.890635, 38, 1

-22.84068, 21, 2, 3.883047, 38, 1

-22.67408, 21, 2, 3.87171, 38, 1

-22.50748, 21, 2, 3.867955, 38, 1

-22.34088, 21, 2, 3.864279, 38, 1

-22.17428, 21, 2, 3.857125, 38, 1

-22.00768, 21, 2, 3.850317, 38, 1

-21.84108, 20, 2, 3.843615, 38, 1

-21.67448, 20, 2, 3.837017, 38, 1

-21.50788, 20, 2, 3.833907, 38, 1

-21.34129, 20, 2, 3.827586, 38, 1

-21.17469, 20, 2, 3.821582, 38, 1

-21.00809, 20, 2, 3.812597, 38, 1

-20.84149, 19, 2, 3.809829, 38, 1

-20.67489, 19, 2, 3.806934, 38, 1

-20.50829, 19, 2, 3.801017, 38, 1

-20.34169, 19, 2, 3.795229, 37, 1

-20.17509, 19, 2, 3.789387, 37, 1

-20.00849, 19, 2, 3.783538, 37, 1

-19.84189, 18, 2, 3.780855, 37, 1

-19.67529, 18, 2, 3.775106, 37, 1

-19.50869, 18, 2, 3.769722, 37, 1

-19.34209, 18, 2, 3.76139, 37, 1

-19.1755, 18, 2, 3.758549, 37, 1

-19.0089, 18, 2, 3.755916, 37, 1

-18.8423, 17, 2, 3.750378, 37, 1

-18.6757, 17, 2, 3.744702, 37, 1

-18.5091, 17, 2, 3.739102, 37, 1

-18.3425, 17, 2, 3.733443, 37, 1

-18.1759, 17, 2, 3.730683, 37, 1

-18.0093, 17, 2, 3.724679, 37, 1

-17.8427, 16, 2, 3.718954, 37, 1

-17.6761, 16, 2, 3.713151, 37, 1

-17.5095, 16, 2, 3.707342, 37, 1

-17.3429, 16, 2, 3.704541, 37, 1

-17.1763, 16, 2, 3.698759, 36, 1

-17.0097, 16, 2, 3.693045, 36, 1

-16.84311, 15, 2, 3.687273, 36, 1

-16.67651, 15, 2, 3.681284, 36, 1

-16.50991, 15, 2, 3.678391, 36, 1

-16.34331, 15, 2, 3.6725, 36, 1

-16.17671, 15, 2, 3.666567, 36, 1

-16.01011, 15, 2, 3.660307, 36, 1

-15.84351, 14, 2, 3.651154, 36, 1

-15.67691, 14, 2, 3.651154, 36, 1

-15.51031, 14, 2, 3.644821, 36, 1

-15.34371, 14, 2, 3.638547, 36, 1

-15.17711, 14, 2, 3.632391, 36, 1

-15.01051, 14, 2, 3.626241, 36, 1

-14.84391, 13, 2, 3.623219, 36, 1

-14.67731, 13, 2, 3.617148, 36, 1

-14.51071, 13, 2, 3.611317, 36, 1

-14.34411, 13, 2, 3.605815, 36, 1

-14.17751, 13, 2, 3.60043, 36, 1

-14.01091, 13, 2, 3.597827, 35, 1

-13.84431, 12, 2, 3.592821, 35, 1

-13.6777, 12, 2, 3.58805, 35, 1

-13.5111, 12, 2, 3.58344, 35, 1

-13.3445, 12, 2, 3.578842, 35, 1

-13.1779, 12, 2, 3.576669, 35, 1

-13.0113, 12, 2, 3.572283, 35, 1

-12.8447, 11, 2, 3.568125, 35, 1

-12.6781, 11, 2, 3.563998, 35, 1

-12.5115, 11, 2, 3.562062, 35, 1

-12.3449, 11, 2, 3.556054, 35, 1

-12.1783, 11, 2, 3.554203, 35, 1

-12.0117, 11, 2, 3.550699, 35, 1

-11.8451, 10, 2, 3.547126, 35, 1

-11.6785, 10, 2, 3.54358, 35, 1

-11.5119, 10, 2, 3.541722, 35, 1

-11.3453, 10, 2, 3.538062, 35, 1

-11.1787, 10, 2, 3.53428, 35, 1

-11.0121, 10, 2, 3.530461, 35, 1

-10.8455, 9, 2, 3.526506, 35, 1

-10.6789, 9, 2, 3.524502, 35, 1

-10.5123, 9, 2, 3.520516, 35, 1

-10.3457, 9, 2, 3.516541, 35, 1

-10.1791, 9, 2, 3.512637, 35, 1

-10.0125, 9, 2, 3.50859, 35, 1

-9.8459, 8, 2, 3.506661, 35, 1

-9.679299, 8, 2, 3.502533, 35, 1

-9.512699, 8, 2, 3.498626, 34, 1

-9.346099, 8, 2, 3.494616, 34, 1

-9.179499, 8, 2, 3.49091, 34, 1

-9.012898, 8, 2, 3.488916, 34, 1

-8.846298, 7, 2, 3.482923, 34, 1

-8.679698, 7, 2, 3.480725, 34, 1

-8.513098, 7, 2, 3.476605, 34, 1

-8.346498, 7, 2, 3.472066, 34, 1

-8.179897, 7, 2, 3.469863, 34, 1

-8.013297, 7, 2, 3.465194, 34, 1

-7.846697, 6, 2, 3.460452, 34, 1

-7.680097, 6, 2, 3.455626, 34, 1

-7.513496, 6, 2, 3.450554, 34, 1

-7.346896, 6, 2, 3.447976, 34, 1

-7.180296, 6, 2, 3.442645, 34, 1

-7.013696, 6, 2, 3.437248, 34, 1

-6.847095, 5, 2, 3.431315, 34, 1

-6.680495, 5, 2, 3.425414, 34, 1

-6.513895, 5, 2, 3.422482, 34, 1

-6.347295, 5, 2, 3.416146, 34, 1

-6.180695, 5, 2, 3.409582, 34, 1

-6.014094, 5, 2, 3.402605, 34, 1

-5.847494, 4, 2, 3.395617, 33, 1

-5.680894, 4, 2, 3.392055, 33, 1

-5.514294, 4, 2, 3.38452, 33, 1

-5.347693, 4, 2, 3.376881, 33, 1

-5.181093, 4, 2, 3.368929, 33, 1

-5.014493, 4, 2, 3.36072, 33, 1

-4.847893, 3, 2, 3.356648, 33, 1

-4.681293, 3, 2, 3.348258, 33, 1

-4.514692, 3, 2, 3.339553, 33, 1

-4.348092, 3, 2, 3.330841, 33, 1

-4.181492, 3, 2, 3.321549, 33, 1

-4.014892, 3, 2, 3.316976, 33, 1

-3.848292, 2, 2, 3.307656, 33, 1

-3.681692, 2, 2, 3.298309, 32, 1

-3.515092, 2, 2, 3.288713, 32, 1

-3.348492, 2, 2, 3.278887, 32, 1

-3.181892, 2, 2, 3.2741, 32, 1

-3.015292, 2, 2, 3.264421, 32, 1

-2.848692, 1, 2, 3.254712, 32, 1

-2.682092, 1, 2, 3.245269, 32, 1

-2.515492, 1, 2, 3.235681, 32, 1

-2.348892, 1, 2, 3.230978, 32, 1

-2.182292, 1, 2, 3.221628, 32, 1

-2.015692, 1, 2, 3.212248, 32, 1

-1.849092, 0, 2, 3.202333, 32, 1

-1.682492, 0, 2, 3.191977, 31, 1

-1.515892, 0, 2, 3.186655, 31, 1

-1.349292, 0, 2, 3.176143, 31, 1

-1.182692, 0, 2, 3.165248, 31, 1

-1.016092, 0, 2, 3.154227, 31, 1

-0.8494918, -1, 2, 3.14323, 31, 1

-0.6828918, -1, 2, 3.137747, 31, 1

-0.5162919, -1, 2, 3.126798, 31, 1

-0.3496919, -1, 2, 3.116273, 31, 1

-0.1830919, -1, 2, 3.105652, 31, 1

-0.01649189, -1, 2, 3.100377, 31, 1

0.1501081, -1, 2, 3.0896, 30, 1

0.3167081, -1, 2, 3.078453, 30, 1

0.4833081, -1, 2, 3.067087, 30, 1

0.6499081, -1, 2, 3.055794, 30, 1

0.8165081, -1, 2, 3.050125, 30, 1

0.983108, -1, 2, 3.038904, 30, 1

1.149708, -2, 2, 3.027501, 30, 1

1.316308, -2, 2, 3.015281, 30, 1

1.482908, -2, 2, 3.0027, 30, 1

1.649508, -2, 2, 2.989564, 29, 1

1.816108, -2, 2, 2.982858, 29, 1

1.982708, -2, 2, 2.968897, 29, 1

2.149308, -3, 2, 2.95441, 29, 1

2.315908, -3, 2, 2.939623, 29, 1

2.482508, -3, 2, 2.924201, 29, 1

2.649108, -3, 2, 2.916371, 29, 1

2.815708, -3, 2, 2.900212, 29, 1

2.982308, -3, 2, 2.883103, 28, 1

3.148908, -4, 2, 2.85751, 28, 2

3.315508, -4, 2, 2.849051, 28, 1

3.482108, -4, 2, 2.840399, 28, 1

3.648708, -4, 2, 2.822725, 28, 1

3.815308, -4, 2, 2.804594, 28, 1

3.981908, -4, 2, 2.786876, 27, 1

4.148508, -5, 2, 2.769177, 27, 1

4.315108, -5, 2, 2.760453, 27, 1

4.481709, -5, 2, 2.743943, 27, 1

4.648309, -5, 2, 2.727457, 27, 1

4.814909, -5, 2, 2.711883, 27, 1

4.981509, -5, 2, 2.697896, 26, 1

5.148109, -6, 2, 2.691396, 26, 1

5.31471, -6, 2, 2.677775, 26, 1

5.48131, -6, 2, 2.666116, 26, 1

5.64791, -6, 2, 2.654212, 26, 1

5.81451, -6, 2, 2.642097, 26, 1

5.981111, -6, 2, 2.636313, 26, 1

6.147711, -7, 2, 2.625325, 26, 1

6.314311, -7, 2, 2.613962, 26, 1

6.480911, -7, 2, 2.603298, 26, 1

6.647511, -7, 2, 2.592237, 25, 1

6.814112, -7, 2, 2.585699, 25, 1

6.980712, -7, 2, 2.572983, 25, 1

7.147312, -8, 2, 2.558914, 25, 1

7.313912, -8, 2, 2.544125, 25, 1

7.480513, -8, 2, 2.529163, 25, 1

7.647113, -8, 2, 2.521063, 25, 1

7.813713, -8, 2, 2.504799, 25, 1

7.980313, -8, 2, 2.487195, 24, 1

8.146914, -9, 2, 2.469158, 24, 1

8.313514, -9, 2, 2.450697, 24, 1

8.480114, -9, 2, 2.441129, 24, 1

8.646714, -9, 2, 2.42226, 24, 1

8.813314, -9, 2, 2.402927, 24, 1

8.979915, -9, 2, 2.383171, 23, 1

9.146515, -10, 2, 2.363895, 23, 1

9.313115, -10, 2, 2.353726, 23, 1

9.479715, -10, 2, 2.333278, 23, 1

9.646316, -10, 2, 2.312086, 23, 1

9.812916, -10, 2, 2.290512, 22, 1

9.979516, -10, 2, 2.255662, 22, 2

10.14612, -11, 2, 2.255662, 22, 1

10.31272, -11, 2, 2.232073, 22, 2

10.47932, -11, 2, 2.207808, 22, 2

10.64592, -11, 2, 2.183764, 21, 2

10.81252, -11, 2, 2.159854, 21, 2

10.97912, -11, 2, 2.148221, 21, 1

11.14572, -12, 2, 2.125225, 21, 2

11.31232, -12, 2, 2.104624, 21, 1

11.47892, -12, 2, 2.083828, 20, 1

11.64552, -12, 2, 2.055748, 20, 2

11.81212, -12, 2, 2.055748, 20, 1

11.97872, -12, 2, 2.037934, 20, 1

12.14532, -13, 2, 2.019924, 20, 1

12.31192, -13, 2, 2.001186, 20, 1

12.47852, -13, 2, 1.983247, 19, 1

12.64512, -13, 2, 1.973196, 19, 1

12.81172, -13, 2, 1.955137, 19, 1

12.97832, -13, 2, 1.936587, 19, 1

13.14492, -14, 2, 1.917957, 19, 1

13.31152, -14, 2, 1.899534, 18, 1

13.47812, -14, 2, 1.879494, 18, 1

13.64472, -14, 2, 1.869787, 18, 1

13.81132, -14, 2, 1.849779, 18, 1

13.97792, -14, 2, 1.829607, 18, 1

14.14452, -15, 2, 1.808756, 18, 1

14.31112, -15, 2, 1.79839, 17, 1

14.47772, -15, 2, 1.778198, 17, 1

14.64432, -15, 2, 1.757764, 17, 1

14.81092, -15, 2, 1.737133, 17, 1

14.97752, -15, 2, 1.716725, 17, 1

15.14412, -16, 2, 1.706535, 17, 1

15.31072, -16, 2, 1.685339, 16, 1

15.47732, -16, 2, 1.664514, 16, 1

15.64392, -16, 2, 1.64387, 16, 1

15.81052, -16, 2, 1.623304, 16, 1

15.97712, -16, 2, 1.613283, 16, 1

16.14372, -17, 2, 1.593819, 15, 1

16.31032, -17, 2, 1.573704, 15, 1

16.47692, -17, 2, 1.554156, 15, 1

16.64352, -17, 2, 1.534721, 15, 1

16.81012, -17, 2, 1.525324, 15, 1

16.97672, -17, 2, 1.497061, 14, 2

17.14332, -18, 2, 1.48721, 14, 1

17.30992, -18, 2, 1.468477, 14, 1

17.47652, -18, 2, 1.450638, 14, 1

17.64312, -18, 2, 1.441786, 14, 1

17.80972, -18, 2, 1.423639, 14, 1

17.97632, -18, 2, 1.405294, 14, 1

18.14292, -19, 2, 1.386863, 13, 1

18.30951, -19, 2, 1.368089, 13, 1

18.47611, -19, 2, 1.358634, 13, 1

18.64271, -19, 2, 1.331114, 13, 2

18.80931, -19, 2, 1.321701, 13, 1

18.97591, -19, 2, 1.303142, 13, 1

19.14251, -20, 2, 1.284028, 12, 1

19.30911, -20, 2, 1.264691, 12, 1

19.47571, -20, 2, 1.254722, 12, 1

19.64231, -20, 2, 1.235512, 12, 1

19.80891, -20, 2, 1.216067, 12, 1

19.97551, -20, 2, 1.195045, 11, 1

20.14211, -21, 2, 1.185668, 11, 1

20.30871, -21, 2, 1.165721, 11, 1

20.47531, -21, 2, 1.145845, 11, 1

20.6419, -21, 2, 1.126615, 11, 1

20.8085, -21, 2, 1.106337, 11, 1

20.9751, -21, 2, 1.096601, 10, 1

21.1417, -22, 2, 1.076249, 10, 1

21.3083, -22, 2, 1.055574, 10, 1

21.4749, -22, 2, 1.034967, 10, 1

21.6415, -22, 2, 1.0151, 10, 1

21.8081, -22, 2, 1.005223, 10, 1

21.9747, -22, 2, 0.9860158, 9, 1

22.1413, -23, 2, 0.9677103, 9, 1

22.3079, -23, 2, 0.9497321, 9, 1

22.4745, -23, 2, 0.9310651, 9, 1

22.6411, -23, 2, 0.9217331, 9, 1

22.8077, -23, 2, 0.9033785, 9, 1

22.97429, -23, 2, 0.8850753, 8, 1

23.14089, -24, 2, 0.8672547, 8, 1

23.30749, -24, 2, 0.8486104, 8, 1

23.47409, -24, 2, 0.8308096, 8, 1

23.64069, -24, 2, 0.821888, 8, 1

23.80729, -24, 2, 0.7948084, 7, 2

23.97389, -24, 2, 0.7858689, 7, 1

24.14049, -25, 2, 0.7679815, 7, 1

24.30709, -25, 2, 0.7496562, 7, 1

24.47369, -25, 2, 0.7403331, 7, 1

24.64029, -25, 2, 0.721029, 7, 1

24.80689, -25, 2, 0.7022805, 7, 1

24.97349, -25, 2, 0.6824515, 6, 1

25.14009, -26, 2, 0.6623263, 6, 1

25.30668, -26, 2, 0.6520224, 6, 1

25.47328, -26, 2, 0.6323392, 6, 1

25.63988, -26, 2, 0.6127808, 6, 1

25.80648, -26, 2, 0.5932271, 5, 1

25.97308, -26, 2, 0.5732968, 5, 1

26.13968, -27, 2, 0.5635247, 5, 1

26.30628, -27, 2, 0.5440784, 5, 1

26.47288, -27, 2, 0.5244353, 5, 1

26.63948, -27, 2, 0.5044537, 5, 1

26.80608, -27, 2, 0.4848909, 4, 1

26.97268, -27, 2, 0.4753742, 4, 1

27.13928, -28, 2, 0.4561377, 4, 1

27.30588, -28, 2, 0.4374142, 4, 1

27.47248, -28, 2, 0.4187422, 4, 1

27.63907, -28, 2, 0.4006791, 4, 1

27.80567, -28, 2, 0.3918304, 3, 1

27.97227, -28, 2, 0.3734732, 3, 1

28.13887, -29, 2, 0.3549955, 3, 1

28.30547, -29, 2, 0.3366399, 3, 1

28.47207, -29, 2, 0.3190932, 3, 1

28.63867, -29, 2, 0.3101034, 3, 1

28.80527, -29, 2, 0.291852, 2, 1

28.97187, -29, 2, 0.2646422, 2, 2

29.13847, -30, 2, 0.2556036, 2, 1

29.30507, -30, 2, 0.2378716, 2, 1

29.47167, -30, 2, 0.2287951, 2, 1

29.63827, -30, 2, 0.2107167, 2, 1

29.80486, -30, 2, 0.1924791, 1, 1

29.97146, -30, 2, 0.1743786, 1, 1

30.13806, -31, 2, 0.1560981, 1, 1

30.30466, -31, 2, 0.14678, 1, 1

30.47126, -31, 2, 0.1283023, 1, 1

30.63786, -31, 2, 0.1003573, 1, 2

30.80446, -31, 2, 0.09077501, 0, 1

30.97106, -31, 2, 0.07237649, 0, 1

31.13766, -32, 2, 0.06308556, 0, 1

31.30426, -32, 2, 0.04491305, 0, 1

31.47086, -32, 2, 0.02730823, 0, 1

31.63746, -32, 2, 0.008811235, 0, 1

31.80406, -32, 2, -0.008875132, 0, 1

31.97066, -32, 2, -0.01798987, 0, 1

32.13726, -33, 2, -0.03584719, 0, 1

32.30386, -33, 2, -0.06320357, 0, 2

32.47046, -33, 2, -0.07227278, 0, 1

32.63705, -33, 2, -0.09063721, 0, 1

32.80365, -33, 2, -0.09971762, 0, 1

32.97025, -33, 2, -0.1168871, -1, 1

33.13685, -34, 2, -0.1340401, -1, 1

33.30345, -34, 2, -0.1426439, -1, 1

33.47005, -34, 2, -0.1680009, -1, 2

33.63665, -34, 2, -0.1767297, -1, 1

33.80325, -34, 2, -0.1937194, -1, 1

33.96985, -34, 2, -0.2100017, -2, 1

34.13645, -35, 2, -0.2252247, -2, 1

34.30305, -35, 2, -0.2401099, -2, 1

34.46965, -35, 2, -0.2475672, -2, 1

34.63625, -35, 2, -0.2624454, -2, 1

34.80285, -35, 2, -0.2769918, -2, 1

34.96944, -35, 2, -0.2916217, -2, 1

35.13604, -36, 2, -0.2987707, -2, 1

35.30264, -36, 2, -0.3132269, -3, 1

35.46924, -36, 2, -0.3276629, -3, 1

35.63584, -36, 2, -0.3421471, -3, 1

35.80244, -36, 2, -0.356535, -3, 1

35.96904, -36, 2, -0.3709314, -3, 1

36.13564, -37, 2, -0.3781834, -3, 1

36.30224, -37, 2, -0.3929179, -3, 1

36.46884, -37, 2, -0.4078963, -4, 1

36.63544, -37, 2, -0.4228518, -4, 1

36.80204, -37, 2, -0.4381595, -4, 1

36.96864, -37, 2, -0.4459348, -4, 1

37.13523, -38, 2, -0.4614511, -4, 1

37.30183, -38, 2, -0.4777765, -4, 1

37.46843, -38, 2, -0.5027318, -5, 2

37.63503, -38, 2, -0.5110359, -5, 1

37.80163, -38, 2, -0.5195415, -5, 1

37.96823, -38, 2, -0.5369105, -5, 1

38.13483, -39, 2, -0.554213, -5, 1

38.30143, -39, 2, -0.5712888, -5, 1

38.46803, -39, 2, -0.5888822, -5, 1

38.63463, -39, 2, -0.5976682, -5, 1

38.80123, -39, 2, -0.6151161, -6, 1

38.96783, -39, 2, -0.632762, -6, 1

39.13443, -40, 2, -0.6505389, -6, 1

39.30103, -40, 2, -0.6680632, -6, 1

39.46762, -40, 2, -0.685483, -6, 1

39.63422, -40, 2, -0.6943088, -6, 1

39.80082, -40, 2, -0.710681, -7, 1

39.96742, -40, 2, -0.7267909, -7, 1

40.13402, -41, 2, -0.742732, -7, 1

40.30062, -41, 2, -0.7504778, -7, 1

40.46722, -41, 2, -0.7658763, -7, 1

40.63382, -41, 2, -0.7809777, -7, 1

40.80042, -41, 2, -0.7957382, -7, 1

40.96702, -41, 2, -0.8102937, -8, 1

41.13362, -42, 2, -0.8175511, -8, 1

41.30022, -42, 2, -0.8318954, -8, 1

41.46682, -42, 2, -0.8462119, -8, 1

41.63342, -42, 2, -0.8606858, -8, 1

41.80001, -42, 2, -0.8750415, -8, 1

41.96661, -42, 2, -0.8823123, -8, 1

42.13321, -43, 2, -0.896471, -8, 1

42.29981, -43, 2, -0.9104619, -9, 1

42.46641, -43, 2, -0.9247456, -9, 1

42.63301, -43, 2, -0.9460363, -9, 1

42.79961, -43, 2, -0.9460363, -9, 1

42.96621, -43, 2, -0.9600463, -9, 1

43.13281, -44, 2, -0.9739833, -9, 1

43.29941, -44, 2, -0.9880152, -9, 1

43.46601, -44, 2, -1.001468, -10, 1

43.63261, -44, 2, -1.008393, -10, 1

43.79921, -44, 2, -1.021783, -10, 1

43.96581, -44, 2, -1.035508, -10, 1

44.1324, -45, 2, -1.049561, -10, 1

44.299, -45, 2, -1.070912, -10, 1

44.4656, -45, 2, -1.070912, -10, 1

44.6322, -45, 2, -1.085564, -10, 1

44.7988, -45, 2, -1.100086, -11, 1

44.9654, -45, 2, -1.115096, -11, 1

45.132, -46, 2, -1.130597, -11, 1

45.2986, -46, 2, -1.138386, -11, 1

45.4652, -46, 2, -1.154269, -11, 1

45.6318, -46, 2, -1.169644, -11, 1

45.7984, -46, 2, -1.185049, -11, 1

45.965, -46, 2, -1.192466, -11, 1

46.1316, -47, 2, -1.2149, -12, 2

46.29819, -47, 2, -1.222169, -12, 1

46.46479, -47, 2, -1.236823, -12, 1

46.63139, -47, 2, -1.244118, -12, 1

46.79799, -47, 2, -1.266294, -12, 2

46.96459, -47, 2, -1.27346, -12, 1

47.13119, -48, 2, -1.287361, -12, 1

47.29779, -48, 2, -1.300519, -13, 1

47.46439, -48, 2, -1.313791, -13, 1

47.63099, -48, 2, -1.326863, -13, 1

47.79759, -48, 2, -1.333042, -13, 1

47.96419, -48, 2, -1.345932, -13, 1

48.13079, -49, 2, -1.358118, -13, 1

48.29739, -49, 2, -1.370524, -13, 1

48.46399, -49, 2, -1.38328, -13, 1

48.63058, -49, 2, -1.389458, -13, 1

48.79718, -49, 2, -1.402531, -14, 1

48.96378, -49, 2, -1.415174, -14, 1

49.13038, -50, 2, -1.427985, -14, 1

49.29698, -50, 2, -1.434208, -14, 1

49.46358, -50, 2, -1.447257, -14, 1

49.63018, -50, 2, -1.460083, -14, 1

49.79678, -50, 2, -1.4663, -14, 1

49.96338, -50, 2, -1.47878, -14, 1

50.12998, -51, 2, -1.491266, -14, 1

50.29658, -51, 2, -1.503541, -15, 1

50.46318, -51, 2, -1.50988, -15, 1

50.62978, -51, 2, -1.522335, -15, 1

50.79638, -51, 2, -1.534944, -15, 1

50.96297, -51, 2, -1.547674, -15, 1

51.12957, -52, 2, -1.553592, -15, 1

51.29617, -52, 2, -1.571452, -15, 1

51.46277, -52, 2, -1.57714, -15, 1

51.62937, -52, 2, -1.588881, -15, 1

51.79597, -52, 2, -1.600292, -16, 1

51.96257, -52, 2, -1.611286, -16, 1

52.12917, -53, 2, -1.616822, -16, 1

52.29577, -53, 2, -1.627065, -16, 1

52.46237, -53, 2, -1.637426, -16, 1

52.62897, -53, 2, -1.647149, -16, 1

52.79557, -53, 2, -1.651778, -16, 1

52.96217, -53, 2, -1.664754, -16, 1

53.12877, -54, 2, -1.668583, -16, 1

53.29536, -54, 2, -1.676204, -16, 1

53.46196, -54, 2, -1.682864, -16, 1

53.62856, -54, 2, -1.686018, -16, 1

53.79516, -54, 2, -1.692318, -16, 1

53.96176, -54, 2, -1.698308, -16, 1

54.12836, -55, 2, -1.704447, -17, 1

54.29496, -55, 2, -1.710467, -17, 1

54.46156, -55, 2, -1.713128, -17, 1

54.62816, -55, 2, -1.718912, -17, 1

54.79476, -55, 2, -1.72441, -17, 1

54.96136, -55, 2, -1.730179, -17, 1

55.12796, -56, 2, -1.736147, -17, 1

55.29456, -56, 2, -1.738961, -17, 1

55.46115, -56, 2, -1.745462, -17, 1

55.62775, -56, 2, -1.751745, -17, 1

55.79435, -56, 2, -1.758207, -17, 1

55.96095, -56, 2, -1.764976, -17, 1

56.12755, -57, 2, -1.767954, -17, 1

56.29415, -57, 2, -1.774271, -17, 1

56.46075, -57, 2, -1.783182, -17, 1

56.62735, -57, 2, -1.786057, -17, 1

56.79395, -57, 2, -1.791775, -17, 1

56.96055, -57, 2, -1.79465, -17, 1

57.12715, -58, 2, -1.800566, -18, 1

57.29375, -58, 2, -1.806169, -18, 1

57.46035, -58, 2, -1.81188, -18, 1

57.62695, -58, 2, -1.81784, -18, 1

57.79354, -58, 2, -1.823909, -18, 1

57.96014, -58, 2, -1.82689, -18, 1

58.12674, -59, 2, -1.833242, -18, 1

58.29334, -59, 2, -1.839149, -18, 1

58.45994, -59, 2, -1.845194, -18, 1

58.62654, -59, 2, -1.85063, -18, 1

58.79314, -59, 2, -1.85359, -18, 1

58.95974, -59, 2, -1.858804, -18, 1

59.12634, -60, 2, -1.864456, -18, 1

59.29294, -60, 2, -1.870311, -18, 1

59.45954, -60, 2, -1.875455, -18, 1

59.62614, -60, 2, -1.878535, -18, 1

59.79274, -60, 2, -1.883808, -18, 1

59.95934, -60, 2, -1.891884, -18, 1

60.12593, -61, 2, -1.894762, -18, 1

60.29253, -61, 2, -1.899778, -18, 1

60.45913, -61, 2, -1.902352, -19, 1

60.62573, -61, 2, -1.906938, -19, 1

60.79233, -61, 2, -1.911577, -19, 1

60.95893, -61, 2, -1.91614, -19, 1

61.12553, -62, 2, -1.918157, -19, 1

61.29213, -62, 2, -1.92215, -19, 1

61.45873, -62, 2, -1.925994, -19, 1

61.62533, -62, 2, -1.931231, -19, 1

61.79193, -62, 2, -1.933008, -19, 1

61.95853, -62, 2, -1.936387, -19, 1

62.12513, -63, 2, -1.938096, -19, 1

62.29173, -63, 2, -1.941401, -19, 1

62.45832, -63, 2, -1.944501, -19, 1

62.62492, -63, 2, -1.947397, -19, 1

62.79152, -63, 2, -1.950277, -19, 1

62.95812, -63, 2, -1.951509, -19, 1

63.12472, -64, 2, -1.953482, -19, 1

63.29132, -64, 2, -1.95583, -19, 1

63.45792, -64, 2, -1.957569, -19, 1

63.62452, -64, 2, -1.958816, -19, 1

63.79112, -64, 2, -1.959368, -19, 1

63.95772, -64, 2, -1.960406, -19, 1

64.12431, -65, 2, -1.961377, -19, 1

64.29092, -65, 2, -1.961639, -19, 1

64.45752, -65, 2, -1.961813, -19, 1

64.62413, -65, 2, -1.961936, -19, 1

64.79073, -65, 2, -1.961731, -19, 1

64.95734, -65, 2, -1.960995, -19, 1

65.12393, -66, 2, -1.959701, -19, 1

65.29054, -66, 2, -1.957832, -19, 1

65.45714, -66, 2, -1.957052, -19, 1

65.62375, -66, 2, -1.955211, -19, 1

65.79034, -66, 2, -1.952796, -19, 1

65.95695, -66, 2, -1.950202, -19, 1

66.12355, -67, 2, -1.947045, -19, 1

66.29016, -67, 2, -1.945646, -19, 1

66.45676, -67, 2, -1.942169, -19, 1

66.62337, -67, 2, -1.939066, -19, 1

66.78996, -67, 2, -1.934214, -19, 1

66.95657, -67, 2, -1.932783, -19, 1

67.12317, -68, 2, -1.931694, -19, 1

67.28978, -68, 2, -1.928645, -19, 1

67.45638, -68, 2, -1.924963, -19, 1

67.62299, -68, 2, -1.921394, -19, 1

67.78958, -68, 2, -1.919471, -19, 1

67.95619, -68, 2, -1.915433, -19, 1

68.12279, -69, 2, -1.911192, -19, 1

68.2894, -69, 2, -1.908915, -19, 1

68.45599, -69, 2, -1.90431, -19, 1

68.6226, -69, 2, -1.899385, -18, 1

68.7892, -69, 2, -1.894711, -18, 1

68.95581, -69, 2, -1.889657, -18, 1

69.12241, -70, 2, -1.884581, -18, 1

69.28902, -70, 2, -1.879946, -18, 1

69.45561, -70, 2, -1.875283, -18, 1

69.62222, -70, 2, -1.873093, -18, 1

69.78882, -70, 2, -1.86828, -18, 1

69.95543, -70, 2, -1.86355, -18, 1

70.12202, -71, 2, -1.858996, -18, 1

70.28864, -71, 2, -1.854537, -18, 1

70.45523, -71, 2, -1.852189, -18, 1

70.62184, -71, 2, -1.847701, -18, 1

70.78844, -71, 2, -1.843493, -18, 1

70.95505, -71, 2, -1.839405, -18, 1

71.12164, -72, 2, -1.835504, -18, 1

71.28825, -72, 2, -1.83355, -18, 1

71.45485, -72, 2, -1.829739, -18, 1

71.62146, -72, 2, -1.827772, -18, 1

71.78806, -72, 2, -1.82212, -18, 1

71.95467, -72, 2, -1.820126, -18, 1

72.12126, -73, 2, -1.816481, -18, 1

72.28787, -73, 2, -1.813097, -18, 1

72.45447, -73, 2, -1.809775, -18, 1

72.62108, -73, 2, -1.808255, -18, 1

72.78767, -73, 2, -1.805169, -18, 1

72.95428, -73, 2, -1.802551, -18, 1

73.12088, -74, 2, -1.800072, -18, 1

73.28749, -74, 2, -1.797533, -17, 1

73.45409, -74, 2, -1.795113, -17, 1

73.6207, -74, 2, -1.793859, -17, 1

73.78729, -74, 2, -1.790856, -17, 1

73.9539, -74, 2, -1.790006, -17, 1

74.1205, -75, 2, -1.788211, -17, 1

74.28711, -75, 2, -1.786233, -17, 1

74.4537, -75, 2, -1.785161, -17, 1

74.62032, -75, 2, -1.783168, -17, 1

74.78691, -75, 2, -1.781029, -17, 1

74.95352, -75, 2, -1.778886, -17, 1

75.12012, -76, 2, -1.777016, -17, 1

75.28673, -76, 2, -1.775982, -17, 1

75.45332, -76, 2, -1.773312, -17, 1

75.61993, -76, 2, -1.772936, -17, 1

75.78653, -76, 2, -1.772103, -17, 1

75.95314, -76, 2, -1.771813, -17, 1

76.11974, -77, 2, -1.771458, -17, 1

76.28635, -77, 2, -1.771584, -17, 1

76.45294, -77, 2, -1.771424, -17, 1

76.61955, -77, 2, -1.772092, -17, 1

76.78615, -77, 2, -1.772809, -17, 1

76.95276, -77, 2, -1.772787, -17, 1

77.11935, -78, 2, -1.773731, -17, 1

77.28596, -78, 2, -1.774028, -17, 1

77.45256, -78, 2, -1.774432, -17, 1

77.61917, -78, 2, -1.775383, -17, 1

77.78577, -78, 2, -1.775368, -17, 1

77.95238, -78, 2, -1.775538, -17, 1

78.11897, -79, 2, -1.775527, -17, 1

78.28558, -79, 2, -1.775264, -17, 1

78.45218, -79, 2, -1.774596, -17, 1

78.61879, -79, 2, -1.773356, -17, 1

78.78539, -79, 2, -1.772802, -17, 1

78.952, -79, 2, -1.771204, -17, 1

79.11859, -80, 2, -1.769657, -17, 1

79.2852, -80, 2, -1.767944, -17, 1

79.4518, -80, 2, -1.76607, -17, 1

79.61841, -80, 2, -1.765125, -17, 1

79.785, -80, 2, -1.762452, -17, 1

79.95161, -80, 2, -1.759604, -17, 1

80.11821, -81, 2, -1.756685, -17, 1

80.28482, -81, 2, -1.753225, -17, 1

80.45142, -81, 2, -1.751376, -17, 1

80.61803, -81, 2, -1.74613, -17, 1

80.78462, -81, 2, -1.744338, -17, 1

80.95123, -81, 2, -1.740534, -17, 1

81.11783, -82, 2, -1.736772, -17, 1

81.28444, -82, 2, -1.734773, -17, 1

81.45103, -82, 2, -1.730807, -17, 1

81.61765, -82, 2, -1.726969, -17, 1

