timestamp_sec,frame_id,game_played,yielding,player1discrete,player2discrete,player1yieldprob,player2yieldprob,player1_pose_x,player1_pose_y,player1_pose_z,player1_pose_orient_x,player1_pose_orient_y,player1_pose_orient_z,player1_pose_orient_w,player2_pose_x,player2_pose_y,player2_pose_z,player2_pose_orient_x,player2_pose_orient_y,player2_pose_orient_z,player2_pose_orient_w
1718112874.64901,map,True,True,5,5,0.612995793784914,0.612995793784914,1.4356780052185059,-1.4833109378814697,0.0,0.0,0.0,0.03809171907237417,0.999274243803927,3.1781365470003813,-6.548074278022618,1.004411507058855,0.0,0.0,0.0,1.0
1718112874.699696,map,True,True,5,5,0.612995793784914,0.612995793784914,1.4356780052185059,-1.4833109378814697,0.0,0.0,0.0,0.03809171907237417,0.999274243803927,3.1781365470003813,-6.548074278022618,1.004411507058855,0.0,0.0,0.0,1.0
1718112874.7995758,map,True,True,5,5,0.612995793784914,0.612995793784914,1.4356780052185059,-1.4833109378814697,0.0,0.0,0.0,0.03809171907237417,0.999274243803927,3.1781365470003813,-6.548074278022618,1.004411507058855,0.0,0.0,0.0,1.0
1718112874.8990264,map,True,True,5,5,0.612995793784914,0.612995793784914,1.4356780052185059,-1.4833109378814697,0.0,0.0,0.0,0.03809171907237417,0.999274243803927,3.1781365470003813,-6.548074278022618,1.004411507058855,0.0,0.0,0.0,1.0
1718112874.9535103,map,True,True,5,5,0.612995793784914,0.612995793784914,1.4356780052185059,-1.4833109378814697,0.0,0.0,0.0,0.03809171907237417,0.999274243803927,3.1928375096651855,-6.184786282908231,1.0025604735091076,0.0,0.0,0.0,1.0
1718112875.0026906,map,True,False,5,5,0.612995793784914,0.612995793784914,1.4356780052185059,-1.4833109378814697,0.0,0.0,0.0,0.03809171907237417,0.999274243803927,3.2288987134121943,-6.30077376905116,0.7761613302910846,0.0,0.0,0.0,1.0
1718112875.0498555,map,True,False,5,5,0.612995793784914,0.612995793784914,1.5415635108947754,-1.5097997188568115,0.0,0.0,0.0,0.038354678781029584,0.999264193076396,3.2288987134121943,-6.30077376905116,0.7761613302910846,0.0,0.0,0.0,1.0
1718112875.1006749,map,True,True,5,5,0.612995793784914,0.612995793784914,1.5415635108947754,-1.5097997188568115,0.0,0.0,0.0,0.038354678781029584,0.999264193076396,3.2288987134121943,-6.30077376905116,0.7761613302910846,0.0,0.0,0.0,1.0
1718112875.2062743,map,True,True,5,5,0.612995793784914,0.612995793784914,1.5415635108947754,-1.5097997188568115,0.0,0.0,0.0,0.038354678781029584,0.999264193076396,3.2288987134121943,-6.30077376905116,0.7761613302910846,0.0,0.0,0.0,1.0
1718112875.3568785,map,True,True,5,5,0.612995793784914,0.612995793784914,1.5415635108947754,-1.5097997188568115,0.0,0.0,0.0,0.038354678781029584,0.999264193076396,3.368248451912308,-6.866875529170212,0.8271419503573175,0.0,0.0,0.0,1.0
1718112875.4056952,map,True,True,5,5,0.612995793784914,0.612995793784914,1.5415635108947754,-1.5097997188568115,0.0,0.0,0.0,0.038354678781029584,0.999264193076396,3.368248451912308,-6.866875529170212,0.8271419503573175,0.0,0.0,0.0,1.0
1718112875.4557545,map,True,False,5,5,0.612995793784914,0.612995793784914,1.5415635108947754,-1.5097997188568115,0.0,0.0,0.0,0.038354678781029584,0.999264193076396,3.368248451912308,-6.866875529170212,0.8271419503573175,0.0,0.0,0.0,1.0
1718112875.5088553,map,True,True,5,5,0.612995793784914,0.612995793784914,1.5415635108947754,-1.5097997188568115,0.0,0.0,0.0,0.038354678781029584,0.999264193076396,3.368248451912308,-6.866875529170212,0.8271419503573175,0.0,0.0,0.0,1.0
1718112875.5575686,map,True,True,5,5,0.612995793784914,0.612995793784914,1.5415635108947754,-1.5097997188568115,0.0,0.0,0.0,0.038354678781029584,0.999264193076396,3.368248451912308,-6.866875529170212,0.8271419503573175,0.0,0.0,0.0,1.0
1718112875.6224668,map,True,False,5,4,0.0,0.0,1.5415635108947754,-1.5097997188568115,0.0,0.0,0.0,0.038354678781029584,0.999264193076396,3.1968097967810474,-5.642052791664493,0.7568028409090012,0.0,0.0,0.0,1.0
1718112875.6752043,map,True,False,5,4,0.0,0.0,1.5415635108947754,-1.5097997188568115,0.0,0.0,0.0,0.038354678781029584,0.999264193076396,3.335012439479033,-5.841848019597317,0.7743329990418327,0.0,0.0,0.0,1.0
1718112875.7233438,map,True,False,5,4,0.0,0.0,1.5415635108947754,-1.5097997188568115,0.0,0.0,0.0,0.038354678781029584,0.999264193076396,3.335012439479033,-5.841848019597317,0.7743329990418327,0.0,0.0,0.0,1.0
1718112875.7734828,map,True,False,5,4,0.0,0.0,1.5748569965362549,-1.5166356563568115,0.0,0.0,0.0,0.0384424998089215,0.9992608080163251,3.335012439479033,-5.841848019597317,0.7743329990418327,0.0,0.0,0.0,1.0
1718112875.8261461,map,True,False,5,4,0.0,0.0,1.5748569965362549,-1.5166356563568115,0.0,0.0,0.0,0.0384424998089215,0.9992608080163251,3.335012439479033,-5.841848019597317,0.7743329990418327,0.0,0.0,0.0,1.0
1718112875.924076,map,True,False,5,4,0.0,0.0,1.5748569965362549,-1.5166356563568115,0.0,0.0,0.0,0.0384424998089215,0.9992608080163251,3.335012439479033,-5.841848019597317,0.7743329990418327,0.0,0.0,0.0,1.0
1718112876.0248759,map,True,False,5,3,0.0,0.0,1.5748569965362549,-1.5166356563568115,0.0,0.0,0.0,0.0384424998089215,0.9992608080163251,3.2287163494009574,-4.762846898133372,0.7317642397731285,0.0,0.0,0.0,1.0
1718112876.0749214,map,True,False,5,3,0.0,0.0,1.5748569965362549,-1.5166356563568115,0.0,0.0,0.0,0.0384424998089215,0.9992608080163251,3.2287163494009574,-4.762846898133372,0.7317642397731285,0.0,0.0,0.0,1.0
1718112876.173577,map,True,False,5,3,0.0,0.0,1.5748569965362549,-1.5166356563568115,0.0,0.0,0.0,0.0384424998089215,0.9992608080163251,3.2287163494009574,-4.762846898133372,0.7317642397731285,0.0,0.0,0.0,1.0
1718112876.2241268,map,True,False,5,3,0.0,0.0,1.5748569965362549,-1.5166356563568115,0.0,0.0,0.0,0.0384424998089215,0.9992608080163251,3.2287163494009574,-4.762846898133372,0.7317642397731285,0.0,0.0,0.0,1.0
1718112876.3226457,map,True,False,5,3,0.0,0.0,1.5748569965362549,-1.5166356563568115,0.0,0.0,0.0,0.0384424998089215,0.9992608080163251,3.289826584527555,-4.542841415643656,0.7616141336112263,0.0,0.0,0.0,1.0
1718112876.4222584,map,True,False,5,3,0.0,0.0,1.5748569965362549,-1.5166356563568115,0.0,0.0,0.0,0.0384424998089215,0.9992608080163251,3.289826584527555,-4.542841415643656,0.7616141336112263,0.0,0.0,0.0,1.0
1718112876.4741464,map,True,False,5,3,0.0,0.0,1.5748569965362549,-1.5166356563568115,0.0,0.0,0.0,0.0384424998089215,0.9992608080163251,3.289826584527555,-4.542841415643656,0.7616141336112263,0.0,0.0,0.0,1.0
1718112876.5727952,map,True,False,5,3,0.0,0.0,1.5748569965362549,-1.5166356563568115,0.0,0.0,0.0,0.0384424998089215,0.9992608080163251,3.289826584527555,-4.542841415643656,0.7616141336112263,0.0,0.0,0.0,1.0
1718112876.6254117,map,True,False,5,3,0.0,0.0,1.5748569965362549,-1.5166356563568115,0.0,0.0,0.0,0.0384424998089215,0.9992608080163251,3.3073879172902774,-4.320011722825077,0.7297007305631279,0.0,0.0,0.0,1.0
1718112876.7238533,map,True,False,5,3,0.0,0.0,1.5748569965362549,-1.5166356563568115,0.0,0.0,0.0,0.0384424998089215,0.9992608080163251,3.3820657699992136,-4.201107269371393,0.728305034940738,0.0,0.0,0.0,1.0
1718112876.7759683,map,True,False,4,3,0.0,0.0,1.7465163469314575,-1.5504945516586304,0.0,0.0,0.0,0.0379419691400983,0.9992799401654485,3.3820657699992136,-4.201107269371393,0.728305034940738,0.0,0.0,0.0,1.0
1718112876.8246026,map,True,False,4,3,0.0,0.0,1.7465163469314575,-1.5504945516586304,0.0,0.0,0.0,0.0379419691400983,0.9992799401654485,3.3820657699992136,-4.201107269371393,0.728305034940738,0.0,0.0,0.0,1.0
1718112876.875179,map,True,False,4,3,0.0,0.0,1.7465163469314575,-1.5504945516586304,0.0,0.0,0.0,0.0379419691400983,0.9992799401654485,3.3820657699992136,-4.201107269371393,0.728305034940738,0.0,0.0,0.0,1.0
1718112876.9772182,map,True,False,4,2,0.0,0.0,1.7465163469314575,-1.5504945516586304,0.0,0.0,0.0,0.0379419691400983,0.9992799401654485,3.509037158392676,-3.724798166779503,0.7024326338148578,0.0,0.0,0.0,1.0
1718112877.0273385,map,True,False,4,2,0.0,0.0,1.7465163469314575,-1.5504945516586304,0.0,0.0,0.0,0.0379419691400983,0.9992799401654485,3.5260997191631285,-3.68868572043319,0.6836539731665269,0.0,0.0,0.0,1.0
1718112877.075228,map,True,False,4,2,0.0,0.0,1.7465163469314575,-1.5504945516586304,0.0,0.0,0.0,0.0379419691400983,0.9992799401654485,3.5260997191631285,-3.68868572043319,0.6836539731665269,0.0,0.0,0.0,1.0
1718112877.1324685,map,True,False,4,2,0.0,0.0,1.7465163469314575,-1.5504945516586304,0.0,0.0,0.0,0.0379419691400983,0.9992799401654485,3.5260997191631285,-3.68868572043319,0.6836539731665269,0.0,0.0,0.0,1.0
1718112877.22735,map,True,False,4,2,0.0,0.0,1.7465163469314575,-1.5504945516586304,0.0,0.0,0.0,0.0379419691400983,0.9992799401654485,3.5260997191631285,-3.68868572043319,0.6836539731665269,0.0,0.0,0.0,1.0
1718112877.3845048,map,True,False,4,2,0.0,0.0,1.7465163469314575,-1.5504945516586304,0.0,0.0,0.0,0.0379419691400983,0.9992799401654485,3.5701064149709536,-3.3739470019234084,0.6828118456038744,0.0,0.0,0.0,1.0
1718112877.4361439,map,True,False,4,2,0.0,0.0,1.7465163469314575,-1.5504945516586304,0.0,0.0,0.0,0.0379419691400983,0.9992799401654485,3.5701064149709536,-3.3739470019234084,0.6828118456038744,0.0,0.0,0.0,1.0
1718112877.4839349,map,True,False,4,2,0.0,0.0,1.7465163469314575,-1.5504945516586304,0.0,0.0,0.0,0.0379419691400983,0.9992799401654485,3.5701064149709536,-3.3739470019234084,0.6828118456038744,0.0,0.0,0.0,1.0
1718112877.537774,map,True,False,4,2,0.0,0.0,1.7465163469314575,-1.5504945516586304,0.0,0.0,0.0,0.0379419691400983,0.9992799401654485,3.5701064149709536,-3.3739470019234084,0.6828118456038744,0.0,0.0,0.0,1.0
1718112877.5884078,map,True,False,4,2,0.0,0.0,1.7465163469314575,-1.5504945516586304,0.0,0.0,0.0,0.0379419691400983,0.9992799401654485,3.5701064149709536,-3.3739470019234084,0.6828118456038744,0.0,0.0,0.0,1.0
1718112877.6911254,map,True,False,4,2,0.0,0.0,1.7465163469314575,-1.5504945516586304,0.0,0.0,0.0,0.0379419691400983,0.9992799401654485,3.769969609791188,-3.0624297377457714,0.6816003075231538,0.0,0.0,0.0,1.0
1718112877.7432022,map,True,False,4,2,0.0,0.0,1.7465163469314575,-1.5504945516586304,0.0,0.0,0.0,0.0379419691400983,0.9992799401654485,3.769969609791188,-3.0624297377457714,0.6816003075231538,0.0,0.0,0.0,1.0
1718112877.7916412,map,True,False,4,2,0.0,0.0,1.7465163469314575,-1.5504945516586304,0.0,0.0,0.0,0.0379419691400983,0.9992799401654485,3.769969609791188,-3.0624297377457714,0.6816003075231538,0.0,0.0,0.0,1.0
1718112877.8414602,map,True,False,4,2,0.0,0.0,1.8895390033721924,-1.5751579999923706,0.0,0.0,0.0,0.038092469536446696,0.9992742139799593,3.769969609791188,-3.0624297377457714,0.6816003075231538,0.0,0.0,0.0,1.0
1718112877.8916173,map,True,False,4,2,0.0,0.0,1.8895390033721924,-1.5751579999923706,0.0,0.0,0.0,0.038092469536446696,0.9992742139799593,3.769969609791188,-3.0624297377457714,0.6816003075231538,0.0,0.0,0.0,1.0
1718112877.99373,map,True,False,4,1,0.0,0.0,1.8895390033721924,-1.5751579999923706,0.0,0.0,0.0,0.038092469536446696,0.9992742139799593,3.8375938499301854,-2.543566899296847,0.6802541672434497,0.0,0.0,0.0,1.0
1718112878.0943966,map,True,False,4,1,0.0,0.0,1.8895390033721924,-1.5751579999923706,0.0,0.0,0.0,0.038092469536446696,0.9992742139799593,3.950838308342621,-2.4565093605869732,0.6819711314694359,0.0,0.0,0.0,1.0
1718112878.1538482,map,True,False,4,1,0.0,0.0,1.8895390033721924,-1.5751579999923706,0.0,0.0,0.0,0.038092469536446696,0.9992742139799593,3.950838308342621,-2.4565093605869732,0.6819711314694359,0.0,0.0,0.0,1.0
1718112878.2056835,map,True,False,4,1,0.0,0.0,1.8895390033721924,-1.5751579999923706,0.0,0.0,0.0,0.038092469536446696,0.9992742139799593,3.950838308342621,-2.4565093605869732,0.6819711314694359,0.0,0.0,0.0,1.0
1718112878.402399,map,True,False,4,1,0.0,0.0,1.8895390033721924,-1.5751579999923706,0.0,0.0,0.0,0.038092469536446696,0.9992742139799593,3.941663752798857,-2.2211478463146594,0.6811764144202633,0.0,0.0,0.0,1.0
1718112878.452504,map,True,False,4,1,0.0,0.0,1.8895390033721924,-1.5751579999923706,0.0,0.0,0.0,0.038092469536446696,0.9992742139799593,3.941663752798857,-2.2211478463146594,0.6811764144202633,0.0,0.0,0.0,1.0
1718112878.504483,map,True,False,4,1,0.0,0.0,1.9085943698883057,-1.5731362104415894,0.0,0.0,0.0,0.03874210178758883,0.9992492360944121,3.941663752798857,-2.2211478463146594,0.6811764144202633,0.0,0.0,0.0,1.0
1718112878.6085052,map,True,False,4,1,0.0,0.0,1.9085943698883057,-1.5731362104415894,0.0,0.0,0.0,0.03874210178758883,0.9992492360944121,3.941663752798857,-2.2211478463146594,0.6811764144202633,0.0,0.0,0.0,1.0
1718112878.6592984,map,True,False,4,1,0.0,0.0,1.9085943698883057,-1.5731362104415894,0.0,0.0,0.0,0.03874210178758883,0.9992492360944121,3.941663752798857,-2.2211478463146594,0.6811764144202633,0.0,0.0,0.0,1.0
1718112878.7586687,map,True,False,4,1,0.0,0.0,1.9085943698883057,-1.5731362104415894,0.0,0.0,0.0,0.03874210178758883,0.9992492360944121,3.941663752798857,-2.2211478463146594,0.6811764144202633,0.0,0.0,0.0,1.0
1718112878.8087964,map,True,False,4,1,0.0,0.0,1.9085943698883057,-1.5731362104415894,0.0,0.0,0.0,0.03874210178758883,0.9992492360944121,3.941663752798857,-2.2211478463146594,0.6811764144202633,0.0,0.0,0.0,1.0
1718112878.8598802,map,True,False,4,1,0.0,0.0,1.9085943698883057,-1.5731362104415894,0.0,0.0,0.0,0.03874210178758883,0.9992492360944121,3.941663752798857,-2.2211478463146594,0.6811764144202633,0.0,0.0,0.0,1.0
1718112878.9099948,map,True,False,4,1,0.0,0.0,1.9085943698883057,-1.5731362104415894,0.0,0.0,0.0,0.03874210178758883,0.9992492360944121,3.941663752798857,-2.2211478463146594,0.6811764144202633,0.0,0.0,0.0,1.0
1718112878.9605136,map,True,False,4,1,0.0,0.0,1.9085943698883057,-1.5731362104415894,0.0,0.0,0.0,0.03874210178758883,0.9992492360944121,3.941663752798857,-2.2211478463146594,0.6811764144202633,0.0,0.0,0.0,1.0
1718112879.0110211,map,True,False,4,1,0.0,0.0,1.9085943698883057,-1.5731362104415894,0.0,0.0,0.0,0.03874210178758883,0.9992492360944121,3.941663752798857,-2.2211478463146594,0.6811764144202633,0.0,0.0,0.0,1.0
1718112879.0614405,map,True,False,3,1,0.0,0.0,2.1686785221099854,-1.6564016342163086,0.0,0.0,0.0,0.03916874739402082,0.9992326086781815,3.941663752798857,-2.2211478463146594,0.6811764144202633,0.0,0.0,0.0,1.0
1718112879.111764,map,True,False,3,1,0.0,0.0,2.1686785221099854,-1.6564016342163086,0.0,0.0,0.0,0.03916874739402082,0.9992326086781815,3.941663752798857,-2.2211478463146594,0.6811764144202633,0.0,0.0,0.0,1.0
1718112879.161921,map,True,False,3,1,0.0,0.0,2.1686785221099854,-1.6564016342163086,0.0,0.0,0.0,0.03916874739402082,0.9992326086781815,3.941663752798857,-2.2211478463146594,0.6811764144202633,0.0,0.0,0.0,1.0
