timestamp_sec,frame_id,game_played,yielding,player1discrete,player2discrete,player1yieldprob,player2yieldprob,player1_pose_x,player1_pose_y,player1_pose_z,player1_pose_orient_x,player1_pose_orient_y,player1_pose_orient_z,player1_pose_orient_w,player2_pose_x,player2_pose_y,player2_pose_z,player2_pose_orient_x,player2_pose_orient_y,player2_pose_orient_z,player2_pose_orient_w
1718105846.6690407,map,True,True,4,4,0.5922520728754596,0.5922520728754596,1.9662365913391113,-1.6809946298599243,0.0,0.0,0.0,0.0667810437450273,0.9977676538508041,3.6665688510042242,-5.106886615405722,0.8822158820401604,0.0,0.0,0.0,1.0
1718105846.7686512,map,True,True,4,4,0.5922520728754596,0.5922520728754596,1.9662365913391113,-1.6809946298599243,0.0,0.0,0.0,0.0667810437450273,0.9977676538508041,3.6665688510042242,-5.106886615405722,0.8822158820401604,0.0,0.0,0.0,1.0
1718105846.9197235,map,True,True,3,3,0.6616527499769684,0.6616527499769684,2.0657958984375,-1.7001525163650513,0.0,0.0,0.0,0.06703895965781877,0.9977503595497288,3.6605587909833623,-4.758801681175657,0.9285459509092221,0.0,0.0,0.0,1.0
1718105846.971046,map,True,True,3,3,0.6616527499769684,0.6616527499769684,2.0657958984375,-1.7001525163650513,0.0,0.0,0.0,0.06703895965781877,0.9977503595497288,3.6292514258879596,-4.5847160346540425,0.7987403046900642,0.0,0.0,0.0,1.0
1718105847.0202925,map,True,True,3,3,0.6616527499769684,0.6616527499769684,2.0657958984375,-1.7001525163650513,0.0,0.0,0.0,0.06703895965781877,0.9977503595497288,3.6292514258879596,-4.5847160346540425,0.7987403046900642,0.0,0.0,0.0,1.0
1718105847.1217582,map,True,True,3,3,0.6616527499769684,0.6616527499769684,2.0657958984375,-1.7001525163650513,0.0,0.0,0.0,0.06703895965781877,0.9977503595497288,3.6292514258879596,-4.5847160346540425,0.7987403046900642,0.0,0.0,0.0,1.0
1718105847.221822,map,True,True,3,3,0.6616527499769684,0.6616527499769684,2.0657958984375,-1.7001525163650513,0.0,0.0,0.0,0.06703895965781877,0.9977503595497288,3.6292514258879596,-4.5847160346540425,0.7987403046900642,0.0,0.0,0.0,1.0
1718105847.3202224,map,True,False,3,3,0.6616527499769684,0.6616527499769684,2.0657958984375,-1.7001525163650513,0.0,0.0,0.0,0.06703895965781877,0.9977503595497288,3.7367076269123114,-4.65480022256263,0.709744463331454,0.0,0.0,0.0,1.0
1718105847.3720198,map,True,True,3,3,0.6616527499769684,0.6616527499769684,2.0657958984375,-1.7001525163650513,0.0,0.0,0.0,0.06703895965781877,0.9977503595497288,3.7367076269123114,-4.65480022256263,0.709744463331454,0.0,0.0,0.0,1.0
1718105847.4210691,map,True,True,3,3,0.6616527499769684,0.6616527499769684,2.0657958984375,-1.7001525163650513,0.0,0.0,0.0,0.06703895965781877,0.9977503595497288,3.7367076269123114,-4.65480022256263,0.709744463331454,0.0,0.0,0.0,1.0
1718105847.4719589,map,True,False,3,3,0.6616527499769684,0.6616527499769684,2.166799783706665,-1.716038465499878,0.0,0.0,0.0,0.06740351160208534,0.997725791568648,3.7367076269123114,-4.65480022256263,0.709744463331454,0.0,0.0,0.0,1.0
1718105847.5219145,map,True,True,3,3,0.6616527499769684,0.6616527499769684,2.166799783706665,-1.716038465499878,0.0,0.0,0.0,0.06740351160208534,0.997725791568648,3.7367076269123114,-4.65480022256263,0.709744463331454,0.0,0.0,0.0,1.0
1718105847.5723095,map,True,True,3,3,0.6616527499769684,0.6616527499769684,2.166799783706665,-1.716038465499878,0.0,0.0,0.0,0.06740351160208534,0.997725791568648,3.7367076269123114,-4.65480022256263,0.709744463331454,0.0,0.0,0.0,1.0
1718105847.6724699,map,True,True,3,3,0.6616527499769684,0.6616527499769684,2.166799783706665,-1.716038465499878,0.0,0.0,0.0,0.06740351160208534,0.997725791568648,3.730470356637585,-4.217622295175203,0.7215097480509488,0.0,0.0,0.0,1.0
1718105847.724671,map,True,False,3,3,0.6616527499769684,0.6616527499769684,2.166799783706665,-1.716038465499878,0.0,0.0,0.0,0.06740351160208534,0.997725791568648,3.730470356637585,-4.217622295175203,0.7215097480509488,0.0,0.0,0.0,1.0
1718105847.9232016,map,True,False,3,3,0.6616527499769684,0.6616527499769684,2.166799783706665,-1.716038465499878,0.0,0.0,0.0,0.06740351160208534,0.997725791568648,3.744922445369418,-4.062524348596688,0.7002870682445552,0.0,0.0,0.0,1.0
1718105847.9733174,map,True,False,3,3,0.6616527499769684,0.6616527499769684,2.166799783706665,-1.716038465499878,0.0,0.0,0.0,0.06740351160208534,0.997725791568648,3.7256981082606484,-3.941385913928474,0.685011845021454,0.0,0.0,0.0,1.0
1718105848.0237308,map,True,False,3,2,0.0,0.0,2.166799783706665,-1.716038465499878,0.0,0.0,0.0,0.06740351160208534,0.997725791568648,3.702099833680864,-3.832542494446898,0.6881916904372214,0.0,0.0,0.0,1.0
1718105848.074186,map,True,False,3,2,0.0,0.0,2.166799783706665,-1.716038465499878,0.0,0.0,0.0,0.06740351160208534,0.997725791568648,3.702099833680864,-3.832542494446898,0.6881916904372214,0.0,0.0,0.0,1.0
1718105848.1240726,map,True,False,3,2,0.0,0.0,2.240537166595459,-1.7373979091644287,0.0,0.0,0.0,0.06873432560095706,0.9976349968016812,3.702099833680864,-3.832542494446898,0.6881916904372214,0.0,0.0,0.0,1.0
1718105848.2260368,map,True,False,3,2,0.0,0.0,2.240537166595459,-1.7373979091644287,0.0,0.0,0.0,0.06873432560095706,0.9976349968016812,3.702099833680864,-3.832542494446898,0.6881916904372214,0.0,0.0,0.0,1.0
1718105848.3244815,map,True,False,3,2,0.0,0.0,2.240537166595459,-1.7373979091644287,0.0,0.0,0.0,0.06873432560095706,0.9976349968016812,3.686347251112439,-3.652654937640236,0.6875235048379766,0.0,0.0,0.0,1.0
1718105848.3746202,map,True,False,3,2,0.0,0.0,2.240537166595459,-1.7373979091644287,0.0,0.0,0.0,0.06873432560095706,0.9976349968016812,3.680820937850567,-3.6134627009437583,0.6873758386370328,0.0,0.0,0.0,1.0
1718105848.4245296,map,True,False,3,2,0.0,0.0,2.240537166595459,-1.7373979091644287,0.0,0.0,0.0,0.06873432560095706,0.9976349968016812,3.680820937850567,-3.6134627009437583,0.6873758386370328,0.0,0.0,0.0,1.0
1718105848.4753654,map,True,False,3,2,0.0,0.0,2.240537166595459,-1.7373979091644287,0.0,0.0,0.0,0.06873432560095706,0.9976349968016812,3.680820937850567,-3.6134627009437583,0.6873758386370328,0.0,0.0,0.0,1.0
1718105848.5255334,map,True,False,3,2,0.0,0.0,2.240537166595459,-1.7373979091644287,0.0,0.0,0.0,0.06873432560095706,0.9976349968016812,3.680820937850567,-3.6134627009437583,0.6873758386370328,0.0,0.0,0.0,1.0
1718105848.6315312,map,True,False,3,2,0.0,0.0,2.240537166595459,-1.7373979091644287,0.0,0.0,0.0,0.06873432560095706,0.9976349968016812,3.680820937850567,-3.6134627009437583,0.6873758386370328,0.0,0.0,0.0,1.0
1718105848.708752,map,True,False,3,2,0.0,0.0,2.240537166595459,-1.7373979091644287,0.0,0.0,0.0,0.06873432560095706,0.9976349968016812,3.7025002880770224,-3.3757046843842726,0.6837443962979369,0.0,0.0,0.0,1.0
1718105848.7873447,map,True,False,3,2,0.0,0.0,2.3074147701263428,-1.754417896270752,0.0,0.0,0.0,0.06947681506428792,0.9975835691547399,3.728320000502508,-3.298849761090035,0.6834975056979655,0.0,0.0,0.0,1.0
1718105849.0922506,map,True,False,3,2,0.0,0.0,2.3074147701263428,-1.754417896270752,0.0,0.0,0.0,0.06947681506428792,0.9975835691547399,3.7308975983093378,-3.1581168949469323,0.6856062005234056,0.0,0.0,0.0,1.0
1718105849.1487277,map,True,False,3,2,0.0,0.0,2.3074147701263428,-1.754417896270752,0.0,0.0,0.0,0.06947681506428792,0.9975835691547399,3.7319382198236806,-3.1470532146772707,0.6855605379324345,0.0,0.0,0.0,1.0
1718105849.2436726,map,True,False,3,2,0.0,0.0,2.3074147701263428,-1.754417896270752,0.0,0.0,0.0,0.06947681506428792,0.9975835691547399,3.7319382198236806,-3.1470532146772707,0.6855605379324345,0.0,0.0,0.0,1.0
1718105849.342154,map,True,False,3,2,0.0,0.0,2.3074147701263428,-1.754417896270752,0.0,0.0,0.0,0.06947681506428792,0.9975835691547399,3.7319382198236806,-3.1470532146772707,0.6855605379324345,0.0,0.0,0.0,1.0
1718105849.396579,map,True,False,2,2,0.49874686716791977,0.49874686716791977,2.3986408710479736,-1.768530011177063,0.0,0.0,0.0,0.0701825356084281,0.9975341704259427,3.764435858278119,-3.0514291126691377,0.6852178681013434,0.0,0.0,0.0,1.0
1718105849.448806,map,True,True,2,2,0.49874686716791977,0.49874686716791977,2.3986408710479736,-1.768530011177063,0.0,0.0,0.0,0.0701825356084281,0.9975341704259427,3.7548550103527716,-2.968777938793896,0.6849235251201153,0.0,0.0,0.0,1.0
1718105849.547079,map,True,True,2,2,0.49874686716791977,0.49874686716791977,2.3986408710479736,-1.768530011177063,0.0,0.0,0.0,0.0701825356084281,0.9975341704259427,3.7548550103527716,-2.968777938793896,0.6849235251201153,0.0,0.0,0.0,1.0
1718105849.5969954,map,True,False,2,2,0.49874686716791977,0.49874686716791977,2.3986408710479736,-1.768530011177063,0.0,0.0,0.0,0.0701825356084281,0.9975341704259427,3.7548550103527716,-2.968777938793896,0.6849235251201153,0.0,0.0,0.0,1.0
1718105849.6474333,map,True,False,2,2,0.49874686716791977,0.49874686716791977,2.3986408710479736,-1.768530011177063,0.0,0.0,0.0,0.0701825356084281,0.9975341704259427,3.7548550103527716,-2.968777938793896,0.6849235251201153,0.0,0.0,0.0,1.0
1718105849.6975622,map,True,True,2,2,0.49874686716791977,0.49874686716791977,2.3986408710479736,-1.768530011177063,0.0,0.0,0.0,0.0701825356084281,0.9975341704259427,3.7548550103527716,-2.968777938793896,0.6849235251201153,0.0,0.0,0.0,1.0
1718105849.797836,map,True,True,2,2,0.49874686716791977,0.49874686716791977,2.421041488647461,-1.7764431238174438,0.0,0.0,0.0,0.07044333704399325,0.9975157815836873,3.713868582511793,-2.8494384423826125,0.6845333564309553,0.0,0.0,0.0,1.0
1718105850.1015093,map,True,True,2,2,0.49874686716791977,0.49874686716791977,2.421041488647461,-1.7764431238174438,0.0,0.0,0.0,0.07044333704399325,0.9975157815836873,3.779458909175247,-2.8718001372003394,0.6826315037036821,0.0,0.0,0.0,1.0
1718105850.1504967,map,True,False,2,2,0.49874686716791977,0.49874686716791977,2.421041488647461,-1.7764431238174438,0.0,0.0,0.0,0.07044333704399325,0.9975157815836873,3.779458909175247,-2.8718001372003394,0.6826315037036821,0.0,0.0,0.0,1.0
1718105850.2007167,map,True,False,2,2,0.49874686716791977,0.49874686716791977,2.421041488647461,-1.7764431238174438,0.0,0.0,0.0,0.07044333704399325,0.9975157815836873,3.779458909175247,-2.8718001372003394,0.6826315037036821,0.0,0.0,0.0,1.0
1718105850.2516644,map,True,False,2,2,0.49874686716791977,0.49874686716791977,2.421041488647461,-1.7764431238174438,0.0,0.0,0.0,0.07044333704399325,0.9975157815836873,3.779458909175247,-2.8718001372003394,0.6826315037036821,0.0,0.0,0.0,1.0
1718105850.3513844,map,True,False,2,2,0.49874686716791977,0.49874686716791977,2.421041488647461,-1.7764431238174438,0.0,0.0,0.0,0.07044333704399325,0.9975157815836873,3.779458909175247,-2.8718001372003394,0.6826315037036821,0.0,0.0,0.0,1.0
1718105850.4519303,map,True,False,2,2,0.49874686716791977,0.49874686716791977,2.540017604827881,-1.7907791137695312,0.0,0.0,0.0,0.0709023115590838,0.997483260437325,3.79895368608755,-2.779214635781659,0.6841275906053137,0.0,0.0,0.0,1.0
1718105850.502218,map,True,True,2,2,0.49874686716791977,0.49874686716791977,2.540017604827881,-1.7907791137695312,0.0,0.0,0.0,0.0709023115590838,0.997483260437325,3.79895368608755,-2.779214635781659,0.6841275906053137,0.0,0.0,0.0,1.0
1718105850.6035225,map,True,False,2,2,0.49874686716791977,0.49874686716791977,2.540017604827881,-1.7907791137695312,0.0,0.0,0.0,0.0709023115590838,0.997483260437325,3.79895368608755,-2.779214635781659,0.6841275906053137,0.0,0.0,0.0,1.0
1718105850.6523194,map,True,True,2,2,0.49874686716791977,0.49874686716791977,2.540017604827881,-1.7907791137695312,0.0,0.0,0.0,0.0709023115590838,0.997483260437325,3.79895368608755,-2.779214635781659,0.6841275906053137,0.0,0.0,0.0,1.0
1718105850.7030652,map,True,False,2,2,0.49874686716791977,0.49874686716791977,2.540017604827881,-1.7907791137695312,0.0,0.0,0.0,0.0709023115590838,0.997483260437325,3.79895368608755,-2.779214635781659,0.6841275906053137,0.0,0.0,0.0,1.0
1718105850.8028073,map,True,False,2,2,0.49874686716791977,0.49874686716791977,2.540017604827881,-1.7907791137695312,0.0,0.0,0.0,0.0709023115590838,0.997483260437325,3.8683562819458293,-2.863862632757648,0.6843715482599197,0.0,0.0,0.0,1.0
1718105851.1032822,map,True,False,2,2,0.49874686716791977,0.49874686716791977,2.679203987121582,-1.8460452556610107,0.0,0.0,0.0,0.07366160436577286,0.9972833000556258,3.89218272990373,-2.8695240692401534,0.6843828808040624,0.0,0.0,0.0,1.0
1718105851.1548777,map,True,True,2,2,0.49874686716791977,0.49874686716791977,2.679203987121582,-1.8460452556610107,0.0,0.0,0.0,0.07366160436577286,0.9972833000556258,3.89218272990373,-2.8695240692401534,0.6843828808040624,0.0,0.0,0.0,1.0
1718105851.2044625,map,True,False,2,2,0.49874686716791977,0.49874686716791977,2.679203987121582,-1.8460452556610107,0.0,0.0,0.0,0.07366160436577286,0.9972833000556258,3.89218272990373,-2.8695240692401534,0.6843828808040624,0.0,0.0,0.0,1.0
1718105851.3035047,map,True,False,2,2,0.49874686716791977,0.49874686716791977,2.679203987121582,-1.8460452556610107,0.0,0.0,0.0,0.07366160436577286,0.9972833000556258,3.89218272990373,-2.8695240692401534,0.6843828808040624,0.0,0.0,0.0,1.0
1718105851.4037461,map,True,True,2,2,0.49874686716791977,0.49874686716791977,2.744490623474121,-1.8610087633132935,0.0,0.0,0.0,0.07505026167873707,0.9971797483281,3.916985698690562,-2.8568445251973755,0.6843311883682537,0.0,0.0,0.0,1.0
1718105851.4558144,map,True,True,2,2,0.49874686716791977,0.49874686716791977,2.744490623474121,-1.8610087633132935,0.0,0.0,0.0,0.07505026167873707,0.9971797483281,3.9186464334820164,-2.8625920418979653,0.6843517176949507,0.0,0.0,0.0,1.0
1718105851.5051928,map,True,False,2,2,0.49874686716791977,0.49874686716791977,2.744490623474121,-1.8610087633132935,0.0,0.0,0.0,0.07505026167873707,0.9971797483281,3.9186464334820164,-2.8625920418979653,0.6843517176949507,0.0,0.0,0.0,1.0
1718105851.6087265,map,True,True,2,2,0.49874686716791977,0.49874686716791977,2.744490623474121,-1.8610087633132935,0.0,0.0,0.0,0.07505026167873707,0.9971797483281,3.9186464334820164,-2.8625920418979653,0.6843517176949507,0.0,0.0,0.0,1.0
1718105851.6628475,map,True,False,2,2,0.49874686716791977,0.49874686716791977,2.744490623474121,-1.8610087633132935,0.0,0.0,0.0,0.07505026167873707,0.9971797483281,3.9186464334820164,-2.8625920418979653,0.6843517176949507,0.0,0.0,0.0,1.0
1718105851.7087154,map,True,False,2,2,0.49874686716791977,0.49874686716791977,2.744490623474121,-1.8610087633132935,0.0,0.0,0.0,0.07505026167873707,0.9971797483281,3.9186464334820164,-2.8625920418979653,0.6843517176949507,0.0,0.0,0.0,1.0
1718105852.108634,map,True,False,1,2,0.0,0.0,2.8304972648620605,-1.8761301040649414,0.0,0.0,0.0,0.07628705120085666,0.9970858999560158,3.953499355246653,-2.7819052050493887,0.7771406033475934,0.0,0.0,0.0,1.0
1718105852.159168,map,True,False,1,2,0.0,0.0,2.8304972648620605,-1.8761301040649414,0.0,0.0,0.0,0.07628705120085666,0.9970858999560158,3.953499355246653,-2.7819052050493887,0.7771406033475934,0.0,0.0,0.0,1.0
1718105852.2097867,map,True,False,1,2,0.0,0.0,2.8304972648620605,-1.8761301040649414,0.0,0.0,0.0,0.07628705120085666,0.9970858999560158,3.953499355246653,-2.7819052050493887,0.7771406033475934,0.0,0.0,0.0,1.0
1718105852.2747924,map,True,False,1,2,0.0,0.0,2.8304972648620605,-1.8761301040649414,0.0,0.0,0.0,0.07628705120085666,0.9970858999560158,3.953499355246653,-2.7819052050493887,0.7771406033475934,0.0,0.0,0.0,1.0
1718105852.321189,map,True,False,1,2,0.0,0.0,2.8304972648620605,-1.8761301040649414,0.0,0.0,0.0,0.07628705120085666,0.9970858999560158,3.953499355246653,-2.7819052050493887,0.7771406033475934,0.0,0.0,0.0,1.0
1718105852.371942,map,True,False,1,2,0.0,0.0,2.8304972648620605,-1.8761301040649414,0.0,0.0,0.0,0.07628705120085666,0.9970858999560158,3.953499355246653,-2.7819052050493887,0.7771406033475934,0.0,0.0,0.0,1.0
1718105852.4727943,map,True,False,1,2,0.0,0.0,2.8304972648620605,-1.8761301040649414,0.0,0.0,0.0,0.07628705120085666,0.9970858999560158,3.953499355246653,-2.7819052050493887,0.7771406033475934,0.0,0.0,0.0,1.0
1718105852.522899,map,True,False,1,2,0.0,0.0,2.8304972648620605,-1.8761301040649414,0.0,0.0,0.0,0.07628705120085666,0.9970858999560158,3.953499355246653,-2.7819052050493887,0.7771406033475934,0.0,0.0,0.0,1.0
1718105852.5739334,map,True,False,1,2,0.0,0.0,2.8304972648620605,-1.8761301040649414,0.0,0.0,0.0,0.07628705120085666,0.9970858999560158,3.953499355246653,-2.7819052050493887,0.7771406033475934,0.0,0.0,0.0,1.0
1718105852.6238756,map,True,False,1,2,0.0,0.0,2.8304972648620605,-1.8761301040649414,0.0,0.0,0.0,0.07628705120085666,0.9970858999560158,3.953499355246653,-2.7819052050493887,0.7771406033475934,0.0,0.0,0.0,1.0
1718105852.7231932,map,True,False,1,2,0.0,0.0,2.921992778778076,-1.9155820608139038,0.0,0.0,0.0,0.07955660034260416,0.996830357475752,3.953499355246653,-2.7819052050493887,0.7771406033475934,0.0,0.0,0.0,1.0
1718105852.7732377,map,True,False,1,2,0.0,0.0,2.921992778778076,-1.9155820608139038,0.0,0.0,0.0,0.07955660034260416,0.996830357475752,3.953499355246653,-2.7819052050493887,0.7771406033475934,0.0,0.0,0.0,1.0
