timestamp_sec,frame_id,game_played,yielding,player1discrete,player2discrete,player1yieldprob,player2yieldprob,player1_pose_x,player1_pose_y,player1_pose_z,player1_pose_orient_x,player1_pose_orient_y,player1_pose_orient_z,player1_pose_orient_w,player2_pose_x,player2_pose_y,player2_pose_z,player2_pose_orient_x,player2_pose_orient_y,player2_pose_orient_z,player2_pose_orient_w
1717767113.1817997,map,True,False,6,5,0.0,0.0,2.076061725616455,-2.6440951824188232,0.0,0.0,0.0,0.05105608532781064,0.9986957896515413,3.959804513336656,-7.024494596782396,0.6755067429507124,0.0,0.0,0.0,1.0
1717767113.2795484,map,True,False,6,5,0.0,0.0,2.076061725616455,-2.6440951824188232,0.0,0.0,0.0,0.05105608532781064,0.9986957896515413,3.959804513336656,-7.024494596782396,0.6755067429507124,0.0,0.0,0.0,1.0
1717767113.336263,map,True,False,6,5,0.0,0.0,2.076061725616455,-2.6440951824188232,0.0,0.0,0.0,0.05105608532781064,0.9986957896515413,3.959804513336656,-7.024494596782396,0.6755067429507124,0.0,0.0,0.0,1.0
1717767113.430985,map,True,False,6,5,0.0,0.0,2.076061725616455,-2.6440951824188232,0.0,0.0,0.0,0.05105608532781064,0.9986957896515413,3.959804513336656,-7.024494596782396,0.6755067429507124,0.0,0.0,0.0,1.0
1717767113.4831293,map,True,False,6,5,0.0,0.0,2.076061725616455,-2.6440951824188232,0.0,0.0,0.0,0.05105608532781064,0.9986957896515413,3.962505411894111,-7.0344270279649725,0.6754929130998735,0.0,0.0,0.0,1.0
1717767113.5785832,map,True,False,6,5,0.0,0.0,2.076061725616455,-2.6440951824188232,0.0,0.0,0.0,0.05105608532781064,0.9986957896515413,3.9769465847924224,-7.094539810962749,0.6754272213083861,0.0,0.0,0.0,1.0
1717767113.6289704,map,True,False,6,5,0.0,0.0,2.076061725616455,-2.6440951824188232,0.0,0.0,0.0,0.05105608532781064,0.9986957896515413,3.9769465847924224,-7.094539810962749,0.6754272213083861,0.0,0.0,0.0,1.0
1717767113.678826,map,True,False,6,5,0.0,0.0,2.076061725616455,-2.6440951824188232,0.0,0.0,0.0,0.05105608532781064,0.9986957896515413,3.9769465847924224,-7.094539810962749,0.6754272213083861,0.0,0.0,0.0,1.0
1717767113.7301953,map,True,False,6,5,0.0,0.0,2.07785701751709,-2.6414687633514404,0.0,0.0,0.0,0.050831539841309954,0.9987072486225927,3.9769465847924224,-7.094539810962749,0.6754272213083861,0.0,0.0,0.0,1.0
1717767113.8307202,map,True,False,6,5,0.0,0.0,2.07785701751709,-2.6414687633514404,0.0,0.0,0.0,0.050831539841309954,0.9987072486225927,4.000059263228087,-7.0791583702089955,0.6683506017026108,0.0,0.0,0.0,1.0
1717767114.1827102,map,True,False,6,5,0.0,0.0,2.07785701751709,-2.6414687633514404,0.0,0.0,0.0,0.050831539841309954,0.9987072486225927,4.098457976741983,-7.118009922292435,0.6606518621783086,0.0,0.0,0.0,1.0
1717767114.2326603,map,True,False,6,5,0.0,0.0,2.07785701751709,-2.6414687633514404,0.0,0.0,0.0,0.050831539841309954,0.9987072486225927,4.098457976741983,-7.118009922292435,0.6606518621783086,0.0,0.0,0.0,1.0
1717767114.236728,map,True,False,6,5,0.0,0.0,2.07785701751709,-2.6414687633514404,0.0,0.0,0.0,0.050831539841309954,0.9987072486225927,4.098457976741983,-7.118009922292435,0.6606518621783086,0.0,0.0,0.0,1.0
1717767114.2411618,map,True,False,6,5,0.0,0.0,2.07785701751709,-2.6414687633514404,0.0,0.0,0.0,0.050831539841309954,0.9987072486225927,4.098457976741983,-7.118009922292435,0.6606518621783086,0.0,0.0,0.0,1.0
1717767114.245519,map,True,False,6,5,0.0,0.0,2.07785701751709,-2.6414687633514404,0.0,0.0,0.0,0.050831539841309954,0.9987072486225927,4.098457976741983,-7.118009922292435,0.6606518621783086,0.0,0.0,0.0,1.0
1717767114.2959285,map,True,False,6,5,0.0,0.0,2.07785701751709,-2.6414687633514404,0.0,0.0,0.0,0.050831539841309954,0.9987072486225927,4.098457976741983,-7.118009922292435,0.6606518621783086,0.0,0.0,0.0,1.0
1717767114.3473155,map,True,False,6,5,0.0,0.0,2.0773110389709473,-2.6425888538360596,0.0,0.0,0.0,0.05089137750260082,0.9987041899257356,4.098457976741983,-7.118009922292435,0.6606518621783086,0.0,0.0,0.0,1.0
1717767114.3972936,map,True,False,6,5,0.0,0.0,2.0773110389709473,-2.6425888538360596,0.0,0.0,0.0,0.05089137750260082,0.9987041899257356,4.098457976741983,-7.118009922292435,0.6606518621783086,0.0,0.0,0.0,1.0
1717767114.4507265,map,True,False,6,5,0.0,0.0,2.0773110389709473,-2.6425888538360596,0.0,0.0,0.0,0.05089137750260082,0.9987041899257356,4.098457976741983,-7.118009922292435,0.6606518621783086,0.0,0.0,0.0,1.0
1717767114.5478864,map,True,False,6,5,0.0,0.0,2.0773110389709473,-2.6425888538360596,0.0,0.0,0.0,0.05089137750260082,0.9987041899257356,4.194909097025122,-6.837143429729913,0.6539233118671217,0.0,0.0,0.0,1.0
1717767114.6492608,map,True,False,6,5,0.0,0.0,2.0773110389709473,-2.6425888538360596,0.0,0.0,0.0,0.05089137750260082,0.9987041899257356,4.194909097025122,-6.837143429729913,0.6539233118671217,0.0,0.0,0.0,1.0
1717767114.7000217,map,True,False,6,5,0.0,0.0,2.0773110389709473,-2.6425888538360596,0.0,0.0,0.0,0.05089137750260082,0.9987041899257356,4.194909097025122,-6.837143429729913,0.6539233118671217,0.0,0.0,0.0,1.0
1717767114.7979069,map,True,False,6,5,0.0,0.0,2.0773110389709473,-2.6425888538360596,0.0,0.0,0.0,0.05089137750260082,0.9987041899257356,4.194909097025122,-6.837143429729913,0.6539233118671217,0.0,0.0,0.0,1.0
1717767114.8485007,map,True,False,6,4,0.0,0.0,2.0773110389709473,-2.6425888538360596,0.0,0.0,0.0,0.05089137750260082,0.9987041899257356,4.187234433549852,-6.668470379858849,0.641573953591253,0.0,0.0,0.0,1.0
1717767115.2015142,map,True,False,6,4,0.0,0.0,2.0769169330596924,-2.646890163421631,0.0,0.0,0.0,0.05112116407632446,0.9986924623475553,4.186048633340564,-6.272263853428369,0.6567252157896248,0.0,0.0,0.0,1.0
1717767115.3036513,map,True,False,6,4,0.0,0.0,2.0769169330596924,-2.646890163421631,0.0,0.0,0.0,0.05112116407632446,0.9986924623475553,4.186048633340564,-6.272263853428369,0.6567252157896248,0.0,0.0,0.0,1.0
1717767115.4013746,map,True,False,6,4,0.0,0.0,2.0769169330596924,-2.646890163421631,0.0,0.0,0.0,0.05112116407632446,0.9986924623475553,4.186048633340564,-6.272263853428369,0.6567252157896248,0.0,0.0,0.0,1.0
1717767115.451231,map,True,False,6,4,0.0,0.0,2.0769169330596924,-2.646890163421631,0.0,0.0,0.0,0.05112116407632446,0.9986924623475553,4.186048633340564,-6.272263853428369,0.6567252157896248,0.0,0.0,0.0,1.0
1717767115.501612,map,True,False,6,4,0.0,0.0,2.0769169330596924,-2.646890163421631,0.0,0.0,0.0,0.05112116407632446,0.9986924623475553,4.279083384608899,-6.260650503112062,0.6563170808265864,0.0,0.0,0.0,1.0
1717767115.6017418,map,True,False,6,4,0.0,0.0,2.0769169330596924,-2.646890163421631,0.0,0.0,0.0,0.05112116407632446,0.9986924623475553,4.3135241596188685,-6.152186010754756,0.6445725055556526,0.0,0.0,0.0,1.0
1717767115.70134,map,True,False,6,4,0.0,0.0,2.1369502544403076,-2.6496944427490234,0.0,0.0,0.0,0.05116978019487981,0.9986899705924678,4.3135241596188685,-6.152186010754756,0.6445725055556526,0.0,0.0,0.0,1.0
1717767115.8048599,map,True,False,6,4,0.0,0.0,2.1369502544403076,-2.6496944427490234,0.0,0.0,0.0,0.05116978019487981,0.9986899705924678,4.3135241596188685,-6.152186010754756,0.6445725055556526,0.0,0.0,0.0,1.0
1717767115.8607557,map,True,False,6,4,0.0,0.0,2.1369502544403076,-2.6496944427490234,0.0,0.0,0.0,0.05116978019487981,0.9986899705924678,4.32243922230376,-5.876079649799906,0.6581063817076445,0.0,0.0,0.0,1.0
1717767115.9543803,map,True,False,6,4,0.0,0.0,2.1369502544403076,-2.6496944427490234,0.0,0.0,0.0,0.05116978019487981,0.9986899705924678,4.325627763284076,-5.914728518987554,0.6523572641293189,0.0,0.0,0.0,1.0
1717767116.0549054,map,True,False,6,4,0.0,0.0,2.1369502544403076,-2.6496944427490234,0.0,0.0,0.0,0.05116978019487981,0.9986899705924678,4.325627763284076,-5.914728518987554,0.6523572641293189,0.0,0.0,0.0,1.0
1717767116.1544182,map,True,False,6,4,0.0,0.0,2.1369502544403076,-2.6496944427490234,0.0,0.0,0.0,0.05116978019487981,0.9986899705924678,4.325627763284076,-5.914728518987554,0.6523572641293189,0.0,0.0,0.0,1.0
1717767116.2043865,map,True,False,5,3,0.0,0.0,2.2309024333953857,-2.658445119857788,0.0,0.0,0.0,0.05133725184771697,0.9986813762278182,4.339833769068651,-5.514889152675062,0.6048829847599719,0.0,0.0,0.0,1.0
1717767116.2552013,map,True,False,5,3,0.0,0.0,2.2309024333953857,-2.658445119857788,0.0,0.0,0.0,0.05133725184771697,0.9986813762278182,4.339833769068651,-5.514889152675062,0.6048829847599719,0.0,0.0,0.0,1.0
1717767116.304734,map,True,False,5,3,0.0,0.0,2.2309024333953857,-2.658445119857788,0.0,0.0,0.0,0.05133725184771697,0.9986813762278182,4.339833769068651,-5.514889152675062,0.6048829847599719,0.0,0.0,0.0,1.0
1717767116.4081066,map,True,False,5,3,0.0,0.0,2.2309024333953857,-2.658445119857788,0.0,0.0,0.0,0.05133725184771697,0.9986813762278182,4.339833769068651,-5.514889152675062,0.6048829847599719,0.0,0.0,0.0,1.0
1717767116.5096436,map,True,False,5,3,0.0,0.0,2.2309024333953857,-2.658445119857788,0.0,0.0,0.0,0.05133725184771697,0.9986813762278182,4.363975533717851,-5.370855067633197,0.6319015653462579,0.0,0.0,0.0,1.0
1717767116.6043818,map,True,False,5,3,0.0,0.0,2.2309024333953857,-2.658445119857788,0.0,0.0,0.0,0.05133725184771697,0.9986813762278182,4.466754134074922,-5.343642888522259,0.6310695791069671,0.0,0.0,0.0,1.0
1717767116.7040367,map,True,False,5,3,0.0,0.0,2.2309024333953857,-2.658445119857788,0.0,0.0,0.0,0.05133725184771697,0.9986813762278182,4.466754134074922,-5.343642888522259,0.6310695791069671,0.0,0.0,0.0,1.0
1717767116.8036017,map,True,False,5,3,0.0,0.0,2.3285136222839355,-2.668632984161377,0.0,0.0,0.0,0.05160560535246648,0.9986675445169105,4.466754134074922,-5.343642888522259,0.6310695791069671,0.0,0.0,0.0,1.0
1717767116.853885,map,True,False,5,3,0.0,0.0,2.3285136222839355,-2.668632984161377,0.0,0.0,0.0,0.05160560535246648,0.9986675445169105,4.488413579079499,-5.167364945226064,0.6243571200152311,0.0,0.0,0.0,1.0
1717767117.2070658,map,True,False,5,3,0.0,0.0,2.3285136222839355,-2.668632984161377,0.0,0.0,0.0,0.05160560535246648,0.9986675445169105,4.4690349124056485,-4.813051540940328,0.5978916089960415,0.0,0.0,0.0,1.0
1717767117.257454,map,True,False,5,3,0.0,0.0,2.3285136222839355,-2.668632984161377,0.0,0.0,0.0,0.05160560535246648,0.9986675445169105,4.4690349124056485,-4.813051540940328,0.5978916089960415,0.0,0.0,0.0,1.0
1717767117.3076115,map,True,False,5,3,0.0,0.0,2.3285136222839355,-2.668632984161377,0.0,0.0,0.0,0.05160560535246648,0.9986675445169105,4.4690349124056485,-4.813051540940328,0.5978916089960415,0.0,0.0,0.0,1.0
1717767117.4073322,map,True,False,5,3,0.0,0.0,2.3874893188476562,-2.6766765117645264,0.0,0.0,0.0,0.05167424684809601,0.9986639933024056,4.4690349124056485,-4.813051540940328,0.5978916089960415,0.0,0.0,0.0,1.0
1717767117.4579885,map,True,False,5,3,0.0,0.0,2.3874893188476562,-2.6766765117645264,0.0,0.0,0.0,0.05167424684809601,0.9986639933024056,4.4690349124056485,-4.813051540940328,0.5978916089960415,0.0,0.0,0.0,1.0
1717767117.5584826,map,True,False,5,2,0.0,0.0,2.3874893188476562,-2.6766765117645264,0.0,0.0,0.0,0.05167424684809601,0.9986639933024056,4.528587089338419,-4.666717613912265,0.6023238111698852,0.0,0.0,0.0,1.0
1717767117.6079636,map,True,False,5,2,0.0,0.0,2.3874893188476562,-2.6766765117645264,0.0,0.0,0.0,0.05167424684809601,0.9986639933024056,4.528587089338419,-4.666717613912265,0.6023238111698852,0.0,0.0,0.0,1.0
1717767117.7079916,map,True,False,5,2,0.0,0.0,2.3874893188476562,-2.6766765117645264,0.0,0.0,0.0,0.05167424684809601,0.9986639933024056,4.528587089338419,-4.666717613912265,0.6023238111698852,0.0,0.0,0.0,1.0
1717767117.8066266,map,True,False,5,2,0.0,0.0,2.3874893188476562,-2.6766765117645264,0.0,0.0,0.0,0.05167424684809601,0.9986639933024056,4.528587089338419,-4.666717613912265,0.6023238111698852,0.0,0.0,0.0,1.0
1717767117.9062467,map,True,False,5,2,0.0,0.0,2.5231094360351562,-2.689807653427124,0.0,0.0,0.0,0.051719777567479204,0.9986616357664743,4.61289979196578,-4.4449373212600705,0.6465201522018098,0.0,0.0,0.0,1.0
1717767117.9572263,map,True,False,5,2,0.0,0.0,2.5231094360351562,-2.689807653427124,0.0,0.0,0.0,0.051719777567479204,0.9986616357664743,4.61289979196578,-4.4449373212600705,0.6465201522018098,0.0,0.0,0.0,1.0
1717767118.0067596,map,True,False,5,2,0.0,0.0,2.5231094360351562,-2.689807653427124,0.0,0.0,0.0,0.051719777567479204,0.9986616357664743,4.61289979196578,-4.4449373212600705,0.6465201522018098,0.0,0.0,0.0,1.0
1717767118.0577412,map,True,False,5,2,0.0,0.0,2.5231094360351562,-2.689807653427124,0.0,0.0,0.0,0.051719777567479204,0.9986616357664743,4.61289979196578,-4.4449373212600705,0.6465201522018098,0.0,0.0,0.0,1.0
1717767118.1095135,map,True,False,5,2,0.0,0.0,2.5231094360351562,-2.689807653427124,0.0,0.0,0.0,0.051719777567479204,0.9986616357664743,4.61289979196578,-4.4449373212600705,0.6465201522018098,0.0,0.0,0.0,1.0
1717767118.207628,map,True,False,5,2,0.0,0.0,2.5231094360351562,-2.689807653427124,0.0,0.0,0.0,0.051719777567479204,0.9986616357664743,4.635362009650011,-4.264170207848294,0.651952523931431,0.0,0.0,0.0,1.0
1717767118.2583537,map,True,False,5,2,0.0,0.0,2.5231094360351562,-2.689807653427124,0.0,0.0,0.0,0.051719777567479204,0.9986616357664743,4.635362009650011,-4.264170207848294,0.651952523931431,0.0,0.0,0.0,1.0
1717767118.3577187,map,True,False,5,2,0.0,0.0,2.5231094360351562,-2.689807653427124,0.0,0.0,0.0,0.051719777567479204,0.9986616357664743,4.635362009650011,-4.264170207848294,0.651952523931431,0.0,0.0,0.0,1.0
1717767118.4077332,map,True,False,4,2,0.0,0.0,2.6151154041290283,-2.7020668983459473,0.0,0.0,0.0,0.05234881390400548,0.9986288535033845,4.635362009650011,-4.264170207848294,0.651952523931431,0.0,0.0,0.0,1.0
1717767118.5096376,map,True,False,4,2,0.0,0.0,2.6151154041290283,-2.7020668983459473,0.0,0.0,0.0,0.05234881390400548,0.9986288535033845,4.645471251128887,-4.158045496345245,0.684516793495604,0.0,0.0,0.0,1.0
1717767118.5578604,map,True,False,4,2,0.0,0.0,2.6151154041290283,-2.7020668983459473,0.0,0.0,0.0,0.05234881390400548,0.9986288535033845,4.652334559449196,-3.9831245290833355,0.6809200601806582,0.0,0.0,0.0,1.0
1717767118.607962,map,True,False,4,2,0.0,0.0,2.6151154041290283,-2.7020668983459473,0.0,0.0,0.0,0.05234881390400548,0.9986288535033845,4.652334559449196,-3.9831245290833355,0.6809200601806582,0.0,0.0,0.0,1.0
1717767118.6590037,map,True,False,4,2,0.0,0.0,2.6151154041290283,-2.7020668983459473,0.0,0.0,0.0,0.05234881390400548,0.9986288535033845,4.652334559449196,-3.9831245290833355,0.6809200601806582,0.0,0.0,0.0,1.0
1717767118.7100718,map,True,False,4,2,0.0,0.0,2.6151154041290283,-2.7020668983459473,0.0,0.0,0.0,0.05234881390400548,0.9986288535033845,4.652334559449196,-3.9831245290833355,0.6809200601806582,0.0,0.0,0.0,1.0
1717767118.8085635,map,True,False,4,2,0.0,0.0,2.6151154041290283,-2.7020668983459473,0.0,0.0,0.0,0.05234881390400548,0.9986288535033845,4.652334559449196,-3.9831245290833355,0.6809200601806582,0.0,0.0,0.0,1.0
1717767118.8593578,map,True,False,4,2,0.0,0.0,2.6151154041290283,-2.7020668983459473,0.0,0.0,0.0,0.05234881390400548,0.9986288535033845,4.704301771665797,-3.927446062197782,0.6835739125266413,0.0,0.0,0.0,1.0
1717767119.210643,map,True,False,4,2,0.0,0.0,2.6997601985931396,-2.7071173191070557,0.0,0.0,0.0,0.05254720772460172,0.9986184381576667,4.69858212444885,-3.6805755519974204,0.6827311841966972,0.0,0.0,0.0,1.0
1717767119.2623637,map,True,False,4,2,0.0,0.0,2.6997601985931396,-2.7071173191070557,0.0,0.0,0.0,0.05254720772460172,0.9986184381576667,4.69858212444885,-3.6805755519974204,0.6827311841966972,0.0,0.0,0.0,1.0
1717767119.3612525,map,True,False,4,2,0.0,0.0,2.6997601985931396,-2.7071173191070557,0.0,0.0,0.0,0.05254720772460172,0.9986184381576667,4.69858212444885,-3.6805755519974204,0.6827311841966972,0.0,0.0,0.0,1.0
1717767119.4106922,map,True,False,4,2,0.0,0.0,2.6997601985931396,-2.7071173191070557,0.0,0.0,0.0,0.05254720772460172,0.9986184381576667,4.69858212444885,-3.6805755519974204,0.6827311841966972,0.0,0.0,0.0,1.0
1717767119.5111094,map,True,False,4,2,0.0,0.0,2.8051552772521973,-2.719109058380127,0.0,0.0,0.0,0.05304707720551912,0.9985920113417236,4.76879616543053,-3.589433708685811,0.6823135088689953,0.0,0.0,0.0,1.0
1717767119.5613427,map,True,False,4,1,0.0,0.0,2.8051552772521973,-2.719109058380127,0.0,0.0,0.0,0.05304707720551912,0.9985920113417236,4.785676631164456,-3.5432021468651818,0.6821202217169606,0.0,0.0,0.0,1.0
1717767119.6608782,map,True,False,4,1,0.0,0.0,2.8051552772521973,-2.719109058380127,0.0,0.0,0.0,0.05304707720551912,0.9985920113417236,4.785676631164456,-3.5432021468651818,0.6821202217169606,0.0,0.0,0.0,1.0
1717767119.7115874,map,True,False,4,1,0.0,0.0,2.8051552772521973,-2.719109058380127,0.0,0.0,0.0,0.05304707720551912,0.9985920113417236,4.785676631164456,-3.5432021468651818,0.6821202217169606,0.0,0.0,0.0,1.0
1717767119.810916,map,True,False,4,1,0.0,0.0,2.8051552772521973,-2.719109058380127,0.0,0.0,0.0,0.05304707720551912,0.9985920113417236,4.785676631164456,-3.5432021468651818,0.6821202217169606,0.0,0.0,0.0,1.0
1717767119.8611383,map,True,False,4,1,0.0,0.0,2.8051552772521973,-2.719109058380127,0.0,0.0,0.0,0.05304707720551912,0.9985920113417236,4.827238951684959,-3.4650769701076256,0.6817943302430001,0.0,0.0,0.0,1.0
1717767119.9611118,map,True,False,4,1,0.0,0.0,2.8051552772521973,-2.719109058380127,0.0,0.0,0.0,0.05304707720551912,0.9985920113417236,4.839174431257329,-3.451240209367463,0.6817200119696227,0.0,0.0,0.0,1.0
1717767120.06145,map,True,False,4,1,0.0,0.0,2.8051552772521973,-2.719109058380127,0.0,0.0,0.0,0.05304707720551912,0.9985920113417236,4.839174431257329,-3.451240209367463,0.6817200119696227,0.0,0.0,0.0,1.0
1717767120.1118164,map,True,False,4,1,0.0,0.0,2.8051552772521973,-2.719109058380127,0.0,0.0,0.0,0.05304707720551912,0.9985920113417236,4.839174431257329,-3.451240209367463,0.6817200119696227,0.0,0.0,0.0,1.0
1717767120.1619725,map,True,False,4,1,0.0,0.0,2.931915283203125,-2.7384910583496094,0.0,0.0,0.0,0.05326138196027746,0.9985806107376634,4.839174431257329,-3.451240209367463,0.6817200119696227,0.0,0.0,0.0,1.0
1717767120.2119565,map,True,False,4,1,0.0,0.0,2.931915283203125,-2.7384910583496094,0.0,0.0,0.0,0.05326138196027746,0.9985806107376634,4.850276155423343,-3.3636046052504933,0.6814343086971453,0.0,0.0,0.0,1.0
1717767120.262602,map,True,False,4,1,0.0,0.0,2.931915283203125,-2.7384910583496094,0.0,0.0,0.0,0.05326138196027746,0.9985806107376634,4.850276155423343,-3.3636046052504933,0.6814343086971453,0.0,0.0,0.0,1.0
1717767120.3130615,map,True,False,4,1,0.0,0.0,2.931915283203125,-2.7384910583496094,0.0,0.0,0.0,0.05326138196027746,0.9985806107376634,4.850276155423343,-3.3636046052504933,0.6814343086971453,0.0,0.0,0.0,1.0
1717767120.3652363,map,True,False,4,1,0.0,0.0,2.931915283203125,-2.7384910583496094,0.0,0.0,0.0,0.05326138196027746,0.9985806107376634,4.850276155423343,-3.3636046052504933,0.6814343086971453,0.0,0.0,0.0,1.0
1717767120.464504,map,True,False,4,1,0.0,0.0,2.931915283203125,-2.7384910583496094,0.0,0.0,0.0,0.05326138196027746,0.9985806107376634,4.850276155423343,-3.3636046052504933,0.6814343086971453,0.0,0.0,0.0,1.0
1717767120.5142992,map,True,False,4,1,0.0,0.0,2.931915283203125,-2.7384910583496094,0.0,0.0,0.0,0.05326138196027746,0.9985806107376634,4.845512937088447,-3.331884029275427,0.6813656234951462,0.0,0.0,0.0,1.0
1717767120.563869,map,True,False,4,1,0.0,0.0,2.931915283203125,-2.7384910583496094,0.0,0.0,0.0,0.05326138196027746,0.9985806107376634,4.829902973728686,-3.3119742788705917,0.6813166079577357,0.0,0.0,0.0,1.0
1717767120.6139815,map,True,False,4,1,0.0,0.0,2.931915283203125,-2.7384910583496094,0.0,0.0,0.0,0.05326138196027746,0.9985806107376634,4.829902973728686,-3.3119742788705917,0.6813166079577357,0.0,0.0,0.0,1.0
1717767120.6651566,map,True,False,4,1,0.0,0.0,2.931915283203125,-2.7384910583496094,0.0,0.0,0.0,0.05326138196027746,0.9985806107376634,4.829902973728686,-3.3119742788705917,0.6813166079577357,0.0,0.0,0.0,1.0
1717767120.714721,map,True,False,4,1,0.0,0.0,2.931915283203125,-2.7384910583496094,0.0,0.0,0.0,0.05326138196027746,0.9985806107376634,4.829902973728686,-3.3119742788705917,0.6813166079577357,0.0,0.0,0.0,1.0
1717767120.8138633,map,True,False,3,1,0.0,0.0,3.017319679260254,-2.744364023208618,0.0,0.0,0.0,0.05235515415139499,0.9986285252276703,4.829902973728686,-3.3119742788705917,0.6813166079577357,0.0,0.0,0.0,1.0
1717767120.8645325,map,True,False,3,1,0.0,0.0,3.017319679260254,-2.744364023208618,0.0,0.0,0.0,0.05235515415139499,0.9986285252276703,4.786755494442545,-3.2390556889140245,0.6811870517259255,0.0,0.0,0.0,1.0
1717767121.2650266,map,True,False,3,1,0.0,0.0,3.017319679260254,-2.744364023208618,0.0,0.0,0.0,0.05235515415139499,0.9986285252276703,4.698402884325182,-3.143374261736961,0.6809969151012158,0.0,0.0,0.0,1.0
1717767121.3657258,map,True,False,3,1,0.0,0.0,3.1209499835968018,-2.761453151702881,0.0,0.0,0.0,0.05267375301186136,0.9986117681012728,4.698402884325182,-3.143374261736961,0.6809969151012158,0.0,0.0,0.0,1.0
1717767121.4656463,map,True,False,3,1,0.0,0.0,3.1209499835968018,-2.761453151702881,0.0,0.0,0.0,0.05267375301186136,0.9986117681012728,4.698402884325182,-3.143374261736961,0.6809969151012158,0.0,0.0,0.0,1.0
1717767121.5185404,map,True,False,3,1,0.0,0.0,3.1209499835968018,-2.761453151702881,0.0,0.0,0.0,0.05267375301186136,0.9986117681012728,4.716822368153581,-3.107266292185943,0.6796446700543722,0.0,0.0,0.0,1.0
1717767121.6172652,map,True,False,3,1,0.0,0.0,3.1209499835968018,-2.761453151702881,0.0,0.0,0.0,0.05267375301186136,0.9986117681012728,4.716762566241847,-3.0915181990920653,0.7251140409809902,0.0,0.0,0.0,1.0
1717767121.6667325,map,True,False,3,1,0.0,0.0,3.1209499835968018,-2.761453151702881,0.0,0.0,0.0,0.05267375301186136,0.9986117681012728,4.716762566241847,-3.0915181990920653,0.7251140409809902,0.0,0.0,0.0,1.0
1717767121.7168698,map,True,False,3,1,0.0,0.0,3.1209499835968018,-2.761453151702881,0.0,0.0,0.0,0.05267375301186136,0.9986117681012728,4.716762566241847,-3.0915181990920653,0.7251140409809902,0.0,0.0,0.0,1.0
1717767121.815499,map,True,False,3,1,0.0,0.0,3.1209499835968018,-2.761453151702881,0.0,0.0,0.0,0.05267375301186136,0.9986117681012728,4.716762566241847,-3.0915181990920653,0.7251140409809902,0.0,0.0,0.0,1.0
