car_pos_meter , car_pos_cell, car_speed, ped_pos_meter, ped_pos_cell, ped_speed
-41, 40, 2, 3.958082, 39, 1

-40.8334, 39, 2, 3.958082, 39, 1

-40.6668, 39, 2, 3.95808, 39, 1

-40.5002, 39, 2, 3.95808, 39, 1

-40.3336, 39, 2, 3.95808, 39, 1

-40.167, 39, 2, 3.95808, 39, 1

-40.0004, 39, 2, 3.95808, 39, 1

-39.83381, 38, 2, 3.945951, 39, 1

-39.66721, 38, 2, 3.945951, 39, 1

-39.50061, 38, 2, 3.944632, 39, 1

-39.33401, 38, 2, 3.944312, 39, 1

-39.16741, 38, 2, 3.943994, 39, 1

-39.00081, 38, 2, 3.943803, 39, 1

-38.83421, 37, 2, 3.943596, 39, 1

-38.66761, 37, 2, 3.94351, 39, 1

-38.50101, 37, 2, 3.943413, 39, 1

-38.33441, 37, 2, 3.943327, 39, 1

-38.16781, 37, 2, 3.943233, 39, 1

-38.00121, 37, 2, 3.943313, 39, 1

-37.83461, 36, 2, 3.943342, 39, 1

-37.66801, 36, 2, 3.943402, 39, 1

-37.50142, 36, 2, 3.943367, 39, 1

-37.33482, 36, 2, 3.943162, 39, 1

-37.16822, 36, 2, 3.942776, 39, 1

-37.00162, 36, 2, 3.942454, 39, 1

-36.83502, 35, 2, 3.941542, 39, 1

-36.66842, 35, 2, 3.940081, 39, 1

-36.50182, 35, 2, 3.938323, 39, 1

-36.33522, 35, 2, 3.937201, 39, 1

-36.16862, 35, 2, 3.934783, 39, 1

-36.00202, 35, 2, 3.931978, 39, 1

-35.83542, 34, 2, 3.928921, 39, 1

-35.66882, 34, 2, 3.925445, 39, 1

-35.50222, 34, 2, 3.923736, 39, 1

-35.33562, 34, 2, 3.919901, 39, 1

-35.16903, 34, 2, 3.915898, 39, 1

-35.00243, 34, 2, 3.911644, 39, 1

-34.83583, 33, 2, 3.90714, 39, 1

-34.66923, 33, 2, 3.904809, 39, 1

-34.50263, 33, 2, 3.900089, 39, 1

-34.33603, 33, 2, 3.895262, 38, 1

-34.16943, 33, 2, 3.889915, 38, 1

-34.00283, 33, 2, 3.884247, 38, 1

-33.83623, 32, 2, 3.881448, 38, 1

-33.66963, 32, 2, 3.875232, 38, 1

-33.50303, 32, 2, 3.868818, 38, 1

-33.33643, 32, 2, 3.865688, 38, 1

-33.16983, 32, 2, 3.858729, 38, 1

-33.00323, 32, 2, 3.851256, 38, 1

-32.83664, 31, 2, 3.843321, 38, 1

-32.67004, 31, 2, 3.835101, 38, 1

-32.50344, 31, 2, 3.831, 38, 1

-32.33684, 31, 2, 3.821995, 38, 1

-32.17024, 31, 2, 3.812471, 38, 1

-32.00364, 31, 2, 3.802678, 38, 1

-31.83704, 30, 2, 3.792467, 37, 1

-31.67044, 30, 2, 3.787114, 37, 1

-31.50384, 30, 2, 3.776138, 37, 1

-31.33724, 30, 2, 3.76461, 37, 1

-31.17064, 30, 2, 3.752363, 37, 1

-31.00404, 30, 2, 3.73963, 37, 1

-30.83744, 29, 2, 3.733195, 37, 1

-30.67085, 29, 2, 3.719639, 37, 1

-30.50425, 29, 2, 3.70582, 37, 1

-30.33765, 29, 2, 3.691525, 36, 1

-30.17105, 29, 2, 3.676538, 36, 1

-30.00445, 29, 2, 3.668778, 36, 1

-29.83785, 28, 2, 3.652441, 36, 1

-29.67125, 28, 2, 3.634717, 36, 1

-29.50465, 28, 2, 3.615612, 36, 1

-29.33805, 28, 2, 3.595566, 35, 1

-29.17145, 28, 2, 3.58544, 35, 1

-29.00485, 28, 2, 3.564172, 35, 1

-28.83825, 27, 2, 3.543272, 35, 1

-28.67165, 27, 2, 3.52369, 35, 1

-28.50505, 27, 2, 3.504508, 35, 1

-28.33846, 27, 2, 3.495178, 34, 1

-28.17186, 27, 2, 3.476956, 34, 1

-28.00526, 27, 2, 3.459919, 34, 1

-27.83866, 26, 2, 3.443206, 34, 1

-27.67206, 26, 2, 3.42724, 34, 1

-27.50546, 26, 2, 3.419268, 34, 1

-27.33886, 26, 2, 3.403672, 34, 1

-27.17226, 26, 2, 3.388442, 33, 1

-27.00566, 26, 2, 3.373909, 33, 1

-26.83906, 25, 2, 3.359802, 33, 1

-26.67246, 25, 2, 3.353049, 33, 1

-26.50586, 25, 2, 3.339317, 33, 1

-26.33926, 25, 2, 3.325918, 33, 1

-26.17266, 25, 2, 3.312739, 33, 1

-26.00607, 25, 2, 3.298928, 32, 1

-25.83947, 24, 2, 3.291906, 32, 1

-25.67287, 24, 2, 3.277627, 32, 1

-25.50627, 24, 2, 3.263166, 32, 1

-25.33967, 24, 2, 3.248513, 32, 1

-25.17307, 24, 2, 3.233418, 32, 1

-25.00647, 24, 2, 3.226066, 32, 1

-24.83987, 23, 2, 3.210455, 32, 1

-24.67327, 23, 2, 3.194603, 31, 1

-24.50667, 23, 2, 3.178135, 31, 1

-24.34007, 23, 2, 3.161265, 31, 1

-24.17347, 23, 2, 3.152357, 31, 1

-24.00687, 23, 2, 3.134704, 31, 1

-23.84027, 22, 2, 3.116993, 31, 1

-23.67368, 22, 2, 3.098598, 30, 1

-23.50708, 22, 2, 3.080356, 30, 1

-23.34048, 22, 2, 3.071104, 30, 1

-23.17388, 22, 2, 3.052501, 30, 1

-23.00728, 22, 2, 3.033522, 30, 1

-22.84068, 21, 2, 3.0144, 30, 1

-22.67408, 21, 2, 2.996052, 29, 1

-22.50748, 21, 2, 2.978185, 29, 1

-22.34088, 21, 2, 2.969233, 29, 1

-22.17428, 21, 2, 2.951911, 29, 1

-22.00768, 21, 2, 2.935469, 29, 1

-21.84108, 20, 2, 2.919327, 29, 1

-21.67448, 20, 2, 2.903723, 29, 1

-21.50788, 20, 2, 2.896164, 28, 1

-21.34129, 20, 2, 2.881273, 28, 1

-21.17469, 20, 2, 2.866744, 28, 1

-21.00809, 20, 2, 2.853028, 28, 1

-20.84149, 19, 2, 2.839606, 28, 1

-20.67489, 19, 2, 2.833077, 28, 1

-20.50829, 19, 2, 2.820288, 28, 1

-20.34169, 19, 2, 2.808363, 28, 1

-20.17509, 19, 2, 2.797248, 27, 1

-20.00849, 19, 2, 2.786199, 27, 1

-19.84189, 18, 2, 2.781028, 27, 1

-19.67529, 18, 2, 2.770756, 27, 1

-19.50869, 18, 2, 2.761052, 27, 1

-19.34209, 18, 2, 2.751562, 27, 1

-19.1755, 18, 2, 2.746998, 27, 1

-19.0089, 18, 2, 2.73748, 27, 1

-18.8423, 17, 2, 2.728462, 27, 1

-18.6757, 17, 2, 2.719601, 27, 1

-18.5091, 17, 2, 2.710854, 27, 1

-18.3425, 17, 2, 2.706361, 27, 1

-18.1759, 17, 2, 2.69774, 26, 1

-18.0093, 17, 2, 2.689673, 26, 1

-17.8427, 16, 2, 2.681775, 26, 1

-17.6761, 16, 2, 2.67408, 26, 1

-17.5095, 16, 2, 2.670178, 26, 1

-17.3429, 16, 2, 2.662606, 26, 1

-17.1763, 16, 2, 2.655042, 26, 1

-17.0097, 16, 2, 2.647571, 26, 1

-16.84311, 15, 2, 2.640003, 26, 1

-16.67651, 15, 2, 2.636191, 26, 1

-16.50991, 15, 2, 2.628771, 26, 1

-16.34331, 15, 2, 2.621362, 26, 1

-16.17671, 15, 2, 2.614076, 26, 1

-16.01011, 15, 2, 2.606636, 26, 1

-15.84351, 14, 2, 2.602877, 26, 1

-15.67691, 14, 2, 2.595808, 25, 1

-15.51031, 14, 2, 2.58861, 25, 1

-15.34371, 14, 2, 2.581917, 25, 1

-15.17711, 14, 2, 2.575208, 25, 1

-15.01051, 14, 2, 2.572096, 25, 1

-14.84391, 13, 2, 2.565543, 25, 1

-14.67731, 13, 2, 2.559119, 25, 1

-14.51071, 13, 2, 2.553416, 25, 1

-14.34411, 13, 2, 2.548176, 25, 1

-14.17751, 13, 2, 2.543384, 25, 1

-14.01091, 13, 2, 2.541123, 25, 1

-13.84431, 12, 2, 2.536515, 25, 1

-13.6777, 12, 2, 2.532509, 25, 1

-13.5111, 12, 2, 2.52898, 25, 1

-13.3445, 12, 2, 2.527317, 25, 1

-13.1779, 12, 2, 2.524343, 25, 1

-13.0113, 12, 2, 2.522007, 25, 1

-12.8447, 11, 2, 2.519515, 25, 1

-12.6781, 11, 2, 2.516969, 25, 1

-12.5115, 11, 2, 2.515179, 25, 1

-12.3449, 11, 2, 2.514538, 25, 1

-12.1783, 11, 2, 2.513011, 25, 1

-12.0117, 11, 2, 2.512008, 25, 1

-11.8451, 10, 2, 2.511354, 25, 1

-11.6785, 10, 2, 2.510748, 25, 1

-11.5119, 10, 2, 2.510299, 25, 1

-11.3453, 10, 2, 2.50984, 25, 1

-11.1787, 10, 2, 2.509145, 25, 1

-11.0121, 10, 2, 2.508478, 25, 1

-10.8455, 9, 2, 2.507855, 25, 1

-10.6789, 9, 2, 2.50746, 25, 1

-10.5123, 9, 2, 2.506744, 25, 1

-10.3457, 9, 2, 2.505841, 25, 1

-10.1791, 9, 2, 2.504347, 25, 1

-10.0125, 9, 2, 2.503192, 25, 1

-9.8459, 8, 2, 2.502469, 25, 1

-9.679299, 8, 2, 2.501013, 25, 1

-9.512699, 8, 2, 2.499547, 24, 1

-9.346099, 8, 2, 2.49806, 24, 1

-9.179499, 8, 2, 2.497241, 24, 1

-9.012898, 8, 2, 2.495138, 24, 1

-8.846298, 7, 2, 2.493627, 24, 1

-8.679698, 7, 2, 2.491917, 24, 1

-8.513098, 7, 2, 2.49021, 24, 1

-8.346498, 7, 2, 2.488604, 24, 1

-8.179897, 7, 2, 2.487737, 24, 1

-8.013297, 7, 2, 2.485654, 24, 1

-7.846697, 6, 2, 2.483386, 24, 1

-7.680097, 6, 2, 2.48142, 24, 1

-7.513496, 6, 2, 2.479686, 24, 1

-7.346896, 6, 2, 2.478766, 24, 1

-7.180296, 6, 2, 2.477005, 24, 1

-7.013696, 6, 2, 2.475182, 24, 1

-6.847095, 5, 2, 2.473399, 24, 1

-6.680495, 5, 2, 2.472634, 24, 1

-6.513895, 5, 2, 2.471168, 24, 1

-6.347295, 5, 2, 2.469715, 24, 1

-6.180695, 5, 2, 2.468474, 24, 1

-6.014094, 5, 2, 2.467012, 24, 1

-5.847494, 4, 2, 2.465889, 24, 1

-5.680894, 4, 2, 2.465322, 24, 1

-5.514294, 4, 2, 2.464185, 24, 1

-5.347693, 4, 2, 2.463064, 24, 1

-5.181093, 4, 2, 2.461828, 24, 1

-5.014493, 4, 2, 2.461101, 24, 1

-4.847893, 3, 2, 2.459765, 24, 1

-4.681293, 3, 2, 2.458241, 24, 1

-4.514692, 3, 2, 2.456287, 24, 1

-4.348092, 3, 2, 2.454473, 24, 1

-4.181492, 3, 2, 2.452653, 24, 1

-4.014892, 3, 2, 2.451524, 24, 1

-3.848292, 2, 2, 2.449394, 24, 1

-3.681692, 2, 2, 2.446577, 24, 1

-3.515092, 2, 2, 2.44364, 24, 1

-3.348492, 2, 2, 2.44182, 24, 1

-3.181892, 2, 2, 2.437916, 24, 1

-3.015292, 2, 2, 2.433297, 24, 1

-2.848692, 1, 2, 2.430912, 24, 1

-2.682092, 1, 2, 2.424665, 24, 1

-2.515492, 1, 2, 2.421631, 24, 1

-2.348892, 1, 2, 2.419967, 24, 1

-2.182292, 1, 2, 2.417373, 24, 1

-2.015692, 1, 2, 2.415185, 24, 1

-1.849092, 0, 2, 2.413321, 24, 1

-1.682492, 0, 2, 2.411872, 24, 1

-1.515892, 0, 2, 2.410168, 24, 1

-1.349292, 0, 2, 2.409396, 24, 1

-1.182692, 0, 2, 2.407647, 24, 1

-1.016092, 0, 2, 2.405653, 24, 1

-0.8494918, -1, 2, 2.403518, 24, 1

-0.6828918, -1, 2, 2.401052, 24, 1

-0.5162919, -1, 2, 2.399696, 23, 1

-0.3496919, -1, 2, 2.397045, 23, 1

-0.1830919, -1, 2, 2.393925, 23, 1

-0.01649189, -1, 2, 2.390032, 23, 1

0.1501081, -1, 2, 2.384966, 23, 1

0.3167081, -1, 2, 2.381926, 23, 1

0.4833081, -1, 2, 2.376148, 23, 1

0.6499081, -1, 2, 2.368588, 23, 1

0.8165081, -1, 2, 2.360761, 23, 1

0.983108, -1, 2, 2.356442, 23, 1

1.149708, -2, 2, 2.347364, 23, 1

1.316308, -2, 2, 2.337529, 23, 1

1.482908, -2, 2, 2.326326, 23, 1

1.649508, -2, 2, 2.313949, 23, 1

1.816108, -2, 2, 2.307892, 23, 1

1.982708, -2, 2, 2.294182, 22, 1

2.149308, -3, 2, 2.279882, 22, 1

2.315908, -3, 2, 2.26504, 22, 1

2.482508, -3, 2, 2.249378, 22, 1

2.649108, -3, 2, 2.241197, 22, 1

2.815708, -3, 2, 2.224507, 22, 1

2.982308, -3, 2, 2.206486, 22, 1

3.148908, -4, 2, 2.187927, 21, 1

3.315508, -4, 2, 2.168446, 21, 1

3.482108, -4, 2, 2.158726, 21, 1

3.648708, -4, 2, 2.138104, 21, 1

3.815308, -4, 2, 2.116417, 21, 1

3.981908, -4, 2, 2.093941, 20, 2

4.148508, -5, 2, 2.070634, 20, 2

4.315108, -5, 2, 2.058861, 20, 1

4.481709, -5, 2, 2.035056, 20, 2

4.648309, -5, 2, 2.011075, 20, 2

4.814909, -5, 2, 1.986375, 19, 2

4.981509, -5, 2, 1.962139, 19, 2

5.148109, -6, 2, 1.950081, 19, 1

5.31471, -6, 2, 1.92765, 19, 2

5.48131, -6, 2, 1.905972, 19, 1

5.64791, -6, 2, 1.883882, 18, 2

5.81451, -6, 2, 1.862756, 18, 1

5.981111, -6, 2, 1.851578, 18, 1

6.147711, -7, 2, 1.829914, 18, 1

6.314311, -7, 2, 1.808892, 18, 1

6.480911, -7, 2, 1.787333, 17, 1

6.647511, -7, 2, 1.766469, 17, 1

6.814112, -7, 2, 1.755879, 17, 1

6.980712, -7, 2, 1.734736, 17, 1

7.147312, -8, 2, 1.712611, 17, 2

7.313912, -8, 2, 1.690017, 16, 2

7.480513, -8, 2, 1.667163, 16, 2

7.647113, -8, 2, 1.655537, 16, 1

7.813713, -8, 2, 1.632356, 16, 2

7.980313, -8, 2, 1.60865, 16, 2

8.146914, -9, 2, 1.584657, 15, 2

8.313514, -9, 2, 1.560549, 15, 2

8.480114, -9, 2, 1.54831, 15, 1

8.646714, -9, 2, 1.522863, 15, 2

8.813314, -9, 2, 1.497403, 14, 2

8.979915, -9, 2, 1.471952, 14, 2

9.146515, -10, 2, 1.446086, 14, 2

9.313115, -10, 2, 1.433068, 14, 1

9.479715, -10, 2, 1.407881, 14, 2

9.646316, -10, 2, 1.382663, 13, 2

9.812916, -10, 2, 1.35818, 13, 2

9.979516, -10, 2, 1.333924, 13, 2

10.14612, -11, 2, 1.321317, 13, 1

10.31272, -11, 2, 1.295881, 12, 2

10.47932, -11, 2, 1.271085, 12, 2

10.64592, -11, 2, 1.246594, 12, 2

10.81252, -11, 2, 1.223266, 12, 2

10.97912, -11, 2, 1.210783, 12, 1

11.14572, -12, 2, 1.187177, 11, 2

11.31232, -12, 2, 1.163247, 11, 2

11.47892, -12, 2, 1.139377, 11, 2

11.64552, -12, 2, 1.115899, 11, 2

11.81212, -12, 2, 1.103939, 11, 1

11.97872, -12, 2, 1.080778, 10, 2

12.14532, -13, 2, 1.057207, 10, 2

12.31192, -13, 2, 1.033354, 10, 2

12.47852, -13, 2, 1.00969, 10, 2

12.64512, -13, 2, 0.9977901, 9, 1

12.81172, -13, 2, 0.9740386, 9, 2

12.97832, -13, 2, 0.950453, 9, 2

13.14492, -14, 2, 0.9264057, 9, 2

13.31152, -14, 2, 0.901201, 9, 2

13.47812, -14, 2, 0.8887529, 8, 1

13.64472, -14, 2, 0.8640468, 8, 2

13.81132, -14, 2, 0.8389049, 8, 2

13.97792, -14, 2, 0.8141732, 8, 2

14.14452, -15, 2, 0.7901967, 7, 2

14.31112, -15, 2, 0.7776763, 7, 1

14.47772, -15, 2, 0.7530997, 7, 2

14.64432, -15, 2, 0.7281737, 7, 2

14.81092, -15, 2, 0.7029068, 7, 2

14.97752, -15, 2, 0.679019, 6, 2

15.14412, -16, 2, 0.6669474, 6, 1

15.31072, -16, 2, 0.6430984, 6, 2

15.47732, -16, 2, 0.6201549, 6, 2

15.64392, -16, 2, 0.5975189, 5, 2

15.81052, -16, 2, 0.5741732, 5, 2

15.97712, -16, 2, 0.5626388, 5, 1

16.14372, -17, 2, 0.5398207, 5, 2

16.31032, -17, 2, 0.516891, 5, 2

16.47692, -17, 2, 0.4947736, 4, 2

16.64352, -17, 2, 0.4728694, 4, 1

16.81012, -17, 2, 0.4622762, 4, 1

16.97672, -17, 2, 0.4396465, 4, 2

17.14332, -18, 2, 0.416729, 4, 2

17.30992, -18, 2, 0.3928227, 3, 2

17.47652, -18, 2, 0.369771, 3, 2

17.64312, -18, 2, 0.3574824, 3, 1

17.80972, -18, 2, 0.3348043, 3, 2

17.97632, -18, 2, 0.3106954, 3, 2

18.14292, -19, 2, 0.2860498, 2, 2

18.30951, -19, 2, 0.2622705, 2, 2

18.47611, -19, 2, 0.2379341, 2, 2

18.64271, -19, 2, 0.2257941, 2, 1

18.80931, -19, 2, 0.2025127, 2, 2

18.97591, -19, 2, 0.1789594, 1, 2

19.14251, -20, 2, 0.1553094, 1, 2

19.30911, -20, 2, 0.1434691, 1, 1

19.47571, -20, 2, 0.120069, 1, 2

19.64231, -20, 2, 0.0964644, 0, 2

19.80891, -20, 2, 0.07168317, 0, 2

19.97551, -20, 2, 0.04896712, 0, 2

20.14211, -21, 2, 0.03754592, 0, 1

20.30871, -21, 2, 0.01464939, 0, 2

20.47531, -21, 2, -0.007954597, 0, 2

20.6419, -21, 2, -0.02967095, 0, 1

20.8085, -21, 2, -0.05153155, 0, 1

20.9751, -21, 2, -0.06256604, 0, 1

21.1417, -22, 2, -0.08395553, 0, 1

21.3083, -22, 2, -0.1048701, -1, 1

21.4749, -22, 2, -0.126199, -1, 1

21.6415, -22, 2, -0.1463964, -1, 1

21.8081, -22, 2, -0.1559134, -1, 1

21.9747, -22, 2, -0.1739693, -1, 1

22.1413, -23, 2, -0.1924038, -1, 1

22.3079, -23, 2, -0.2107296, -2, 1

22.4745, -23, 2, -0.2290661, -2, 1

22.6411, -23, 2, -0.2474234, -2, 1

22.8077, -23, 2, -0.2569134, -2, 1

22.97429, -23, 2, -0.2752929, -2, 1

23.14089, -24, 2, -0.2939177, -2, 1

23.30749, -24, 2, -0.3119483, -3, 1

23.47409, -24, 2, -0.3306847, -3, 1

23.64069, -24, 2, -0.3401637, -3, 1

23.80729, -24, 2, -0.3586619, -3, 1

23.97389, -24, 2, -0.3775253, -3, 1

24.14049, -25, 2, -0.3965681, -3, 1

24.30709, -25, 2, -0.4154768, -4, 1

24.47369, -25, 2, -0.4248497, -4, 1

24.64029, -25, 2, -0.4433453, -4, 1

24.80689, -25, 2, -0.4614944, -4, 1

24.97349, -25, 2, -0.4789429, -4, 1

25.14009, -26, 2, -0.4961257, -4, 1

25.30668, -26, 2, -0.5046792, -5, 1

25.47328, -26, 2, -0.520915, -5, 1

25.63988, -26, 2, -0.5287735, -5, 1

25.80648, -26, 2, -0.551971, -5, 2

25.97308, -26, 2, -0.566565, -5, 1

26.13968, -27, 2, -0.5816555, -5, 1

26.30628, -27, 2, -0.5890937, -5, 1

26.47288, -27, 2, -0.6028752, -6, 1

26.63948, -27, 2, -0.6160235, -6, 1

26.80608, -27, 2, -0.6279922, -6, 1

26.97268, -27, 2, -0.6397409, -6, 1

27.13928, -28, 2, -0.6514659, -6, 1

27.30588, -28, 2, -0.6574135, -6, 1

27.47248, -28, 2, -0.6695766, -6, 1

27.63907, -28, 2, -0.6820335, -6, 1

27.80567, -28, 2, -0.6946025, -6, 1

27.97227, -28, 2, -0.7008977, -7, 1

28.13887, -29, 2, -0.7135534, -7, 1

28.30547, -29, 2, -0.7258997, -7, 1

28.47207, -29, 2, -0.7385225, -7, 1

28.63867, -29, 2, -0.7511678, -7, 1

28.80527, -29, 2, -0.7640858, -7, 1

28.97187, -29, 2, -0.770473, -7, 1

29.13847, -30, 2, -0.7838235, -7, 1

29.30507, -30, 2, -0.7971478, -7, 1

29.47167, -30, 2, -0.8103547, -8, 1

29.63827, -30, 2, -0.8171401, -8, 1

29.80486, -30, 2, -0.831214, -8, 1

29.97146, -30, 2, -0.8449087, -8, 1

30.13806, -31, 2, -0.8590231, -8, 1

30.30466, -31, 2, -0.873621, -8, 1

30.47126, -31, 2, -0.8809686, -8, 1

30.63786, -31, 2, -0.8961325, -8, 1

30.80446, -31, 2, -0.9117942, -9, 1

30.97106, -31, 2, -0.9276695, -9, 1

31.13766, -32, 2, -0.9357352, -9, 1

31.30426, -32, 2, -0.9523005, -9, 1

31.47086, -32, 2, -0.9691558, -9, 1

31.63746, -32, 2, -0.9869885, -9, 1

31.80406, -32, 2, -0.9958358, -9, 1

31.97066, -32, 2, -1.01442, -10, 1

32.13726, -33, 2, -1.033485, -10, 1

32.30386, -33, 2, -1.052806, -10, 1

32.47046, -33, 2, -1.073221, -10, 1

32.63705, -33, 2, -1.093351, -10, 1

32.80365, -33, 2, -1.103055, -11, 1

32.97025, -33, 2, -1.122319, -11, 1

33.13685, -34, 2, -1.140197, -11, 1

33.30345, -34, 2, -1.157432, -11, 1

33.47005, -34, 2, -1.174315, -11, 1

33.63665, -34, 2, -1.182593, -11, 1

33.80325, -34, 2, -1.198992, -11, 1

33.96985, -34, 2, -1.214717, -12, 1

34.13645, -35, 2, -1.229537, -12, 1

34.30305, -35, 2, -1.243418, -12, 1

34.46965, -35, 2, -1.250486, -12, 1

34.63625, -35, 2, -1.264072, -12, 1

34.80285, -35, 2, -1.277018, -12, 1

34.96944, -35, 2, -1.288442, -12, 1

35.13604, -36, 2, -1.298416, -12, 1

35.30264, -36, 2, -1.303337, -13, 1

35.46924, -36, 2, -1.312499, -13, 1

35.63584, -36, 2, -1.321592, -13, 1

35.80244, -36, 2, -1.330982, -13, 1

35.96904, -36, 2, -1.340757, -13, 1

36.13564, -37, 2, -1.345701, -13, 1

36.30224, -37, 2, -1.355459, -13, 1

36.46884, -37, 2, -1.365191, -13, 1

36.63544, -37, 2, -1.375507, -13, 1

36.80204, -37, 2, -1.386187, -13, 1

36.96864, -37, 2, -1.39155, -13, 1

37.13523, -38, 2, -1.402217, -14, 1

37.30183, -38, 2, -1.413098, -14, 1

37.46843, -38, 2, -1.42413, -14, 1

37.63503, -38, 2, -1.435028, -14, 1

37.80163, -38, 2, -1.440501, -14, 1

37.96823, -38, 2, -1.451312, -14, 1

38.13483, -39, 2, -1.462376, -14, 1

38.30143, -39, 2, -1.473398, -14, 1

38.46803, -39, 2, -1.484503, -14, 1

38.63463, -39, 2, -1.489763, -14, 1

38.80123, -39, 2, -1.500428, -15, 1

38.96783, -39, 2, -1.510123, -15, 1

39.13443, -40, 2, -1.519226, -15, 1

39.30103, -40, 2, -1.527082, -15, 1

39.46762, -40, 2, -1.530378, -15, 1

39.63422, -40, 2, -1.536909, -15, 1

39.80082, -40, 2, -1.54195, -15, 1

39.96742, -40, 2, -1.546599, -15, 1

40.13402, -41, 2, -1.548253, -15, 1

40.30062, -41, 2, -1.552067, -15, 1

40.46722, -41, 2, -1.555147, -15, 1

40.63382, -41, 2, -1.557889, -15, 1

40.80042, -41, 2, -1.560491, -15, 1

40.96702, -41, 2, -1.563346, -15, 1

