timestamp_sec,frame_id,game_played,yielding,player1discrete,player2discrete,player1yieldprob,player2yieldprob,player1_pose_x,player1_pose_y,player1_pose_z,player1_pose_orient_x,player1_pose_orient_y,player1_pose_orient_z,player1_pose_orient_w,player2_pose_x,player2_pose_y,player2_pose_z,player2_pose_orient_x,player2_pose_orient_y,player2_pose_orient_z,player2_pose_orient_w
1717775697.4125047,map,True,False,4,4,0.5922520728754596,0.5922520728754596,2.7396907806396484,-2.594943046569824,0.0,0.0,0.0,0.05268869717572388,0.998610992163408,4.466953235359505,-6.553555027888511,0.6476294662403146,0.0,0.0,0.0,1.0
1717775697.51189,map,True,False,4,4,0.5922520728754596,0.5922520728754596,2.7396907806396484,-2.594943046569824,0.0,0.0,0.0,0.05268869717572388,0.998610992163408,4.466953235359505,-6.553555027888511,0.6476294662403146,0.0,0.0,0.0,1.0
1717775697.6110363,map,True,True,4,4,0.5922520728754596,0.5922520728754596,2.8872804641723633,-2.629751205444336,0.0,0.0,0.0,0.05305000241741058,0.9985918621199981,4.466953235359505,-6.553555027888511,0.6476294662403146,0.0,0.0,0.0,1.0
1717775697.81442,map,True,False,4,4,0.5922520728754596,0.5922520728754596,2.8872804641723633,-2.629751205444336,0.0,0.0,0.0,0.05305000241741058,0.9985918621199981,4.466063265716622,-6.022217701697132,0.7083444579942335,0.0,0.0,0.0,1.0
1717775697.8641725,map,True,False,4,4,0.5922520728754596,0.5922520728754596,2.8872804641723633,-2.629751205444336,0.0,0.0,0.0,0.05305000241741058,0.9985918621199981,4.466063265716622,-6.022217701697132,0.7083444579942335,0.0,0.0,0.0,1.0
1717775697.9689927,map,True,True,4,4,0.5922520728754596,0.5922520728754596,2.8872804641723633,-2.629751205444336,0.0,0.0,0.0,0.05305000241741058,0.9985918621199981,4.466063265716622,-6.022217701697132,0.7083444579942335,0.0,0.0,0.0,1.0
1717775698.076792,map,True,False,4,3,0.0,0.0,2.8872804641723633,-2.629751205444336,0.0,0.0,0.0,0.05305000241741058,0.9985918621199981,4.519357111000067,-5.735705675758039,0.682358618665537,0.0,0.0,0.0,1.0
1717775698.1213388,map,True,False,4,3,0.0,0.0,2.8872804641723633,-2.629751205444336,0.0,0.0,0.0,0.05305000241741058,0.9985918621199981,4.5066394308438,-5.670960723796513,0.6961705119185819,0.0,0.0,0.0,1.0
1717775698.1718245,map,True,False,4,3,0.0,0.0,2.8872804641723633,-2.629751205444336,0.0,0.0,0.0,0.05305000241741058,0.9985918621199981,4.5066394308438,-5.670960723796513,0.6961705119185819,0.0,0.0,0.0,1.0
1717775698.2224586,map,True,False,4,3,0.0,0.0,2.8872804641723633,-2.629751205444336,0.0,0.0,0.0,0.05305000241741058,0.9985918621199981,4.5066394308438,-5.670960723796513,0.6961705119185819,0.0,0.0,0.0,1.0
1717775698.3244889,map,True,False,4,3,0.0,0.0,2.8872804641723633,-2.629751205444336,0.0,0.0,0.0,0.05305000241741058,0.9985918621199981,4.5066394308438,-5.670960723796513,0.6961705119185819,0.0,0.0,0.0,1.0
1717775698.3731458,map,True,False,4,3,0.0,0.0,2.8872804641723633,-2.629751205444336,0.0,0.0,0.0,0.05305000241741058,0.9985918621199981,4.5066394308438,-5.670960723796513,0.6961705119185819,0.0,0.0,0.0,1.0
1717775698.4234803,map,True,True,3,3,0.6616527499769684,0.6616527499769684,3.020414113998413,-2.6500942707061768,0.0,0.0,0.0,0.053610935195248025,0.998561897945706,4.4859565803432115,-5.416299547384963,0.7033156197262034,0.0,0.0,0.0,1.0
1717775698.5218458,map,True,True,3,3,0.6616527499769684,0.6616527499769684,3.020414113998413,-2.6500942707061768,0.0,0.0,0.0,0.053610935195248025,0.998561897945706,4.4859565803432115,-5.416299547384963,0.7033156197262034,0.0,0.0,0.0,1.0
1717775698.6208036,map,True,True,3,3,0.6616527499769684,0.6616527499769684,3.020414113998413,-2.6500942707061768,0.0,0.0,0.0,0.053610935195248025,0.998561897945706,4.4859565803432115,-5.416299547384963,0.7033156197262034,0.0,0.0,0.0,1.0
1717775698.772492,map,True,True,3,3,0.6616527499769684,0.6616527499769684,3.020414113998413,-2.6500942707061768,0.0,0.0,0.0,0.053610935195248025,0.998561897945706,4.54526980972485,-5.0953988639355,0.7007085382241565,0.0,0.0,0.0,1.0
1717775698.8724961,map,True,True,3,3,0.6616527499769684,0.6616527499769684,3.020414113998413,-2.6500942707061768,0.0,0.0,0.0,0.053610935195248025,0.998561897945706,4.54526980972485,-5.0953988639355,0.7007085382241565,0.0,0.0,0.0,1.0
1717775698.9722023,map,True,False,3,3,0.6616527499769684,0.6616527499769684,3.020414113998413,-2.6500942707061768,0.0,0.0,0.0,0.053610935195248025,0.998561897945706,4.54526980972485,-5.0953988639355,0.7007085382241565,0.0,0.0,0.0,1.0
1717775699.0726051,map,True,True,3,3,0.6616527499769684,0.6616527499769684,3.2576088905334473,-2.690190315246582,0.0,0.0,0.0,0.05164234942512128,0.9986656495426747,4.589020926993726,-4.89092556985244,0.6884855775707361,0.0,0.0,0.0,1.0
1717775699.1217923,map,True,True,3,3,0.6616527499769684,0.6616527499769684,3.2576088905334473,-2.690190315246582,0.0,0.0,0.0,0.05164234942512128,0.9986656495426747,4.583012572677678,-4.8660795376636266,0.6883978613566679,0.0,0.0,0.0,1.0
1717775699.1721432,map,True,True,3,3,0.6616527499769684,0.6616527499769684,3.2576088905334473,-2.690190315246582,0.0,0.0,0.0,0.05164234942512128,0.9986656495426747,4.583012572677678,-4.8660795376636266,0.6883978613566679,0.0,0.0,0.0,1.0
1717775699.2222695,map,True,True,3,3,0.6616527499769684,0.6616527499769684,3.2576088905334473,-2.690190315246582,0.0,0.0,0.0,0.05164234942512128,0.9986656495426747,4.583012572677678,-4.8660795376636266,0.6883978613566679,0.0,0.0,0.0,1.0
1717775699.3212786,map,True,True,3,3,0.6616527499769684,0.6616527499769684,3.2576088905334473,-2.690190315246582,0.0,0.0,0.0,0.05164234942512128,0.9986656495426747,4.583012572677678,-4.8660795376636266,0.6883978613566679,0.0,0.0,0.0,1.0
1717775699.372369,map,True,True,3,3,0.6616527499769684,0.6616527499769684,3.2576088905334473,-2.690190315246582,0.0,0.0,0.0,0.05164234942512128,0.9986656495426747,4.583012572677678,-4.8660795376636266,0.6883978613566679,0.0,0.0,0.0,1.0
1717775699.4716318,map,True,False,3,2,0.0,0.0,3.2576088905334473,-2.690190315246582,0.0,0.0,0.0,0.05164234942512128,0.9986656495426747,4.6961241495296004,-4.688698913625073,0.684442788032532,0.0,0.0,0.0,1.0
1717775699.5709143,map,True,False,3,2,0.0,0.0,3.2576088905334473,-2.690190315246582,0.0,0.0,0.0,0.05164234942512128,0.9986656495426747,4.6961241495296004,-4.688698913625073,0.684442788032532,0.0,0.0,0.0,1.0
1717775699.7743683,map,True,False,3,2,0.0,0.0,3.2576088905334473,-2.690190315246582,0.0,0.0,0.0,0.05164234942512128,0.9986656495426747,4.696234065110288,-4.4961870578217535,0.6839789896580104,0.0,0.0,0.0,1.0
1717775699.8735807,map,True,False,3,2,0.0,0.0,3.2576088905334473,-2.690190315246582,0.0,0.0,0.0,0.05164234942512128,0.9986656495426747,4.698643823691131,-4.484434321579541,0.6839417511032253,0.0,0.0,0.0,1.0
1717775699.9235685,map,True,False,3,2,0.0,0.0,3.296599864959717,-2.706810474395752,0.0,0.0,0.0,0.05428141130928172,0.9985256800866444,4.698643823691131,-4.484434321579541,0.6839417511032253,0.0,0.0,0.0,1.0
1717775700.0240724,map,True,False,3,2,0.0,0.0,3.296599864959717,-2.706810474395752,0.0,0.0,0.0,0.05428141130928172,0.9985256800866444,4.698643823691131,-4.484434321579541,0.6839417511032253,0.0,0.0,0.0,1.0
1717775700.1256158,map,True,False,3,2,0.0,0.0,3.296599864959717,-2.706810474395752,0.0,0.0,0.0,0.05428141130928172,0.9985256800866444,4.737080131482944,-4.305265065068131,0.68609208964823,0.0,0.0,0.0,1.0
1717775700.2242627,map,True,False,3,2,0.0,0.0,3.296599864959717,-2.706810474395752,0.0,0.0,0.0,0.05428141130928172,0.9985256800866444,4.737080131482944,-4.305265065068131,0.68609208964823,0.0,0.0,0.0,1.0
1717775700.2742429,map,True,False,3,2,0.0,0.0,3.296599864959717,-2.706810474395752,0.0,0.0,0.0,0.05428141130928172,0.9985256800866444,4.737080131482944,-4.305265065068131,0.68609208964823,0.0,0.0,0.0,1.0
1717775700.3246717,map,True,False,3,2,0.0,0.0,3.296599864959717,-2.706810474395752,0.0,0.0,0.0,0.05428141130928172,0.9985256800866444,4.737080131482944,-4.305265065068131,0.68609208964823,0.0,0.0,0.0,1.0
1717775700.3754454,map,True,False,3,2,0.0,0.0,3.296599864959717,-2.706810474395752,0.0,0.0,0.0,0.05428141130928172,0.9985256800866444,4.737080131482944,-4.305265065068131,0.68609208964823,0.0,0.0,0.0,1.0
1717775700.4743407,map,True,False,2,2,0.49874686716791977,0.49874686716791977,3.392652750015259,-2.7295339107513428,0.0,0.0,0.0,0.05518528474383584,0.9984761339572261,4.708336685400706,-4.185017810394604,0.6856781016797306,0.0,0.0,0.0,1.0
1717775700.5250082,map,True,True,2,2,0.49874686716791977,0.49874686716791977,3.392652750015259,-2.7295339107513428,0.0,0.0,0.0,0.05518528474383584,0.9984761339572261,4.708336685400706,-4.185017810394604,0.6856781016797306,0.0,0.0,0.0,1.0
1717775700.624111,map,True,True,2,2,0.49874686716791977,0.49874686716791977,3.392652750015259,-2.7295339107513428,0.0,0.0,0.0,0.05518528474383584,0.9984761339572261,4.708336685400706,-4.185017810394604,0.6856781016797306,0.0,0.0,0.0,1.0
1717775700.775842,map,True,False,2,2,0.49874686716791977,0.49874686716791977,3.392652750015259,-2.7295339107513428,0.0,0.0,0.0,0.05518528474383584,0.9984761339572261,4.7248959456629525,-4.047853047942673,0.6829963802900245,0.0,0.0,0.0,1.0
1717775700.8261368,map,True,False,2,2,0.49874686716791977,0.49874686716791977,3.392652750015259,-2.7295339107513428,0.0,0.0,0.0,0.05518528474383584,0.9984761339572261,4.7248959456629525,-4.047853047942673,0.6829963802900245,0.0,0.0,0.0,1.0
1717775700.9261875,map,True,True,2,2,0.49874686716791977,0.49874686716791977,3.392652750015259,-2.7295339107513428,0.0,0.0,0.0,0.05518528474383584,0.9984761339572261,4.7248959456629525,-4.047853047942673,0.6829963802900245,0.0,0.0,0.0,1.0
1717775701.0261517,map,True,False,2,2,0.49874686716791977,0.49874686716791977,3.4779179096221924,-2.7430405616760254,0.0,0.0,0.0,0.05618317649745403,0.998420481171127,4.7248959456629525,-4.047853047942673,0.6829963802900245,0.0,0.0,0.0,1.0
1717775701.126352,map,True,False,2,2,0.49874686716791977,0.49874686716791977,3.4779179096221924,-2.7430405616760254,0.0,0.0,0.0,0.05618317649745403,0.998420481171127,4.737828709700765,-3.9851826978162217,0.6828861600863274,0.0,0.0,0.0,1.0
1717775701.1761754,map,True,False,2,2,0.49874686716791977,0.49874686716791977,3.4779179096221924,-2.7430405616760254,0.0,0.0,0.0,0.05618317649745403,0.998420481171127,4.737828709700765,-3.9851826978162217,0.6828861600863274,0.0,0.0,0.0,1.0
1717775701.2761846,map,True,False,2,2,0.49874686716791977,0.49874686716791977,3.4779179096221924,-2.7430405616760254,0.0,0.0,0.0,0.05618317649745403,0.998420481171127,4.737828709700765,-3.9851826978162217,0.6828861600863274,0.0,0.0,0.0,1.0
1717775701.3757236,map,True,False,2,2,0.49874686716791977,0.49874686716791977,3.4779179096221924,-2.7430405616760254,0.0,0.0,0.0,0.05618317649745403,0.998420481171127,4.737828709700765,-3.9851826978162217,0.6828861600863274,0.0,0.0,0.0,1.0
1717775701.4259515,map,True,False,2,2,0.49874686716791977,0.49874686716791977,3.4779179096221924,-2.7430405616760254,0.0,0.0,0.0,0.05618317649745403,0.998420481171127,4.756521607078674,-3.9690086288772877,0.682824978615253,0.0,0.0,0.0,1.0
1717775701.5254807,map,True,True,2,2,0.49874686716791977,0.49874686716791977,3.4779179096221924,-2.7430405616760254,0.0,0.0,0.0,0.05618317649745403,0.998420481171127,4.756521607078674,-3.9690086288772877,0.682824978615253,0.0,0.0,0.0,1.0
1717775701.6252453,map,True,False,2,2,0.49874686716791977,0.49874686716791977,3.5585548877716064,-2.781196355819702,0.0,0.0,0.0,0.05688577930318697,0.9983806910344868,4.756521607078674,-3.9690086288772877,0.682824978615253,0.0,0.0,0.0,1.0
1717775701.7774026,map,True,True,2,2,0.49874686716791977,0.49874686716791977,3.5585548877716064,-2.781196355819702,0.0,0.0,0.0,0.05688577930318697,0.9983806910344868,4.79121959406391,-3.955082377281862,0.6848214104466085,0.0,0.0,0.0,1.0
1717775701.8788168,map,True,True,2,2,0.49874686716791977,0.49874686716791977,3.5585548877716064,-2.781196355819702,0.0,0.0,0.0,0.05688577930318697,0.9983806910344868,4.79121959406391,-3.955082377281862,0.6848214104466085,0.0,0.0,0.0,1.0
1717775701.97684,map,True,False,2,2,0.49874686716791977,0.49874686716791977,3.5585548877716064,-2.781196355819702,0.0,0.0,0.0,0.05688577930318697,0.9983806910344868,4.79121959406391,-3.955082377281862,0.6848214104466085,0.0,0.0,0.0,1.0
1717775702.028364,map,True,True,2,2,0.49874686716791977,0.49874686716791977,3.5585548877716064,-2.781196355819702,0.0,0.0,0.0,0.05688577930318697,0.9983806910344868,4.79121959406391,-3.955082377281862,0.6848214104466085,0.0,0.0,0.0,1.0
1717775702.0784338,map,True,False,2,2,0.49874686716791977,0.49874686716791977,3.5585548877716064,-2.781196355819702,0.0,0.0,0.0,0.05688577930318697,0.9983806910344868,4.827466591317446,-3.9234534916321735,0.682762841748506,0.0,0.0,0.0,1.0
1717775702.133977,map,True,True,2,2,0.49874686716791977,0.49874686716791977,3.5585548877716064,-2.781196355819702,0.0,0.0,0.0,0.05688577930318697,0.9983806910344868,4.816963045471734,-3.9169835768020005,0.6827731158233928,0.0,0.0,0.0,1.0
1717775702.22889,map,True,False,2,2,0.49874686716791977,0.49874686716791977,3.6366310119628906,-2.7851028442382812,0.0,0.0,0.0,0.055502627189757396,0.99845853852029,4.816963045471734,-3.9169835768020005,0.6827731158233928,0.0,0.0,0.0,1.0
1717775702.330338,map,True,True,2,2,0.49874686716791977,0.49874686716791977,3.6366310119628906,-2.7851028442382812,0.0,0.0,0.0,0.055502627189757396,0.99845853852029,4.816963045471734,-3.9169835768020005,0.6827731158233928,0.0,0.0,0.0,1.0
1717775702.3789234,map,True,True,2,2,0.49874686716791977,0.49874686716791977,3.6366310119628906,-2.7851028442382812,0.0,0.0,0.0,0.055502627189757396,0.99845853852029,4.816963045471734,-3.9169835768020005,0.6827731158233928,0.0,0.0,0.0,1.0
1717775702.4388697,map,True,False,2,2,0.49874686716791977,0.49874686716791977,3.6366310119628906,-2.7851028442382812,0.0,0.0,0.0,0.055502627189757396,0.99845853852029,4.829487538988095,-3.8876316472411956,0.6827128885701925,0.0,0.0,0.0,1.0
1717775702.4893153,map,True,False,2,2,0.49874686716791977,0.49874686716791977,3.6366310119628906,-2.7851028442382812,0.0,0.0,0.0,0.055502627189757396,0.99845853852029,4.829487538988095,-3.8876316472411956,0.6827128885701925,0.0,0.0,0.0,1.0
1717775702.5875187,map,True,False,2,2,0.49874686716791977,0.49874686716791977,3.6366310119628906,-2.7851028442382812,0.0,0.0,0.0,0.055502627189757396,0.99845853852029,4.829487538988095,-3.8876316472411956,0.6827128885701925,0.0,0.0,0.0,1.0
1717775702.738757,map,True,False,2,2,0.49874686716791977,0.49874686716791977,3.735623836517334,-2.8320510387420654,0.0,0.0,0.0,0.05783581542401544,0.9983261076108986,4.862418466467675,-3.897546798986605,0.6827931481185181,0.0,0.0,0.0,1.0
1717775702.7890368,map,True,False,2,2,0.49874686716791977,0.49874686716791977,3.735623836517334,-2.8320510387420654,0.0,0.0,0.0,0.05783581542401544,0.9983261076108986,4.860986550062136,-3.898625677020636,0.6827997540624828,0.0,0.0,0.0,1.0
1717775702.8441308,map,True,False,2,2,0.49874686716791977,0.49874686716791977,3.735623836517334,-2.8320510387420654,0.0,0.0,0.0,0.05783581542401544,0.9983261076108986,4.860986550062136,-3.898625677020636,0.6827997540624828,0.0,0.0,0.0,1.0
1717775702.8953147,map,True,True,2,2,0.49874686716791977,0.49874686716791977,3.735623836517334,-2.8320510387420654,0.0,0.0,0.0,0.05783581542401544,0.9983261076108986,4.860986550062136,-3.898625677020636,0.6827997540624828,0.0,0.0,0.0,1.0
1717775702.9961982,map,True,True,2,2,0.49874686716791977,0.49874686716791977,3.735623836517334,-2.8320510387420654,0.0,0.0,0.0,0.05783581542401544,0.9983261076108986,4.860986550062136,-3.898625677020636,0.6827997540624828,0.0,0.0,0.0,1.0
1717775703.046661,map,True,True,2,2,0.49874686716791977,0.49874686716791977,3.735623836517334,-2.8320510387420654,0.0,0.0,0.0,0.05783581542401544,0.9983261076108986,4.860986550062136,-3.898625677020636,0.6827997540624828,0.0,0.0,0.0,1.0
1717775703.146953,map,True,True,2,2,0.49874686716791977,0.49874686716791977,3.735623836517334,-2.8320510387420654,0.0,0.0,0.0,0.05783581542401544,0.9983261076108986,4.860986550062136,-3.898625677020636,0.6827997540624828,0.0,0.0,0.0,1.0
1717775703.1978757,map,True,True,2,2,0.49874686716791977,0.49874686716791977,3.735623836517334,-2.8320510387420654,0.0,0.0,0.0,0.05783581542401544,0.9983261076108986,4.860986550062136,-3.898625677020636,0.6827997540624828,0.0,0.0,0.0,1.0
1717775703.2472184,map,True,False,1,2,0.0,0.0,3.783494234085083,-2.822887420654297,0.0,0.0,0.0,0.05854478699299104,0.998284776257174,4.860986550062136,-3.898625677020636,0.6827997540624828,0.0,0.0,0.0,1.0
1717775703.2970924,map,True,False,1,2,0.0,0.0,3.783494234085083,-2.822887420654297,0.0,0.0,0.0,0.05854478699299104,0.998284776257174,4.860986550062136,-3.898625677020636,0.6827997540624828,0.0,0.0,0.0,1.0
1717775703.3972387,map,True,False,1,2,0.0,0.0,3.783494234085083,-2.822887420654297,0.0,0.0,0.0,0.05854478699299104,0.998284776257174,4.860986550062136,-3.898625677020636,0.6827997540624828,0.0,0.0,0.0,1.0
1717775703.4986227,map,True,False,1,2,0.0,0.0,3.783494234085083,-2.822887420654297,0.0,0.0,0.0,0.05854478699299104,0.998284776257174,4.860986550062136,-3.898625677020636,0.6827997540624828,0.0,0.0,0.0,1.0
1717775703.5959477,map,True,False,1,2,0.0,0.0,3.783494234085083,-2.822887420654297,0.0,0.0,0.0,0.05854478699299104,0.998284776257174,4.860986550062136,-3.898625677020636,0.6827997540624828,0.0,0.0,0.0,1.0
