car_pos_meter , car_pos_cell, car_speed, ped_pos_meter, ped_pos_cell, ped_speed
-10.25, 10, 2, 3.991729, 10, 1
-10.20835, 10, 1, 3.982408, 10, 1
-10.1876, 10, 1, 3.96261, 10, 1
-10.16685, 10, 1, 3.943021, 10, 1
-10.1461, 10, 1, 3.924242, 10, 1
-10.12535, 10, 2, 3.915042, 10, 1
-10.0837, 10, 1, 3.897462, 10, 1
-10.06295, 10, 1, 3.880357, 10, 1
-10.0422, 10, 2, 3.863618, 10, 1
-10.00055, 10, 2, 3.846737, 10, 1
-9.9589, 9, 2, 3.83819, 10, 1
-9.917251, 9, 2, 3.821876, 10, 1
-9.875601, 9, 2, 3.805709, 10, 1
-9.833951, 9, 2, 3.790723, 10, 1
-9.792301, 9, 2, 3.776157, 10, 1
-9.750651, 9, 2, 3.762089, 10, 1
-9.709002, 9, 2, 3.755032, 10, 1
-9.667352, 9, 2, 3.740489, 10, 1
-9.625702, 9, 2, 3.725745, 10, 1
-9.584052, 9, 2, 3.711039, 10, 1
-9.542402, 9, 1, 3.703434, 9, 1
-9.521652, 9, 1, 3.688132, 9, 1
-9.500902, 9, 2, 3.672545, 9, 1
-9.459252, 9, 1, 3.656493, 9, 1
-9.438502, 9, 2, 3.640745, 9, 1
-9.396852, 9, 2, 3.624824, 9, 1
-9.355203, 9, 1, 3.616971, 9, 1
-9.334453, 9, 2, 3.601272, 9, 1
-9.292803, 9, 1, 3.585302, 9, 1
-9.272053, 9, 2, 3.569307, 9, 1
-9.230403, 9, 1, 3.553044, 9, 1
-9.209653, 9, 1, 3.545125, 9, 1
-9.188903, 9, 1, 3.529403, 9, 1
-9.168153, 9, 2, 3.513507, 9, 1
-9.126503, 9, 2, 3.497391, 9, 1
-9.084853, 9, 1, 3.489166, 9, 1
-9.064103, 9, 1, 3.473127, 9, 1
-9.043353, 9, 2, 3.457561, 9, 1
-9.001703, 9, 2, 3.443326, 9, 1
-8.960053, 8, 2, 3.428784, 9, 1
-8.918404, 8, 2, 3.413628, 9, 1
-8.876754, 8, 2, 3.405912, 9, 1
-8.835104, 8, 2, 3.39168, 9, 1
-8.793454, 8, 2, 3.377954, 9, 1
-8.751804, 8, 2, 3.365027, 9, 1
-8.710155, 8, 2, 3.352113, 9, 1
-8.668505, 8, 2, 3.345769, 9, 1
-8.626855, 8, 2, 3.332945, 8, 1
-8.585205, 8, 2, 3.319534, 8, 1
-8.543555, 8, 2, 3.305991, 8, 1
-8.501905, 8, 1, 3.292059, 8, 1
-8.481155, 8, 1, 3.285078, 8, 1
-8.460405, 8, 2, 3.270962, 8, 1
-8.418756, 8, 2, 3.256649, 8, 1
-8.377106, 8, 2, 3.242635, 8, 1
-8.335456, 8, 1, 3.228923, 8, 1
-8.314706, 8, 2, 3.222108, 8, 1
-8.273056, 8, 1, 3.209, 8, 1
-8.252306, 8, 1, 3.196414, 8, 1
-8.231556, 8, 1, 3.184672, 8, 1
-8.210806, 8, 1, 3.173151, 8, 1
-8.190056, 8, 1, 3.167457, 8, 1
-8.169306, 8, 2, 3.156072, 8, 1
-8.127656, 8, 2, 3.143447, 8, 1
-8.086006, 8, 1, 3.131994, 8, 1
-8.065256, 8, 1, 3.120488, 8, 1
-8.044506, 8, 2, 3.11483, 8, 1
-8.002856, 8, 1, 3.103906, 8, 1
-7.982106, 7, 2, 3.093914, 8, 1
-7.940456, 7, 2, 3.084094, 8, 1
-7.898807, 7, 2, 3.074419, 8, 1
-7.857157, 7, 2, 3.069626, 8, 1
-7.815507, 7, 2, 3.060687, 8, 1
-7.773857, 7, 2, 3.052381, 8, 1
-7.732207, 7, 2, 3.04457, 8, 1
-7.690557, 7, 2, 3.037196, 8, 1
-7.648908, 7, 2, 3.033634, 8, 1
-7.607258, 7, 2, 3.026932, 8, 1
-7.565608, 7, 2, 3.020667, 8, 1
-7.523958, 7, 2, 3.014902, 8, 1
-7.482308, 7, 2, 3.009552, 8, 1
-7.440659, 7, 2, 3.007075, 8, 1
-7.399009, 7, 2, 3.00237, 8, 1
-7.357359, 7, 2, 2.99805, 8, 1
-7.315709, 7, 2, 2.99409, 8, 1
-7.274059, 7, 2, 2.990856, 8, 1
-7.232409, 7, 2, 2.989665, 8, 1
-7.19076, 7, 2, 2.987234, 8, 1
-7.14911, 7, 2, 2.985252, 8, 1
-7.10746, 7, 2, 2.983632, 8, 1
-7.06581, 7, 2, 2.981993, 8, 1
-7.02416, 7, 2, 2.981236, 8, 1
-6.982511, 6, 2, 2.979986, 8, 1
-6.940861, 6, 2, 2.979032, 8, 1
-6.899211, 6, 2, 2.977952, 8, 1
-6.857561, 6, 2, 2.976516, 8, 1
-6.815911, 6, 2, 2.975889, 8, 1
-6.774261, 6, 2, 2.974694, 8, 1
-6.732612, 6, 2, 2.97377, 8, 1
-6.690962, 6, 2, 2.972849, 8, 1
-6.649312, 6, 2, 2.971793, 8, 1
-6.607662, 6, 2, 2.971179, 8, 1
-6.566012, 6, 2, 2.970364, 8, 1
-6.524363, 6, 2, 2.969403, 8, 1
-6.482713, 6, 2, 2.968569, 8, 1
-6.441063, 6, 2, 2.967599, 8, 1
-6.399413, 6, 2, 2.967255, 8, 1
-6.357763, 6, 2, 2.966411, 8, 1
-6.316113, 6, 2, 2.96572, 8, 1
-6.274464, 6, 2, 2.964983, 8, 1
-6.232814, 6, 2, 2.964198, 8, 1
-6.191164, 6, 2, 2.963988, 8, 1
-6.149514, 6, 2, 2.963277, 8, 1
-6.107864, 6, 2, 2.962743, 7, 1
-6.066215, 6, 2, 2.962178, 7, 1
-6.024565, 6, 2, 2.961279, 7, 1
-5.982915, 5, 2, 2.961016, 7, 1
-5.941265, 5, 2, 2.960747, 7, 1
-5.899615, 5, 2, 2.960346, 7, 1
-5.857965, 5, 2, 2.960063, 7, 1
-5.816316, 5, 2, 2.959853, 7, 1
-5.774666, 5, 2, 2.959887, 7, 1
-5.733016, 5, 2, 2.959517, 7, 1
-5.691366, 5, 2, 2.959456, 7, 1
-5.649716, 5, 2, 2.959023, 7, 1
-5.608067, 5, 2, 2.958848, 7, 1
-5.566417, 5, 2, 2.9587, 7, 1
-5.524767, 5, 2, 2.958558, 7, 1
-5.483117, 5, 2, 2.958388, 7, 1
-5.441467, 5, 2, 2.95819, 7, 1
-5.399817, 5, 2, 2.95794, 7, 1
-5.358168, 5, 2, 2.957829, 7, 1
-5.316518, 5, 2, 2.957585, 7, 1
-5.274868, 5, 2, 2.957227, 7, 1
-5.233218, 5, 2, 2.95702, 7, 1
-5.191568, 5, 2, 2.956869, 7, 1
-5.149919, 5, 2, 2.95655, 7, 1
-5.108269, 5, 2, 2.956435, 7, 1
-5.066619, 5, 2, 2.956804, 7, 1
-5.024969, 5, 2, 2.956767, 7, 1
-4.983319, 4, 2, 2.956605, 7, 1
-4.941669, 4, 2, 2.956517, 7, 1
-4.90002, 4, 2, 2.956799, 7, 1
-4.85837, 4, 2, 2.956895, 7, 1
-4.81672, 4, 2, 2.956878, 7, 1
-4.77507, 4, 2, 2.957042, 7, 1
-4.73342, 4, 2, 2.957042, 7, 1
-4.691771, 4, 2, 2.95712, 7, 1
-4.650121, 4, 2, 2.957261, 7, 1
-4.608471, 4, 2, 2.957432, 7, 1
-4.566821, 4, 2, 2.95762, 7, 1
-4.525171, 4, 2, 2.957598, 7, 1
-4.483521, 4, 2, 2.957616, 7, 1
-4.441872, 4, 2, 2.957497, 7, 1
-4.400222, 4, 2, 2.957406, 7, 1
-4.358572, 4, 2, 2.957318, 7, 1
-4.316922, 4, 2, 2.957264, 7, 1
-4.275272, 4, 2, 2.957312, 7, 1
-4.233623, 4, 2, 2.957479, 7, 1
-4.191973, 4, 2, 2.957607, 7, 1
-4.150323, 4, 2, 2.957597, 7, 1
-4.108673, 4, 2, 2.957643, 7, 1
-4.067023, 4, 2, 2.957519, 7, 1
-4.025373, 4, 2, 2.957809, 7, 1
-3.983723, 3, 2, 2.957812, 7, 1
-3.942073, 3, 2, 2.957786, 7, 1
-3.900423, 3, 2, 2.957828, 7, 1
-3.858773, 3, 2, 2.957747, 7, 1
-3.817123, 3, 2, 2.957748, 7, 1
-3.775473, 3, 2, 2.957727, 7, 1
-3.733823, 3, 2, 2.957961, 7, 1
-3.692173, 3, 2, 2.957972, 7, 1
-3.650523, 3, 2, 2.957867, 7, 1
-3.608873, 3, 2, 2.957907, 7, 1
-3.567223, 3, 2, 2.957836, 7, 1
-3.525573, 3, 2, 2.957237, 7, 1
-3.483923, 3, 2, 2.957134, 7, 1
-3.442273, 3, 2, 2.956939, 7, 1
-3.400623, 3, 2, 2.956493, 7, 1
-3.358973, 3, 2, 2.956104, 7, 1
-3.317322, 3, 2, 2.955927, 7, 1
-3.275672, 3, 2, 2.955806, 7, 1
-3.234022, 3, 2, 2.955313, 7, 1
-3.192372, 3, 2, 2.954997, 7, 1
-3.150722, 3, 2, 2.954605, 7, 1
-3.109072, 3, 2, 2.954168, 7, 1
-3.067422, 3, 2, 2.954051, 7, 1
-3.025772, 3, 2, 2.953641, 7, 1
-2.984122, 2, 2, 2.953466, 7, 1
-2.942472, 2, 2, 2.953229, 7, 1
-2.900822, 2, 2, 2.953155, 7, 1
-2.859172, 2, 2, 2.952937, 7, 1
-2.817522, 2, 2, 2.952719, 7, 1
-2.775872, 2, 2, 2.952615, 7, 1
-2.734222, 2, 2, 2.952422, 7, 1
-2.692572, 2, 2, 2.952309, 7, 1
-2.650922, 2, 2, 2.952542, 7, 1
-2.609272, 2, 2, 2.952519, 7, 1
-2.567621, 2, 2, 2.952401, 7, 1
-2.525971, 2, 2, 2.952579, 7, 1
-2.484321, 2, 2, 2.952797, 7, 1
-2.442671, 2, 2, 2.952987, 7, 1
-2.401021, 2, 2, 2.953213, 7, 1
-2.359371, 2, 2, 2.95362, 7, 1
-2.317721, 2, 2, 2.953922, 7, 1
-2.276071, 2, 2, 2.954025, 7, 1
-2.234421, 2, 2, 2.954067, 7, 1
-2.192771, 2, 2, 2.954096, 7, 1
-2.151121, 2, 2, 2.954457, 7, 1
-2.109471, 2, 2, 2.954554, 7, 1
-2.067821, 2, 2, 2.954941, 7, 1
-2.026171, 2, 2, 2.955033, 7, 1
-1.984521, 1, 2, 2.955569, 7, 1
-1.942871, 1, 2, 2.955689, 7, 1
-1.901221, 1, 2, 2.956005, 7, 1
-1.859571, 1, 2, 2.956137, 7, 1
-1.81792, 1, 2, 2.956022, 7, 1
-1.77627, 1, 2, 2.955939, 7, 1
-1.73462, 1, 2, 2.95614, 7, 1
-1.69297, 1, 2, 2.956245, 7, 1
-1.65132, 1, 2, 2.956234, 7, 1
-1.60967, 1, 2, 2.956158, 7, 1
-1.56802, 1, 2, 2.956017, 7, 1
-1.52637, 1, 2, 2.95612, 7, 1
-1.48472, 1, 2, 2.956061, 7, 1
-1.44307, 1, 2, 2.955934, 7, 1
-1.40142, 1, 2, 2.955897, 7, 1
-1.35977, 1, 2, 2.955844, 7, 1
-1.31812, 1, 2, 2.955804, 7, 1
-1.27647, 1, 2, 2.955543, 7, 1
-1.23482, 1, 2, 2.95529, 7, 1
-1.19317, 1, 2, 2.955308, 7, 1
-1.15152, 1, 2, 2.955138, 7, 1
-1.109869, 1, 2, 2.95508, 7, 1
-1.068219, 1, 2, 2.954839, 7, 1
-1.026569, 1, 2, 2.954505, 7, 1
-0.9849194, 0, 2, 2.95427, 7, 1
-0.9432694, 0, 2, 2.954055, 7, 1
-0.9016194, 0, 2, 2.953552, 7, 1
-0.8599694, 0, 2, 2.95313, 7, 1
-0.8183194, 0, 2, 2.95267, 7, 1
-0.7766694, 0, 2, 2.952256, 7, 1
-0.7350194, 0, 2, 2.951901, 7, 1
-0.6933694, 0, 2, 2.951448, 7, 1
-0.6517194, 0, 2, 2.950893, 7, 1
-0.6100694, 0, 2, 2.950263, 7, 1
-0.5684194, 0, 2, 2.94981, 7, 1
-0.5267694, 0, 2, 2.94934, 7, 1
-0.4851194, 0, 2, 2.948579, 7, 1
-0.4434694, 0, 2, 2.947778, 7, 1
-0.4018194, 0, 2, 2.947228, 7, 1
-0.3601694, 0, 2, 2.946392, 7, 1
-0.3185194, 0, 2, 2.945938, 7, 1
-0.2768694, 0, 2, 2.945153, 7, 1
-0.2352194, 0, 2, 2.944391, 7, 1
-0.1935694, 0, 2, 2.943663, 7, 1
-0.1519194, 0, 2, 2.94289, 7, 1
-0.1102694, 0, 2, 2.94239, 7, 1
-0.06861943, 0, 2, 2.941495, 7, 1
-0.02696943, 0, 2, 2.940341, 7, 1
0.01468056, 0, 2, 2.939176, 7, 1
0.05633056, 0, 2, 2.938129, 7, 1
0.09798056, 0, 2, 2.937425, 7, 1
0.1396306, 0, 2, 2.93649, 7, 1
0.1812806, 0, 2, 2.935277, 7, 1
0.2229306, 0, 2, 2.934039, 7, 1
0.2645805, 0, 2, 2.932645, 7, 1
0.3062305, 0, 2, 2.931864, 7, 1
0.3478805, 0, 2, 2.930791, 7, 1
0.3895305, 0, 2, 2.929625, 7, 1
0.4311805, 0, 2, 2.928673, 7, 1
0.4728305, 0, 2, 2.928111, 7, 1
0.5144805, 0, 2, 2.927461, 7, 1
0.5561305, 0, 2, 2.926763, 7, 1
0.5977805, 0, 2, 2.925622, 7, 1
0.6394305, 0, 2, 2.924293, 7, 1
0.6810805, 0, 2, 2.922518, 7, 1
0.7227305, 0, 2, 2.921648, 7, 1
0.7643805, 0, 2, 2.920111, 7, 1
0.8060305, 0, 2, 2.918371, 7, 1
0.8476805, 0, 2, 2.916915, 7, 1
0.8893305, 0, 2, 2.915508, 7, 1
0.9309805, 0, 2, 2.914883, 7, 1
0.9726305, 0, 2, 2.914295, 7, 1
1.014281, -1, 2, 2.914009, 7, 1
1.055931, -1, 2, 2.914074, 7, 1
1.097581, -1, 2, 2.914546, 7, 1
1.139231, -1, 2, 2.914763, 7, 1
1.180881, -1, 2, 2.915877, 7, 1
1.222531, -1, 2, 2.917196, 7, 1
1.264181, -1, 2, 2.918702, 7, 1
1.305831, -1, 2, 2.919443, 7, 1
1.347481, -1, 2, 2.921955, 7, 1
1.389131, -1, 2, 2.924405, 7, 1
1.430781, -1, 2, 2.927216, 7, 1
1.472431, -1, 2, 2.930447, 7, 1
1.514081, -1, 2, 2.933831, 7, 1
1.555731, -1, 2, 2.935473, 7, 1
1.597381, -1, 2, 2.939282, 7, 1
1.639031, -1, 2, 2.942794, 7, 1
1.680681, -1, 2, 2.945812, 7, 1
1.722332, -1, 2, 2.948655, 7, 1
1.763982, -1, 2, 2.949883, 7, 1
1.805632, -1, 2, 2.952269, 7, 1
1.847282, -1, 2, 2.954017, 7, 1
1.888932, -1, 2, 2.955232, 7, 1
1.930582, -1, 2, 2.955904, 7, 1
1.972232, -1, 2, 2.956613, 7, 1
2.013882, -2, 2, 2.957294, 7, 1
2.055532, -2, 2, 2.957573, 7, 1
2.097182, -2, 2, 2.957654, 7, 1
2.138832, -2, 2, 2.957788, 7, 1
2.180482, -2, 2, 2.955085, 7, 1
2.222132, -2, 2, 2.952854, 7, 1
2.263782, -2, 2, 2.951947, 7, 1
2.305432, -2, 2, 2.9508, 7, 1
2.347082, -2, 2, 2.949763, 7, 1
2.388732, -2, 2, 2.949193, 7, 1
2.430382, -2, 2, 2.947823, 7, 1
2.472033, -2, 2, 2.946702, 7, 1
2.513683, -2, 2, 2.945213, 7, 1
2.555333, -2, 2, 2.944012, 7, 1
2.596983, -2, 2, 2.943303, 7, 1
2.638633, -2, 2, 2.942121, 7, 1
2.680283, -2, 2, 2.940919, 7, 1
2.721933, -2, 2, 2.939541, 7, 1
2.763583, -2, 2, 2.938375, 7, 1
2.805233, -2, 2, 2.93757, 7, 1
2.846883, -2, 2, 2.936368, 7, 1
2.888533, -2, 2, 2.934993, 7, 1
2.930183, -2, 2, 2.933488, 7, 1
2.971833, -2, 2, 2.932176, 7, 1
3.013483, -3, 2, 2.931585, 7, 1
3.055133, -3, 2, 2.930132, 7, 1
3.096783, -3, 2, 2.928828, 7, 1
3.138433, -3, 2, 2.927397, 7, 1
3.180084, -3, 2, 2.925896, 7, 1
3.221734, -3, 2, 2.925229, 7, 1
3.263384, -3, 2, 2.923535, 7, 1
3.305034, -3, 2, 2.921733, 7, 1
3.346684, -3, 2, 2.919334, 7, 1
3.388334, -3, 2, 2.916612, 7, 1
3.429984, -3, 2, 2.91554, 7, 1
3.471634, -3, 2, 2.911417, 7, 1
3.513284, -3, 2, 2.906442, 7, 1
3.554934, -3, 2, 2.900833, 7, 1
3.596584, -3, 2, 2.895269, 7, 1
3.638234, -3, 2, 2.89252, 7, 1
3.679884, -3, 2, 2.88674, 7, 1
3.721534, -3, 2, 2.880788, 7, 1
3.763184, -3, 2, 2.874659, 7, 1
3.804834, -3, 2, 2.868804, 7, 1
3.846484, -3, 2, 2.865111, 7, 1
3.888134, -3, 2, 2.858674, 7, 1
3.929785, -3, 2, 2.851549, 7, 1
3.971435, -3, 2, 2.844344, 7, 1
4.013084, -4, 2, 2.836281, 7, 1
4.054734, -4, 2, 2.831783, 7, 1
4.096384, -4, 2, 2.822591, 7, 1
4.138034, -4, 2, 2.812939, 7, 1
4.179684, -4, 2, 2.802279, 7, 1
4.221334, -4, 2, 2.791448, 7, 1
4.262983, -4, 2, 2.786197, 7, 1
4.304633, -4, 2, 2.775076, 7, 1
4.346283, -4, 2, 2.762807, 7, 1
4.387933, -4, 2, 2.749972, 7, 1
4.429583, -4, 2, 2.735458, 7, 1
4.471232, -4, 2, 2.728048, 7, 1
4.512882, -4, 2, 2.711285, 7, 1
4.554532, -4, 2, 2.694699, 7, 1
4.596182, -4, 2, 2.677382, 7, 1
4.637832, -4, 2, 2.659255, 7, 1
4.679482, -4, 2, 2.649285, 7, 1
4.721131, -4, 2, 2.630809, 7, 1
4.762781, -4, 2, 2.611669, 7, 1
4.804431, -4, 2, 2.592269, 6, 1
4.846081, -4, 2, 2.572047, 6, 1
4.887731, -4, 2, 2.561295, 6, 1
4.92938, -4, 2, 2.539318, 6, 1
4.97103, -4, 2, 2.517503, 6, 1
5.01268, -5, 2, 2.496862, 6, 1
5.05433, -5, 2, 2.476223, 6, 1
5.09598, -5, 2, 2.466268, 6, 1
5.13763, -5, 2, 2.446987, 6, 1
5.179279, -5, 2, 2.426246, 6, 1
5.220929, -5, 2, 2.404772, 6, 1
5.262579, -5, 2, 2.383336, 6, 1
5.304229, -5, 2, 2.372695, 6, 1
5.345879, -5, 2, 2.351609, 6, 1
5.387528, -5, 2, 2.330572, 6, 1
5.429178, -5, 2, 2.309885, 6, 1
5.470828, -5, 2, 2.288863, 6, 1
5.512478, -5, 2, 2.277922, 6, 1
5.554128, -5, 2, 2.25583, 6, 1
5.595778, -5, 2, 2.232669, 6, 1
5.637427, -5, 2, 2.208619, 5, 1
5.679077, -5, 2, 2.184526, 5, 1
5.720727, -5, 2, 2.17225, 5, 1
5.762377, -5, 2, 2.147207, 5, 1
5.804027, -5, 2, 2.122755, 5, 1
5.845676, -5, 2, 2.098896, 5, 1
5.887326, -5, 2, 2.073769, 5, 1
5.928976, -5, 2, 2.061244, 5, 1
5.970626, -5, 2, 2.036229, 5, 1
6.012276, -6, 2, 2.011211, 5, 1
6.053926, -6, 2, 1.984959, 5, 1
6.095575, -6, 2, 1.958624, 5, 1
6.137225, -6, 2, 1.946417, 5, 1
6.178875, -6, 2, 1.921648, 5, 1
6.220525, -6, 2, 1.896617, 5, 1
6.262175, -6, 2, 1.871521, 5, 1
6.303824, -6, 2, 1.846241, 4, 1
6.345474, -6, 2, 1.833644, 4, 1
6.387124, -6, 2, 1.807337, 4, 1
6.428774, -6, 2, 1.781095, 4, 1
6.470424, -6, 2, 1.755956, 4, 1
6.512074, -6, 2, 1.730956, 4, 1
6.553723, -6, 2, 1.718562, 4, 1
6.595373, -6, 2, 1.694413, 4, 1
6.637023, -6, 2, 1.669131, 4, 1
6.678673, -6, 2, 1.643666, 4, 1
6.720323, -6, 2, 1.617924, 4, 1
6.761972, -6, 2, 1.605522, 4, 1
6.803622, -6, 2, 1.579727, 4, 1
6.845272, -6, 2, 1.553944, 4, 1
6.886922, -6, 2, 1.527459, 4, 1
6.928572, -6, 2, 1.500642, 4, 1
6.970222, -6, 2, 1.488043, 4, 1
7.011871, -7, 2, 1.460377, 3, 1
7.053521, -7, 2, 1.431883, 3, 1
7.095171, -7, 2, 1.402671, 3, 1
7.136821, -7, 2, 1.373666, 3, 1
7.178471, -7, 2, 1.359297, 3, 1
7.22012, -7, 2, 1.331106, 3, 1
7.26177, -7, 2, 1.303041, 3, 1
7.30342, -7, 2, 1.273724, 3, 1
7.34507, -7, 2, 1.246668, 3, 1
7.38672, -7, 2, 1.219315, 3, 1
7.42837, -7, 2, 1.205158, 3, 1
7.470019, -7, 2, 1.176945, 3, 1
7.511669, -7, 2, 1.150213, 3, 1
7.553319, -7, 2, 1.12473, 3, 1
7.594969, -7, 2, 1.111755, 3, 1
7.636619, -7, 2, 1.086809, 2, 1
7.678268, -7, 2, 1.061625, 2, 1
7.719918, -7, 2, 1.03591, 2, 1
7.761568, -7, 2, 1.01055, 2, 1
7.803218, -7, 2, 0.9972186, 2, 1
7.844868, -7, 2, 0.9708843, 2, 1
7.886518, -7, 2, 0.94451, 2, 1
7.928167, -7, 2, 0.9172289, 2, 1
7.969817, -7, 2, 0.8904765, 2, 1
8.011467, -8, 2, 0.8771076, 2, 1
8.053117, -8, 2, 0.8501859, 2, 1
8.094767, -8, 2, 0.823065, 2, 1
8.136416, -8, 2, 0.7959156, 2, 1
8.178066, -8, 2, 0.7699533, 2, 1
8.219716, -8, 2, 0.7426386, 2, 1
8.261366, -8, 2, 0.7286901, 1, 1
8.303016, -8, 2, 0.700881, 1, 1
8.344666, -8, 2, 0.6736436, 1, 1
8.386315, -8, 2, 0.6468384, 1, 1
8.427965, -8, 2, 0.6199303, 1, 1
8.469615, -8, 2, 0.6067555, 1, 1
8.511265, -8, 2, 0.5798705, 1, 1
8.552915, -8, 2, 0.5533123, 1, 1
8.594564, -8, 2, 0.526983, 1, 1
8.636214, -8, 2, 0.5009403, 1, 1
8.677864, -8, 2, 0.4883795, 1, 1
8.719514, -8, 2, 0.4637938, 1, 1
8.761164, -8, 2, 0.4392216, 1, 1
8.802814, -8, 2, 0.4148934, 1, 1
8.844463, -8, 2, 0.3899105, 1, 1
8.886113, -8, 2, 0.3771448, 1, 1
8.927763, -8, 2, 0.3516381, 0, 1
8.969413, -8, 2, 0.3261762, 0, 1
9.011063, -9, 2, 0.3009243, 0, 1
9.052712, -9, 2, 0.2756591, 0, 1
9.094362, -9, 2, 0.2629113, 0, 1
9.136012, -9, 2, 0.2374585, 0, 1
9.177662, -9, 2, 0.211205, 0, 1
9.219312, -9, 2, 0.1848717, 0, 1
9.260962, -9, 2, 0.1714621, 0, 1
9.302611, -9, 2, 0.1454554, 0, 1
9.344261, -9, 2, 0.1193209, 0, 1
9.385911, -9, 2, 0.09241629, 0, 1
9.427561, -9, 2, 0.06702995, 0, 1
9.469211, -9, 2, 0.04210806, 0, 1
9.51086, -9, 2, 0.02947736, 0, 1
9.55251, -9, 2, 0.005245447, 0, 1
9.59416, -9, 2, -0.01799202, 0, 1
9.63581, -9, 2, -0.04196405, 0, 1
9.67746, -9, 2, -0.06687021, 0, 1
9.71911, -9, 2, -0.07853556, 0, 1
9.760759, -9, 2, -0.100904, 0, 1
9.802409, -9, 2, -0.1230936, 0, 1
9.844059, -9, 2, -0.1443987, 0, 1
9.885709, -9, 2, -0.1651573, 0, 1
9.927359, -9, 2, -0.175251, 0, 1
9.969008, -9, 2, -0.1957831, 0, 1
10.01066, -10, 2, -0.2162933, 0, 1
10.05231, -10, 2, -0.2367802, 0, 1
10.09396, -10, 2, -0.2570186, 0, 1
10.13561, -10, 2, -0.2673302, 0, 1
10.17726, -10, 2, -0.287868, 0, 1
10.21891, -10, 2, -0.308485, 0, 1
10.26056, -10, 2, -0.3290472, 0, 1
10.30221, -10, 2, -0.3498363, 0, 1
10.34386, -10, 2, -0.3604903, 0, 1
10.38551, -10, 2, -0.3816667, -1, 1
10.42716, -10, 2, -0.4029093, -1, 1
10.46881, -10, 2, -0.4244595, -1, 1
10.51046, -10, 2, -0.4457483, -1, 1
10.55211, -10, 2, -0.4562702, -1, 1
10.59376, -10, 2, -0.477077, -1, 1
10.63541, -10, 2, -0.4973822, -1, 1
10.67706, -10, 2, -0.5169687, -1, 1
10.71871, -10, 2, -0.5373173, -1, 1
10.76035, -10, 2, -0.5479708, -1, 1
10.802, -10, 2, -0.5692501, -1, 1
10.84365, -10, 2, -0.5905309, -1, 1
10.8853, -10, 2, -0.6123734, -1, 1
10.92695, -10, 2, -0.63451, -1, 1
10.9686, -10, 2, -0.6452932, -1, 1
11.01025, -11, 2, -0.6664648, -1, 1
11.0519, -11, 2, -0.6871567, -1, 1
11.09355, -11, 2, -0.7075162, -1, 1
11.1352, -11, 2, -0.7270622, -1, 1
11.17685, -11, 2, -0.7365332, -1, 1
11.2185, -11, 2, -0.7547998, -2, 1
11.26015, -11, 2, -0.7729998, -2, 1
11.3018, -11, 2, -0.7916155, -2, 1
11.34345, -11, 2, -0.8109708, -2, 1
11.3851, -11, 2, -0.8205914, -2, 1
11.42675, -11, 2, -0.8398647, -2, 1
11.4684, -11, 2, -0.8594241, -2, 1
11.51005, -11, 2, -0.8792653, -2, 1
11.5517, -11, 2, -0.8990097, -2, 1
11.59335, -11, 2, -0.9087534, -2, 1
11.635, -11, 2, -0.9283371, -2, 1
11.67665, -11, 2, -0.9476013, -2, 1
11.7183, -11, 2, -0.9664874, -2, 1
11.75995, -11, 2, -0.9855371, -2, 1
11.8016, -11, 2, -0.9948463, -2, 1
11.84325, -11, 2, -1.013312, -2, 1
11.8849, -11, 2, -1.031258, -2, 1
11.92655, -11, 2, -1.049112, -2, 1
11.9682, -11, 2, -1.066031, -2, 1
12.00985, -12, 2, -1.074409, -2, 1
12.0515, -12, 2, -1.092997, -2, 1
12.09315, -12, 2, -1.110165, -2, 1
12.1348, -12, 2, -1.125829, -3, 1
12.17645, -12, 2, -1.141797, -3, 1
12.2181, -12, 2, -1.149873, -3, 1
12.25975, -12, 2, -1.166114, -3, 1
12.3014, -12, 2, -1.182728, -3, 1
12.34305, -12, 2, -1.19909, -3, 1
12.3847, -12, 2, -1.214367, -3, 1
12.42635, -12, 2, -1.221536, -3, 1
12.468, -12, 2, -1.235706, -3, 1
12.50965, -12, 2, -1.249372, -3, 1
12.5513, -12, 2, -1.262298, -3, 1
12.59295, -12, 2, -1.274808, -3, 1
12.6346, -12, 2, -1.280765, -3, 1
12.67625, -12, 2, -1.292547, -3, 1
12.7179, -12, 2, -1.303902, -3, 1
12.75955, -12, 2, -1.314407, -3, 1
12.8012, -12, 2, -1.32405, -3, 1
12.84285, -12, 2, -1.32855, -3, 1
12.8845, -12, 2, -1.336293, -3, 1
12.92615, -12, 2, -1.342834, -3, 1
12.9678, -12, 2, -1.347859, -3, 1
13.00945, -13, 2, -1.351601, -3, 1
13.0511, -13, 2, -1.353198, -3, 1
13.09274, -13, 2, -1.355975, -3, 1
13.13439, -13, 2, -1.359015, -3, 1
13.17604, -13, 2, -1.361922, -3, 1
13.21769, -13, 2, -1.363696, -3, 1
13.25934, -13, 2, -1.364435, -3, 1
13.30099, -13, 2, -1.366447, -3, 1
13.34264, -13, 2, -1.369149, -3, 1
13.38429, -13, 2, -1.372377, -3, 1
13.42594, -13, 2, -1.375427, -3, 1
13.46759, -13, 2, -1.376935, -3, 1
13.50924, -13, 2, -1.379654, -3, 1
13.55089, -13, 2, -1.382376, -3, 1
13.59254, -13, 2, -1.384865, -3, 1
13.63419, -13, 2, -1.387406, -3, 1
13.67584, -13, 2, -1.388589, -3, 1
13.71749, -13, 2, -1.390988, -3, 1
13.75914, -13, 2, -1.393343, -3, 1
13.80079, -13, 2, -1.395734, -3, 1
13.84244, -13, 2, -1.39811, -3, 1
13.88409, -13, 2, -1.399293, -3, 1
13.92574, -13, 2, -1.401752, -3, 1
13.96739, -13, 2, -1.403812, -3, 1
14.00904, -14, 2, -1.405696, -3, 1
14.05069, -14, 2, -1.407538, -3, 1
14.09234, -14, 2, -1.408383, -3, 1
14.13399, -14, 2, -1.410222, -3, 1
14.17564, -14, 2, -1.411983, -3, 1
14.21729, -14, 2, -1.414104, -3, 1
14.25894, -14, 2, -1.41641, -3, 1
14.30059, -14, 2, -1.417703, -3, 1
14.34224, -14, 2, -1.420294, -3, 1
14.38389, -14, 2, -1.423083, -3, 1
14.42554, -14, 2, -1.425498, -3, 1
14.46719, -14, 2, -1.427769, -3, 1
14.50884, -14, 2, -1.428814, -3, 1
14.55049, -14, 2, -1.430511, -3, 1
14.59214, -14, 2, -1.431512, -3, 1
14.63379, -14, 2, -1.431835, -3, 1
14.67544, -14, 2, -1.431496, -3, 1
14.71709, -14, 2, -1.430896, -3, 1
14.75874, -14, 2, -1.429563, -3, 1
14.80039, -14, 2, -1.427786, -3, 1
14.84204, -14, 2, -1.426227, -3, 1
14.88369, -14, 2, -1.423419, -3, 1
14.92534, -14, 2, -1.422715, -3, 1
14.96699, -14, 2, -1.419577, -3, 1
15.00864, -15, 2, -1.417255, -3, 1
15.05029, -15, 2, -1.414633, -3, 1
15.09194, -15, 2, -1.412642, -3, 1
15.13359, -15, 2, -1.411495, -3, 1
15.17524, -15, 2, -1.409392, -3, 1
15.21689, -15, 2, -1.406913, -3, 1
15.25854, -15, 2, -1.403697, -3, 1
15.30019, -15, 2, -1.400633, -3, 1
15.34184, -15, 2, -1.398424, -3, 1
15.38348, -15, 2, -1.393708, -3, 1
15.42513, -15, 2, -1.38881, -3, 1
15.46678, -15, 2, -1.383213, -3, 1
15.50843, -15, 2, -1.377594, -3, 1
15.55008, -15, 2, -1.374808, -3, 1
15.59173, -15, 2, -1.368811, -3, 1
15.63338, -15, 2, -1.36288, -3, 1
15.67503, -15, 2, -1.356337, -3, 1
15.71668, -15, 2, -1.350179, -3, 1
15.75833, -15, 2, -1.347435, -3, 1
15.79998, -15, 2, -1.342191, -3, 1
15.84163, -15, 2, -1.337083, -3, 1
15.88328, -15, 2, -1.332282, -3, 1
15.92493, -15, 2, -1.327584, -3, 1
15.96658, -15, 2, -1.325109, -3, 1
16.00823, -16, 2, -1.320152, -3, 1
16.04988, -16, 2, -1.31458, -3, 1
16.09153, -16, 2, -1.307747, -3, 1
16.13319, -16, 2, -1.301387, -3, 1
16.17484, -16, 2, -1.298511, -3, 1
16.21649, -16, 2, -1.292943, -3, 1
16.25814, -16, 2, -1.287612, -3, 1
16.29979, -16, 2, -1.283186, -3, 1
16.34144, -16, 2, -1.280193, -3, 1
16.38309, -16, 2, -1.278494, -3, 1
16.42474, -16, 2, -1.274944, -3, 1
16.46639, -16, 2, -1.271388, -3, 1
16.50804, -16, 2, -1.268321, -3, 1
16.54969, -16, 2, -1.266387, -3, 1
