timestamp_sec,frame_id,game_played,yielding,player1discrete,player2discrete,player1yieldprob,player2yieldprob,player1_pose_x,player1_pose_y,player1_pose_z,player1_pose_orient_x,player1_pose_orient_y,player1_pose_orient_z,player1_pose_orient_w,player2_pose_x,player2_pose_y,player2_pose_z,player2_pose_orient_x,player2_pose_orient_y,player2_pose_orient_z,player2_pose_orient_w
1718123149.5878057,map,True,True,6,6,0.5957621508060097,0.5957621508060098,1.19394850730896,-1.5451136827468872,0.0,0.0,0.0,0.03738013178280624,0.9993011148371911,3.0701130589307546,-7.953369352735544,0.6756536297911925,0.0,0.0,0.0,1.0
1718123149.639069,map,True,False,6,6,0.5957621508060097,0.5957621508060098,1.19394850730896,-1.5451136827468872,0.0,0.0,0.0,0.03738013178280624,0.9993011148371911,3.0701130589307546,-7.953369352735544,0.6756536297911925,0.0,0.0,0.0,1.0
1718123149.7384453,map,True,False,5,6,0.0,0.0,1.2481681108474731,-1.552396297454834,0.0,0.0,0.0,0.03765847015021424,0.9992906617630624,3.0701130589307546,-7.953369352735544,0.6756536297911925,0.0,0.0,0.0,1.0
1718123149.7882135,map,True,False,5,6,0.0,0.0,1.2481681108474731,-1.552396297454834,0.0,0.0,0.0,0.03765847015021424,0.9992906617630624,3.0701130589307546,-7.953369352735544,0.6756536297911925,0.0,0.0,0.0,1.0
1718123149.8884609,map,True,False,5,6,0.0,0.0,1.2481681108474731,-1.552396297454834,0.0,0.0,0.0,0.03765847015021424,0.9992906617630624,3.1308683569148608,-7.8289457642507045,0.6206294292481493,0.0,0.0,0.0,1.0
1718123149.942059,map,True,False,5,6,0.0,0.0,1.2481681108474731,-1.552396297454834,0.0,0.0,0.0,0.03765847015021424,0.9992906617630624,3.134215331118835,-7.852885573102077,0.6111868475451729,0.0,0.0,0.0,1.0
1718123149.991695,map,True,False,5,6,0.0,0.0,1.2481681108474731,-1.552396297454834,0.0,0.0,0.0,0.03765847015021424,0.9992906617630624,3.134215331118835,-7.852885573102077,0.6111868475451729,0.0,0.0,0.0,1.0
1718123150.0417812,map,True,False,5,6,0.0,0.0,1.2481681108474731,-1.552396297454834,0.0,0.0,0.0,0.03765847015021424,0.9992906617630624,3.134215331118835,-7.852885573102077,0.6111868475451729,0.0,0.0,0.0,1.0
1718123150.0912876,map,True,False,5,6,0.0,0.0,1.2481681108474731,-1.552396297454834,0.0,0.0,0.0,0.03765847015021424,0.9992906617630624,3.134215331118835,-7.852885573102077,0.6111868475451729,0.0,0.0,0.0,1.0
1718123150.1419957,map,True,False,5,6,0.0,0.0,1.2481681108474731,-1.552396297454834,0.0,0.0,0.0,0.03765847015021424,0.9992906617630624,3.134215331118835,-7.852885573102077,0.6111868475451729,0.0,0.0,0.0,1.0
1718123150.2424233,map,True,False,5,6,0.0,0.0,1.2481681108474731,-1.552396297454834,0.0,0.0,0.0,0.03765847015021424,0.9992906617630624,3.1755309129215337,-7.5879143653136945,0.8350892534772645,0.0,0.0,0.0,1.0
1718123150.5948331,map,True,False,5,6,0.0,0.0,1.4177623987197876,-1.591227412223816,0.0,0.0,0.0,0.039033854253984264,0.9992378877264058,3.183950000718749,-7.242199589356427,0.9095928373036186,0.0,0.0,0.0,1.0
1718123150.6427,map,True,False,5,6,0.0,0.0,1.4177623987197876,-1.591227412223816,0.0,0.0,0.0,0.039033854253984264,0.9992378877264058,3.183950000718749,-7.242199589356427,0.9095928373036186,0.0,0.0,0.0,1.0
1718123150.7425303,map,True,False,5,6,0.0,0.0,1.4177623987197876,-1.591227412223816,0.0,0.0,0.0,0.039033854253984264,0.9992378877264058,3.183950000718749,-7.242199589356427,0.9095928373036186,0.0,0.0,0.0,1.0
1718123150.7932057,map,True,False,5,6,0.0,0.0,1.4177623987197876,-1.591227412223816,0.0,0.0,0.0,0.039033854253984264,0.9992378877264058,3.183950000718749,-7.242199589356427,0.9095928373036186,0.0,0.0,0.0,1.0
1718123150.843204,map,True,False,5,6,0.0,0.0,1.4177623987197876,-1.591227412223816,0.0,0.0,0.0,0.039033854253984264,0.9992378877264058,3.183950000718749,-7.242199589356427,0.9095928373036186,0.0,0.0,0.0,1.0
1718123150.9437711,map,True,False,5,6,0.0,0.0,1.4177623987197876,-1.591227412223816,0.0,0.0,0.0,0.039033854253984264,0.9992378877264058,3.2391877990928384,-7.371984864547666,0.769522854926803,0.0,0.0,0.0,1.0
1718123150.993967,map,True,False,5,6,0.0,0.0,1.4177623987197876,-1.591227412223816,0.0,0.0,0.0,0.039033854253984264,0.9992378877264058,3.2391877990928384,-7.371984864547666,0.769522854926803,0.0,0.0,0.0,1.0
1718123151.0438504,map,True,False,5,6,0.0,0.0,1.4177623987197876,-1.591227412223816,0.0,0.0,0.0,0.039033854253984264,0.9992378877264058,3.2391877990928384,-7.371984864547666,0.769522854926803,0.0,0.0,0.0,1.0
1718123151.143774,map,True,False,5,6,0.0,0.0,1.5270192623138428,-1.6168251037597656,0.0,0.0,0.0,0.039951403167523936,0.9992016198044728,3.2391877990928384,-7.371984864547666,0.769522854926803,0.0,0.0,0.0,1.0
1718123151.2465692,map,True,False,5,6,0.0,0.0,1.5270192623138428,-1.6168251037597656,0.0,0.0,0.0,0.039951403167523936,0.9992016198044728,3.329354276531925,-7.06834086946685,0.7082859952550016,0.0,0.0,0.0,1.0
1718123151.5535707,map,True,True,5,5,0.612995793784914,0.612995793784914,1.5270192623138428,-1.6168251037597656,0.0,0.0,0.0,0.039951403167523936,0.9992016198044728,3.295837229260201,-6.602864814419899,0.7058579958647723,0.0,0.0,0.0,1.0
1718123151.6518292,map,True,True,5,5,0.612995793784914,0.612995793784914,1.5270192623138428,-1.6168251037597656,0.0,0.0,0.0,0.039951403167523936,0.9992016198044728,3.2848678375750584,-6.422191833393796,0.6906922941931958,0.0,0.0,0.0,1.0
1718123151.6990678,map,True,False,5,5,0.612995793784914,0.612995793784914,1.5270192623138428,-1.6168251037597656,0.0,0.0,0.0,0.039951403167523936,0.9992016198044728,3.2421427935414098,-6.157845589629314,0.6901292960231785,0.0,0.0,0.0,1.0
1718123151.7987938,map,True,True,5,5,0.612995793784914,0.612995793784914,1.5270192623138428,-1.6168251037597656,0.0,0.0,0.0,0.039951403167523936,0.9992016198044728,3.2865173988176073,-6.391625027900934,0.6906255771543353,0.0,0.0,0.0,1.0
1718123151.848946,map,True,False,4,5,0.0,0.0,1.647507667541504,-1.6518001556396484,0.0,0.0,0.0,0.04144310853204926,0.9991408621202892,3.2865173988176073,-6.391625027900934,0.6906255771543353,0.0,0.0,0.0,1.0
1718123151.899804,map,True,False,4,5,0.0,0.0,1.647507667541504,-1.6518001556396484,0.0,0.0,0.0,0.04144310853204926,0.9991408621202892,3.2865173988176073,-6.391625027900934,0.6906255771543353,0.0,0.0,0.0,1.0
1718123151.9510844,map,True,False,4,5,0.0,0.0,1.647507667541504,-1.6518001556396484,0.0,0.0,0.0,0.04144310853204926,0.9991408621202892,3.2753294908744146,-6.065095259186246,0.7162071012078155,0.0,0.0,0.0,1.0
1718123152.0026314,map,True,False,4,5,0.0,0.0,1.647507667541504,-1.6518001556396484,0.0,0.0,0.0,0.04144310853204926,0.9991408621202892,3.318481690673061,-6.328729877500554,0.7322507195686685,0.0,0.0,0.0,1.0
1718123152.0523887,map,True,False,4,5,0.0,0.0,1.647507667541504,-1.6518001556396484,0.0,0.0,0.0,0.04144310853204926,0.9991408621202892,3.318481690673061,-6.328729877500554,0.7322507195686685,0.0,0.0,0.0,1.0
1718123152.1539016,map,True,False,4,5,0.0,0.0,1.647507667541504,-1.6518001556396484,0.0,0.0,0.0,0.04144310853204926,0.9991408621202892,3.318481690673061,-6.328729877500554,0.7322507195686685,0.0,0.0,0.0,1.0
1718123152.208441,map,True,False,4,5,0.0,0.0,1.647507667541504,-1.6518001556396484,0.0,0.0,0.0,0.04144310853204926,0.9991408621202892,3.318481690673061,-6.328729877500554,0.7322507195686685,0.0,0.0,0.0,1.0
1718123152.3083322,map,True,False,4,5,0.0,0.0,1.647507667541504,-1.6518001556396484,0.0,0.0,0.0,0.04144310853204926,0.9991408621202892,3.359692119334477,-6.1505173387486165,0.7168573325320486,0.0,0.0,0.0,1.0
1718123152.4058702,map,True,True,4,4,0.5922520728754596,0.5922520728754596,1.647507667541504,-1.6518001556396484,0.0,0.0,0.0,0.04144310853204926,0.9991408621202892,3.2969071054772545,-5.6494337450328835,0.6948780477153851,0.0,0.0,0.0,1.0
1718123152.4560893,map,True,False,4,4,0.5922520728754596,0.5922520728754596,1.647507667541504,-1.6518001556396484,0.0,0.0,0.0,0.04144310853204926,0.9991408621202892,3.2969071054772545,-5.6494337450328835,0.6948780477153851,0.0,0.0,0.0,1.0
1718123152.508211,map,True,True,4,4,0.5922520728754596,0.5922520728754596,1.647507667541504,-1.6518001556396484,0.0,0.0,0.0,0.04144310853204926,0.9991408621202892,3.2969071054772545,-5.6494337450328835,0.6948780477153851,0.0,0.0,0.0,1.0
1718123152.5581856,map,True,True,4,4,0.5922520728754596,0.5922520728754596,1.647507667541504,-1.6518001556396484,0.0,0.0,0.0,0.04144310853204926,0.9991408621202892,3.2969071054772545,-5.6494337450328835,0.6948780477153851,0.0,0.0,0.0,1.0
1718123152.6573348,map,True,False,4,4,0.5922520728754596,0.5922520728754596,1.647507667541504,-1.6518001556396484,0.0,0.0,0.0,0.04144310853204926,0.9991408621202892,3.3407396424511075,-5.532131481276883,0.7001922735693034,0.0,0.0,0.0,1.0
1718123152.7072866,map,True,True,4,4,0.5922520728754596,0.5922520728754596,1.647507667541504,-1.6518001556396484,0.0,0.0,0.0,0.04144310853204926,0.9991408621202892,3.3233857263546485,-5.434671992519694,0.694036365744388,0.0,0.0,0.0,1.0
1718123152.7575188,map,True,True,4,4,0.5922520728754596,0.5922520728754596,1.7567811012268066,-1.6821258068084717,0.0,0.0,0.0,0.04271486824152591,0.9990873046029464,3.3233857263546485,-5.434671992519694,0.694036365744388,0.0,0.0,0.0,1.0
1718123152.8095205,map,True,False,4,4,0.5922520728754596,0.5922520728754596,1.7567811012268066,-1.6821258068084717,0.0,0.0,0.0,0.04271486824152591,0.9990873046029464,3.3233857263546485,-5.434671992519694,0.694036365744388,0.0,0.0,0.0,1.0
1718123152.8588297,map,True,True,4,4,0.5922520728754596,0.5922520728754596,1.7567811012268066,-1.6821258068084717,0.0,0.0,0.0,0.04271486824152591,0.9990873046029464,3.3233857263546485,-5.434671992519694,0.694036365744388,0.0,0.0,0.0,1.0
1718123152.9596522,map,True,False,4,4,0.5922520728754596,0.5922520728754596,1.7567811012268066,-1.6821258068084717,0.0,0.0,0.0,0.04271486824152591,0.9990873046029464,3.3233857263546485,-5.434671992519694,0.694036365744388,0.0,0.0,0.0,1.0
1718123153.0117395,map,True,True,4,4,0.5922520728754596,0.5922520728754596,1.7567811012268066,-1.6821258068084717,0.0,0.0,0.0,0.04271486824152591,0.9990873046029464,3.3367721226312144,-5.1869814444525,0.6772524530243842,0.0,0.0,0.0,1.0
1718123153.0616097,map,True,True,4,4,0.5922520728754596,0.5922520728754596,1.7567811012268066,-1.6821258068084717,0.0,0.0,0.0,0.04271486824152591,0.9990873046029464,3.321989530612114,-5.052729396168877,0.6620415653999181,0.0,0.0,0.0,1.0
1718123153.159525,map,True,True,4,4,0.5922520728754596,0.5922520728754596,1.7567811012268066,-1.6821258068084717,0.0,0.0,0.0,0.04271486824152591,0.9990873046029464,3.321989530612114,-5.052729396168877,0.6620415653999181,0.0,0.0,0.0,1.0
1718123153.2107491,map,True,False,4,4,0.5922520728754596,0.5922520728754596,1.7567811012268066,-1.6821258068084717,0.0,0.0,0.0,0.04271486824152591,0.9990873046029464,3.321989530612114,-5.052729396168877,0.6620415653999181,0.0,0.0,0.0,1.0
1718123153.3600073,map,True,True,4,4,0.5922520728754596,0.5922520728754596,1.7567811012268066,-1.6821258068084717,0.0,0.0,0.0,0.04271486824152591,0.9990873046029464,3.398228743805289,-5.083473855576858,0.6874903205566117,0.0,0.0,0.0,1.0
1718123153.4089444,map,True,True,4,4,0.5922520728754596,0.5922520728754596,1.8819243907928467,-1.7057902812957764,0.0,0.0,0.0,0.04373203604004069,0.9990432901358252,3.44407640176939,-5.113040599862272,0.6874704929920198,0.0,0.0,0.0,1.0
1718123153.511384,map,True,True,4,4,0.5922520728754596,0.5922520728754596,1.8819243907928467,-1.7057902812957764,0.0,0.0,0.0,0.04373203604004069,0.9990432901358252,3.44407640176939,-5.113040599862272,0.6874704929920198,0.0,0.0,0.0,1.0
1718123153.5722299,map,True,True,4,4,0.5922520728754596,0.5922520728754596,1.8819243907928467,-1.7057902812957764,0.0,0.0,0.0,0.04373203604004069,0.9990432901358252,3.44407640176939,-5.113040599862272,0.6874704929920198,0.0,0.0,0.0,1.0
1718123153.6237853,map,True,False,4,4,0.5922520728754596,0.5922520728754596,1.8819243907928467,-1.7057902812957764,0.0,0.0,0.0,0.04373203604004069,0.9990432901358252,3.44407640176939,-5.113040599862272,0.6874704929920198,0.0,0.0,0.0,1.0
1718123153.673786,map,True,False,4,4,0.5922520728754596,0.5922520728754596,1.8819243907928467,-1.7057902812957764,0.0,0.0,0.0,0.04373203604004069,0.9990432901358252,3.44407640176939,-5.113040599862272,0.6874704929920198,0.0,0.0,0.0,1.0
1718123153.7738695,map,True,False,4,3,0.0,0.0,1.8819243907928467,-1.7057902812957764,0.0,0.0,0.0,0.04373203604004069,0.9990432901358252,3.38914962936492,-4.631037984609428,0.6593176417729983,0.0,0.0,0.0,1.0
1718123153.8725517,map,True,False,4,3,0.0,0.0,1.8819243907928467,-1.7057902812957764,0.0,0.0,0.0,0.04373203604004069,0.9990432901358252,3.38914962936492,-4.631037984609428,0.6593176417729983,0.0,0.0,0.0,1.0
1718123153.9229207,map,True,False,4,3,0.0,0.0,1.8819243907928467,-1.7057902812957764,0.0,0.0,0.0,0.04373203604004069,0.9990432901358252,3.38914962936492,-4.631037984609428,0.6593176417729983,0.0,0.0,0.0,1.0
1718123153.9735694,map,True,False,4,3,0.0,0.0,1.8819243907928467,-1.7057902812957764,0.0,0.0,0.0,0.04373203604004069,0.9990432901358252,3.38914962936492,-4.631037984609428,0.6593176417729983,0.0,0.0,0.0,1.0
1718123154.0245328,map,True,False,4,3,0.0,0.0,1.9400911331176758,-1.7217824459075928,0.0,0.0,0.0,0.04436281740950599,0.999015487385698,3.3727302308735942,-4.3983183212924,0.660826068043278,0.0,0.0,0.0,1.0
1718123154.0741796,map,True,False,4,3,0.0,0.0,1.9400911331176758,-1.7217824459075928,0.0,0.0,0.0,0.04436281740950599,0.999015487385698,3.3729932656166826,-4.332240937624568,0.6613144913529363,0.0,0.0,0.0,1.0
1718123154.1735728,map,True,False,4,3,0.0,0.0,1.9400911331176758,-1.7217824459075928,0.0,0.0,0.0,0.04436281740950599,0.999015487385698,3.3729932656166826,-4.332240937624568,0.6613144913529363,0.0,0.0,0.0,1.0
1718123154.2242079,map,True,False,4,3,0.0,0.0,1.9400911331176758,-1.7217824459075928,0.0,0.0,0.0,0.04436281740950599,0.999015487385698,3.3729932656166826,-4.332240937624568,0.6613144913529363,0.0,0.0,0.0,1.0
1718123154.3866856,map,True,False,4,3,0.0,0.0,1.9400911331176758,-1.7217824459075928,0.0,0.0,0.0,0.04436281740950599,0.999015487385698,3.392049434238527,-4.093921419515064,0.6405276133693154,0.0,0.0,0.0,1.0
1718123154.489304,map,True,False,4,3,0.0,0.0,1.9400911331176758,-1.7217824459075928,0.0,0.0,0.0,0.04436281740950599,0.999015487385698,3.392049434238527,-4.093921419515064,0.6405276133693154,0.0,0.0,0.0,1.0
1718123154.5405815,map,True,False,4,3,0.0,0.0,1.9400911331176758,-1.7217824459075928,0.0,0.0,0.0,0.04436281740950599,0.999015487385698,3.392049434238527,-4.093921419515064,0.6405276133693154,0.0,0.0,0.0,1.0
1718123154.591433,map,True,False,4,3,0.0,0.0,1.9400911331176758,-1.7217824459075928,0.0,0.0,0.0,0.04436281740950599,0.999015487385698,3.392049434238527,-4.093921419515064,0.6405276133693154,0.0,0.0,0.0,1.0
1718123154.6392884,map,True,False,4,3,0.0,0.0,1.9400911331176758,-1.7217824459075928,0.0,0.0,0.0,0.04436281740950599,0.999015487385698,3.392049434238527,-4.093921419515064,0.6405276133693154,0.0,0.0,0.0,1.0
1718123154.738168,map,True,False,4,2,0.0,0.0,1.9400911331176758,-1.7217824459075928,0.0,0.0,0.0,0.04436281740950599,0.999015487385698,3.4585043129755757,-3.9123407052820838,0.6427144701853157,0.0,0.0,0.0,1.0
1718123154.7885365,map,True,False,4,2,0.0,0.0,1.9400911331176758,-1.7217824459075928,0.0,0.0,0.0,0.04436281740950599,0.999015487385698,3.4585043129755757,-3.9123407052820838,0.6427144701853157,0.0,0.0,0.0,1.0
1718123154.8388095,map,True,False,3,2,0.0,0.0,2.0030710697174072,-1.7346562147140503,0.0,0.0,0.0,0.04511984746202557,0.9989815830923494,3.4585043129755757,-3.9123407052820838,0.6427144701853157,0.0,0.0,0.0,1.0
1718123154.889221,map,True,False,3,2,0.0,0.0,2.0030710697174072,-1.7346562147140503,0.0,0.0,0.0,0.04511984746202557,0.9989815830923494,3.4585043129755757,-3.9123407052820838,0.6427144701853157,0.0,0.0,0.0,1.0
1718123154.9395952,map,True,False,3,2,0.0,0.0,2.0030710697174072,-1.7346562147140503,0.0,0.0,0.0,0.04511984746202557,0.9989815830923494,3.4585043129755757,-3.9123407052820838,0.6427144701853157,0.0,0.0,0.0,1.0
1718123154.9895675,map,True,False,3,2,0.0,0.0,2.0030710697174072,-1.7346562147140503,0.0,0.0,0.0,0.04511984746202557,0.9989815830923494,3.4585043129755757,-3.9123407052820838,0.6427144701853157,0.0,0.0,0.0,1.0
1718123155.041974,map,True,False,3,2,0.0,0.0,2.0030710697174072,-1.7346562147140503,0.0,0.0,0.0,0.04511984746202557,0.9989815830923494,3.4762359609358713,-3.689918764942981,0.658956891412284,0.0,0.0,0.0,1.0
1718123155.1408038,map,True,False,3,2,0.0,0.0,2.0030710697174072,-1.7346562147140503,0.0,0.0,0.0,0.04511984746202557,0.9989815830923494,3.467233275193379,-3.6347517461811227,0.6625515804676508,0.0,0.0,0.0,1.0
1718123155.1914787,map,True,False,3,2,0.0,0.0,2.0030710697174072,-1.7346562147140503,0.0,0.0,0.0,0.04511984746202557,0.9989815830923494,3.467233275193379,-3.6347517461811227,0.6625515804676508,0.0,0.0,0.0,1.0
1718123155.3896356,map,True,False,3,2,0.0,0.0,2.0030710697174072,-1.7346562147140503,0.0,0.0,0.0,0.04511984746202557,0.9989815830923494,3.500165751428011,-3.49122184061891,0.6836683999347073,0.0,0.0,0.0,1.0
1718123155.4395764,map,True,False,3,2,0.0,0.0,2.0030710697174072,-1.7346562147140503,0.0,0.0,0.0,0.04511984746202557,0.9989815830923494,3.500165751428011,-3.49122184061891,0.6836683999347073,0.0,0.0,0.0,1.0
1718123155.5391505,map,True,False,3,2,0.0,0.0,2.0030710697174072,-1.7346562147140503,0.0,0.0,0.0,0.04511984746202557,0.9989815830923494,3.500165751428011,-3.49122184061891,0.6836683999347073,0.0,0.0,0.0,1.0
1718123155.5897224,map,True,False,3,2,0.0,0.0,2.0030710697174072,-1.7346562147140503,0.0,0.0,0.0,0.04511984746202557,0.9989815830923494,3.500165751428011,-3.49122184061891,0.6836683999347073,0.0,0.0,0.0,1.0
1718123155.6890259,map,True,False,3,2,0.0,0.0,2.1305928230285645,-1.7685701847076416,0.0,0.0,0.0,0.046021661178237666,0.9989404429457,3.5532524569581527,-3.3883655126830017,0.6861184944207872,0.0,0.0,0.0,1.0
1718123155.7396016,map,True,False,3,2,0.0,0.0,2.1305928230285645,-1.7685701847076416,0.0,0.0,0.0,0.046021661178237666,0.9989404429457,3.5520207432288156,-3.30230327739171,0.6832279568103379,0.0,0.0,0.0,1.0
1718123155.840269,map,True,False,3,2,0.0,0.0,2.1305928230285645,-1.7685701847076416,0.0,0.0,0.0,0.046021661178237666,0.9989404429457,3.5520207432288156,-3.30230327739171,0.6832279568103379,0.0,0.0,0.0,1.0
1718123155.8900342,map,True,False,3,2,0.0,0.0,2.1305928230285645,-1.7685701847076416,0.0,0.0,0.0,0.046021661178237666,0.9989404429457,3.5520207432288156,-3.30230327739171,0.6832279568103379,0.0,0.0,0.0,1.0
1718123155.9441113,map,True,False,3,2,0.0,0.0,2.1305928230285645,-1.7685701847076416,0.0,0.0,0.0,0.046021661178237666,0.9989404429457,3.5520207432288156,-3.30230327739171,0.6832279568103379,0.0,0.0,0.0,1.0
1718123156.0438752,map,True,False,3,2,0.0,0.0,2.1305928230285645,-1.7685701847076416,0.0,0.0,0.0,0.046021661178237666,0.9989404429457,3.5925892433896554,-3.2241122395457484,0.6829656677537459,0.0,0.0,0.0,1.0
1718123156.1405127,map,True,False,3,2,0.0,0.0,2.1305928230285645,-1.7685701847076416,0.0,0.0,0.0,0.046021661178237666,0.9989404429457,3.619046315633858,-3.210433106420367,0.6829030215621149,0.0,0.0,0.0,1.0
1718123156.2410197,map,True,False,3,2,0.0,0.0,2.1305928230285645,-1.7685701847076416,0.0,0.0,0.0,0.046021661178237666,0.9989404429457,3.619046315633858,-3.210433106420367,0.6829030215621149,0.0,0.0,0.0,1.0
1718123156.3897598,map,True,False,3,2,0.0,0.0,2.2674171924591064,-1.7988533973693848,0.0,0.0,0.0,0.04785123564652031,0.9988544727679959,3.7095211102493497,-2.915903043590415,0.6840315651866192,0.0,0.0,0.0,1.0
1718123156.4500535,map,True,False,3,2,0.0,0.0,2.2674171924591064,-1.7988533973693848,0.0,0.0,0.0,0.04785123564652031,0.9988544727679959,3.7095211102493497,-2.915903043590415,0.6840315651866192,0.0,0.0,0.0,1.0
1718123156.54819,map,True,False,3,2,0.0,0.0,2.2674171924591064,-1.7988533973693848,0.0,0.0,0.0,0.04785123564652031,0.9988544727679959,3.7095211102493497,-2.915903043590415,0.6840315651866192,0.0,0.0,0.0,1.0
1718123156.649516,map,True,False,3,2,0.0,0.0,2.2674171924591064,-1.7988533973693848,0.0,0.0,0.0,0.04785123564652031,0.9988544727679959,3.7095211102493497,-2.915903043590415,0.6840315651866192,0.0,0.0,0.0,1.0
1718123156.7069435,map,True,False,3,2,0.0,0.0,2.2674171924591064,-1.7988533973693848,0.0,0.0,0.0,0.04785123564652031,0.9988544727679959,3.7691254708043966,-2.79997488812014,0.6835687461865627,0.0,0.0,0.0,1.0
1718123156.7487066,map,True,False,3,1,0.0,0.0,2.2674171924591064,-1.7988533973693848,0.0,0.0,0.0,0.04785123564652031,0.9988544727679959,3.812727409789046,-2.6817259827458746,0.6830315552778159,0.0,0.0,0.0,1.0
1718123156.8002524,map,True,False,3,1,0.0,0.0,2.2674171924591064,-1.7988533973693848,0.0,0.0,0.0,0.04785123564652031,0.9988544727679959,3.812727409789046,-2.6817259827458746,0.6830315552778159,0.0,0.0,0.0,1.0
1718123156.8988304,map,True,False,3,1,0.0,0.0,2.2835183143615723,-1.8110988140106201,0.0,0.0,0.0,0.04880629950398559,0.9988082698777561,3.812727409789046,-2.6817259827458746,0.6830315552778159,0.0,0.0,0.0,1.0
1718123156.951573,map,True,False,3,1,0.0,0.0,2.2835183143615723,-1.8110988140106201,0.0,0.0,0.0,0.04880629950398559,0.9988082698777561,3.812727409789046,-2.6817259827458746,0.6830315552778159,0.0,0.0,0.0,1.0
1718123156.9998205,map,True,False,3,1,0.0,0.0,2.2835183143615723,-1.8110988140106201,0.0,0.0,0.0,0.04880629950398559,0.9988082698777561,3.812727409789046,-2.6817259827458746,0.6830315552778159,0.0,0.0,0.0,1.0
1718123157.051398,map,True,False,3,1,0.0,0.0,2.2835183143615723,-1.8110988140106201,0.0,0.0,0.0,0.04880629950398559,0.9988082698777561,3.8139604612512175,-2.432653268905797,0.6820913457683111,0.0,0.0,0.0,1.0
1718123157.151868,map,True,False,3,1,0.0,0.0,2.2835183143615723,-1.8110988140106201,0.0,0.0,0.0,0.04880629950398559,0.9988082698777561,3.8262217040672937,-2.3777034572709743,0.6805782683584732,0.0,0.0,0.0,1.0
1718123157.2015843,map,True,False,3,1,0.0,0.0,2.2835183143615723,-1.8110988140106201,0.0,0.0,0.0,0.04880629950398559,0.9988082698777561,3.8262217040672937,-2.3777034572709743,0.6805782683584732,0.0,0.0,0.0,1.0
1718123157.4517915,map,True,False,2,1,0.0,0.0,2.5042896270751953,-1.8693362474441528,0.0,0.0,0.0,0.05087934279879463,0.9987048016658564,3.8473971742214887,-2.1754255251954304,0.6810914173666736,0.0,0.0,0.0,1.0
1718123157.503413,map,True,False,2,1,0.0,0.0,2.5042896270751953,-1.8693362474441528,0.0,0.0,0.0,0.05087934279879463,0.9987048016658564,3.8473971742214887,-2.1754255251954304,0.6810914173666736,0.0,0.0,0.0,1.0
1718123157.554157,map,True,False,2,1,0.0,0.0,2.5042896270751953,-1.8693362474441528,0.0,0.0,0.0,0.05087934279879463,0.9987048016658564,3.8473971742214887,-2.1754255251954304,0.6810914173666736,0.0,0.0,0.0,1.0
1718123157.6510513,map,True,False,2,1,0.0,0.0,2.5042896270751953,-1.8693362474441528,0.0,0.0,0.0,0.05087934279879463,0.9987048016658564,3.8473971742214887,-2.1754255251954304,0.6810914173666736,0.0,0.0,0.0,1.0
1718123157.7024076,map,True,False,2,9,0.0,0.0,2.5042896270751953,-1.8693362474441528,0.0,0.0,0.0,0.05087934279879463,0.9987048016658564,10.4194231788453,-6.460957597163507,0.6868797488456998,0.0,0.0,0.0,1.0
1718123157.8022301,map,True,False,2,9,0.0,0.0,2.5042896270751953,-1.8693362474441528,0.0,0.0,0.0,0.05087934279879463,0.9987048016658564,10.4194231788453,-6.460957597163507,0.6868797488456998,0.0,0.0,0.0,1.0
1718123157.9022996,map,True,False,2,9,0.0,0.0,2.5042896270751953,-1.8693362474441528,0.0,0.0,0.0,0.05087934279879463,0.9987048016658564,10.4194231788453,-6.460957597163507,0.6868797488456998,0.0,0.0,0.0,1.0
1718123157.952649,map,True,False,2,9,0.0,0.0,2.5841047763824463,-1.890187382698059,0.0,0.0,0.0,0.05086852716849608,0.9987053537236926,10.4194231788453,-6.460957597163507,0.6868797488456998,0.0,0.0,0.0,1.0
1718123158.054287,map,True,False,2,9,0.0,0.0,2.5841047763824463,-1.890187382698059,0.0,0.0,0.0,0.05086852716849608,0.9987053537236926,10.4194231788453,-6.460957597163507,0.6868797488456998,0.0,0.0,0.0,1.0
1718123158.103807,map,True,False,2,9,0.0,0.0,2.5841047763824463,-1.890187382698059,0.0,0.0,0.0,0.05086852716849608,0.9987053537236926,10.4194231788453,-6.460957597163507,0.6868797488456998,0.0,0.0,0.0,1.0
1718123158.1548986,map,True,False,2,9,0.0,0.0,2.5841047763824463,-1.890187382698059,0.0,0.0,0.0,0.05086852716849608,0.9987053537236926,10.4194231788453,-6.460957597163507,0.6868797488456998,0.0,0.0,0.0,1.0
1718123158.2070312,map,True,False,2,9,0.0,0.0,2.5841047763824463,-1.890187382698059,0.0,0.0,0.0,0.05086852716849608,0.9987053537236926,10.4194231788453,-6.460957597163507,0.6868797488456998,0.0,0.0,0.0,1.0
