car_pos_meter , car_pos_cell, car_speed, ped_pos_meter, ped_pos_cell, ped_speed
-15.76923, 15, 2, 4.09677, 16, 1
-15.70515, 15, 2, 4.085963, 16, 1
-15.64108, 15, 2, 4.074634, 16, 1
-15.577, 15, 2, 4.062339, 16, 1
-15.51293, 15, 2, 4.049794, 16, 1
-15.44885, 15, 2, 4.036814, 16, 1
-15.38477, 15, 2, 4.029912, 16, 1
-15.32069, 15, 2, 4.016137, 16, 1
-15.25662, 15, 2, 4.001856, 16, 1
-15.19254, 15, 2, 3.987112, 15, 1
-15.12846, 15, 2, 3.979693, 15, 1
-15.06439, 15, 2, 3.964442, 15, 1
-15.00031, 15, 2, 3.948635, 15, 1
-14.93623, 14, 2, 3.932465, 15, 1
-14.87216, 14, 2, 3.924289, 15, 1
-14.80808, 14, 2, 3.899852, 15, 1
-14.74401, 14, 2, 3.891376, 15, 1
-14.67993, 14, 2, 3.874835, 15, 1
-14.61585, 14, 2, 3.858449, 15, 1
-14.55177, 14, 2, 3.842263, 15, 1
-14.4877, 14, 2, 3.826363, 15, 1
-14.42362, 14, 2, 3.818362, 15, 1
-14.35954, 14, 2, 3.803144, 15, 1
-14.29547, 14, 2, 3.788061, 15, 1
-14.23139, 14, 2, 3.773219, 15, 1
-14.16732, 14, 2, 3.758054, 15, 1
-14.10324, 14, 2, 3.750025, 15, 1
-14.03916, 14, 2, 3.734875, 14, 1
-13.97509, 13, 2, 3.719306, 14, 1
-13.91101, 13, 2, 3.703148, 14, 1
-13.84693, 13, 2, 3.694949, 14, 1
-13.78286, 13, 2, 3.678367, 14, 1
-13.71878, 13, 2, 3.661592, 14, 1
-13.6547, 13, 2, 3.653052, 14, 1
-13.59063, 13, 2, 3.636196, 14, 1
-13.52655, 13, 2, 3.610987, 14, 1
-13.46247, 13, 2, 3.602439, 14, 1
-13.3984, 13, 2, 3.585325, 14, 1
-13.33432, 13, 2, 3.568223, 14, 1
-13.27024, 13, 2, 3.55128, 14, 1
-13.20617, 13, 2, 3.534201, 14, 1
-13.14209, 13, 2, 3.525928, 14, 1
-13.07801, 13, 2, 3.509724, 14, 1
-13.01394, 13, 2, 3.493747, 13, 1
-12.94986, 12, 2, 3.477881, 13, 1
-12.88578, 12, 2, 3.461385, 13, 1
-12.82171, 12, 2, 3.452921, 13, 1
-12.75763, 12, 2, 3.436274, 13, 1
-12.69355, 12, 2, 3.41992, 13, 1
-12.62948, 12, 2, 3.403711, 13, 1
-12.5654, 12, 2, 3.38731, 13, 1
-12.50132, 12, 2, 3.379421, 13, 1
-12.43725, 12, 2, 3.363377, 13, 1
-12.37317, 12, 2, 3.348236, 13, 1
-12.30909, 12, 2, 3.333484, 13, 1
-12.24502, 12, 2, 3.318505, 13, 1
-12.18094, 12, 2, 3.311376, 13, 1
-12.11686, 12, 2, 3.29669, 13, 1
-12.05279, 12, 2, 3.274945, 13, 1
-11.98871, 11, 2, 3.268161, 13, 1
-11.92463, 11, 2, 3.260746, 13, 1
-11.86056, 11, 2, 3.247083, 12, 1
-11.79648, 11, 2, 3.232538, 12, 1
-11.7324, 11, 2, 3.217911, 12, 1
-11.66833, 11, 2, 3.2033, 12, 1
-11.60425, 11, 2, 3.187528, 12, 1
-11.54017, 11, 2, 3.179829, 12, 1
-11.4761, 11, 2, 3.162985, 12, 1
-11.41202, 11, 2, 3.145555, 12, 1
-11.34794, 11, 2, 3.12783, 12, 1
-11.28387, 11, 2, 3.109322, 12, 1
-11.21979, 11, 2, 3.100379, 12, 1
-11.15571, 11, 2, 3.081053, 12, 1
-11.09164, 11, 2, 3.061432, 12, 1
-11.02756, 11, 2, 3.041568, 12, 1
-10.96348, 10, 2, 3.031154, 12, 1
-10.89941, 10, 2, 3.010861, 12, 1
-10.83533, 10, 2, 2.989894, 11, 1
-10.77125, 10, 2, 2.968767, 11, 1
-10.70718, 10, 2, 2.947687, 11, 1
-10.6431, 10, 2, 2.936768, 11, 1
-10.57902, 10, 2, 2.915025, 11, 1
-10.51495, 10, 2, 2.892857, 11, 1
-10.45087, 10, 2, 2.871185, 11, 1
-10.38679, 10, 2, 2.849922, 11, 1
-10.32272, 10, 2, 2.839107, 11, 1
-10.25864, 10, 2, 2.818402, 11, 1
-10.19456, 10, 2, 2.797688, 11, 1
-10.13049, 10, 2, 2.776778, 11, 1
-10.06641, 10, 2, 2.756281, 11, 1
-10.00233, 10, 1, 2.736093, 10, 1
-9.993486, 9, 2, 2.726479, 10, 1
-9.92941, 9, 2, 2.706389, 10, 1
-9.865334, 9, 2, 2.686137, 10, 1
-9.801257, 9, 2, 2.665599, 10, 1
-9.73718, 9, 2, 2.644208, 10, 1
-9.673103, 9, 2, 2.633696, 10, 1
-9.609027, 9, 2, 2.612504, 10, 1
-9.54495, 9, 2, 2.590829, 10, 1
-9.480874, 9, 2, 2.569054, 10, 1
-9.416797, 9, 2, 2.557833, 10, 1
-9.35272, 9, 2, 2.535866, 10, 1
-9.288644, 9, 2, 2.513283, 10, 1
-9.224567, 9, 2, 2.491209, 9, 1
-9.16049, 9, 1, 2.468766, 9, 1
-9.151644, 9, 2, 2.457882, 9, 1
-9.087567, 9, 2, 2.435762, 9, 1
-9.023491, 9, 2, 2.413044, 9, 1
-8.959414, 8, 2, 2.390607, 9, 1
-8.895337, 8, 2, 2.368294, 9, 1
-8.831261, 8, 2, 2.344601, 9, 1
-8.767184, 8, 2, 2.332966, 9, 1
-8.703108, 8, 2, 2.308899, 9, 1
-8.63903, 8, 2, 2.284774, 9, 1
-8.574954, 8, 2, 2.261693, 9, 1
-8.510878, 8, 2, 2.238963, 8, 1
-8.446801, 8, 2, 2.227829, 8, 1
-8.382724, 8, 2, 2.205885, 8, 1
-8.318647, 8, 1, 2.184058, 8, 1
-8.309801, 8, 1, 2.162938, 8, 1
-8.300955, 8, 2, 2.14195, 8, 1
-8.236878, 8, 1, 2.131726, 8, 1
-8.228031, 8, 2, 2.11117, 8, 1
-8.163955, 8, 1, 2.091025, 8, 1
-8.155108, 8, 1, 2.071361, 8, 1
-8.146262, 8, 2, 2.05136, 8, 1
-8.082186, 8, 2, 2.041224, 8, 1
-8.018108, 8, 2, 2.020748, 8, 1
-7.954032, 7, 2, 2.000086, 8, 1
-7.889956, 7, 1, 1.979421, 7, 1
-7.881109, 7, 2, 1.95834, 7, 1
-7.817032, 7, 1, 1.947477, 7, 1
-7.808186, 7, 2, 1.925508, 7, 1
-7.744109, 7, 1, 1.903172, 7, 1
-7.735263, 7, 1, 1.880713, 7, 1
-7.726417, 7, 2, 1.858345, 7, 1
-7.66234, 7, 2, 1.846595, 7, 1
-7.598263, 7, 1, 1.82299, 7, 1
-7.589417, 7, 1, 1.798779, 7, 1
-7.58057, 7, 2, 1.774886, 7, 1
-7.516494, 7, 2, 1.750954, 7, 1
-7.452417, 7, 2, 1.738988, 6, 1
-7.38834, 7, 2, 1.715336, 6, 1
-7.324264, 7, 2, 1.691157, 6, 1
-7.260187, 7, 2, 1.66816, 6, 1
-7.19611, 7, 2, 1.645724, 6, 1
-7.132034, 7, 2, 1.634549, 6, 1
-7.067957, 7, 2, 1.613274, 6, 1
-7.003881, 7, 2, 1.590657, 6, 1
-6.939804, 6, 2, 1.568413, 6, 1
-6.875727, 6, 2, 1.546958, 6, 1
-6.811651, 6, 2, 1.536233, 6, 1
-6.747574, 6, 1, 1.514527, 6, 1
-6.738728, 6, 2, 1.492594, 5, 1
-6.674651, 6, 2, 1.4714, 5, 1
-6.610574, 6, 2, 1.450062, 5, 1
-6.546498, 6, 2, 1.439155, 5, 1
-6.482421, 6, 2, 1.417367, 5, 1
-6.418344, 6, 2, 1.395645, 5, 1
-6.354268, 6, 2, 1.373693, 5, 1
-6.290191, 6, 2, 1.351819, 5, 1
-6.226114, 6, 2, 1.340607, 5, 1
-6.162038, 6, 2, 1.318528, 5, 1
-6.09796, 6, 2, 1.295939, 5, 1
-6.033883, 6, 2, 1.273094, 5, 1
-5.969806, 5, 2, 1.249805, 4, 1
-5.905729, 5, 2, 1.22635, 4, 1
-5.841652, 5, 2, 1.214022, 4, 1
-5.777575, 5, 2, 1.190295, 4, 1
-5.713498, 5, 2, 1.166017, 4, 1
-5.649421, 5, 2, 1.141326, 4, 1
-5.585344, 5, 2, 1.129351, 4, 1
-5.521267, 5, 2, 1.105355, 4, 1
-5.45719, 5, 2, 1.081184, 4, 1
-5.393113, 5, 2, 1.057541, 4, 1
-5.329036, 5, 2, 1.034342, 4, 1
-5.264959, 5, 2, 1.023551, 4, 1
-5.200882, 5, 2, 1.001223, 4, 1
-5.136805, 5, 2, 0.9797423, 3, 1
-5.072728, 5, 2, 0.9577727, 3, 1
-5.008651, 5, 2, 0.9362829, 3, 1
-4.944574, 4, 2, 0.9258728, 3, 1
-4.880497, 4, 2, 0.9044442, 3, 1
-4.81642, 4, 2, 0.8830326, 3, 1
-4.752343, 4, 2, 0.8625195, 3, 1
-4.688266, 4, 2, 0.8418136, 3, 1
-4.624189, 4, 2, 0.8312037, 3, 1
-4.560112, 4, 2, 0.810411, 3, 1
-4.496035, 4, 2, 0.7888343, 3, 1
-4.431958, 4, 2, 0.7681913, 3, 1
-4.367881, 4, 2, 0.7465632, 2, 1
-4.303804, 4, 2, 0.725178, 2, 1
-4.239727, 4, 2, 0.7142313, 2, 1
-4.17565, 4, 2, 0.6928487, 2, 1
-4.111573, 4, 2, 0.6714802, 2, 1
-4.047496, 4, 2, 0.6493707, 2, 1
-3.983419, 3, 2, 0.6275697, 2, 1
-3.919342, 3, 2, 0.6166034, 2, 1
-3.855265, 3, 2, 0.5949881, 2, 1
-3.791188, 3, 2, 0.5728784, 2, 1
-3.727111, 3, 2, 0.5618281, 2, 1
-3.663034, 3, 2, 0.5278306, 2, 1
-3.598957, 3, 2, 0.5168304, 2, 1
-3.53488, 3, 2, 0.4952877, 1, 1
-3.470803, 3, 2, 0.4740872, 1, 1
-3.406726, 3, 2, 0.4538422, 1, 1
-3.342649, 3, 2, 0.4439569, 1, 1
-3.278572, 3, 2, 0.4237628, 1, 1
-3.214495, 3, 2, 0.4030631, 1, 1
-3.150418, 3, 2, 0.392242, 1, 1
-3.086341, 3, 2, 0.3705406, 1, 1
-3.022264, 3, 2, 0.349263, 1, 1
-2.958187, 2, 2, 0.3269551, 1, 1
-2.89411, 2, 2, 0.3044982, 1, 1
-2.830033, 2, 2, 0.281683, 1, 1
-2.765956, 2, 2, 0.2584312, 1, 1
-2.701879, 2, 2, 0.2467709, 0, 1
-2.637802, 2, 2, 0.2228065, 0, 1
-2.573725, 2, 2, 0.1987901, 0, 1
-2.509648, 2, 2, 0.1741624, 0, 1
-2.445571, 2, 2, 0.1486604, 0, 1
-2.381494, 2, 2, 0.1224537, 0, 1
-2.317417, 2, 2, 0.1093411, 0, 1
-2.25334, 2, 2, 0.08312488, 0, 1
-2.189263, 2, 2, 0.06971645, 0, 1
-2.125185, 2, 2, 0.02910423, 0, 1
-2.061109, 2, 2, 0.001417398, 0, 1
-1.997031, 1, 2, -0.01251268, 0, 1
-1.932955, 1, 2, -0.03989744, 0, 1
-1.868878, 1, 2, -0.0684166, 0, 1
-1.804801, 1, 2, -0.09533167, 0, 1
-1.740723, 1, 2, -0.1082754, 0, 1
-1.676646, 1, 2, -0.1338944, 0, 1
-1.612569, 1, 2, -0.1584792, 0, 1
-1.548493, 1, 2, -0.1811411, 0, 1
-1.484416, 1, 2, -0.2033069, 0, 1
-1.420339, 1, 2, -0.2133708, 0, 1
-1.356262, 1, 2, -0.2345889, 0, 1
-1.292185, 1, 2, -0.2551236, -1, 1
-1.228108, 1, 2, -0.2741876, -1, 1
-1.164031, 1, 2, -0.2932906, -1, 1
-1.099954, 1, 2, -0.3023844, -1, 1
-1.035877, 1, 2, -0.3212752, -1, 1
-0.9718002, 0, 2, -0.3394084, -1, 1
-0.9077233, 0, 2, -0.3574915, -1, 1
-0.8436463, 0, 2, -0.3760409, -1, 1
-0.7795694, 0, 2, -0.3940382, -1, 1
-0.7154925, 0, 2, -0.4032226, -1, 1
-0.6514156, 0, 2, -0.4216022, -1, 1
-0.5873387, 0, 2, -0.4398322, -1, 1
-0.5232618, 0, 2, -0.4588399, -1, 1
-0.4591849, 0, 2, -0.4773164, -1, 1
-0.3951079, 0, 2, -0.4864669, -1, 1
-0.331031, 0, 2, -0.5046647, -2, 1
-0.2669541, 0, 2, -0.5225024, -2, 1
-0.2028772, 0, 2, -0.5402856, -2, 1
-0.1388002, 0, 2, -0.5577197, -2, 1
-0.07472333, 0, 2, -0.5662451, -2, 1
-0.0106464, 0, 2, -0.5831151, -2, 1
0.05343052, 0, 2, -0.6006083, -2, 1
0.1175074, 0, 2, -0.6177716, -2, 1
0.1815844, 0, 2, -0.6256499, -2, 1
0.2456613, 0, 2, -0.6417112, -2, 1
0.3097382, 0, 2, -0.6576009, -2, 1
0.3738151, 0, 2, -0.6722937, -2, 1
0.437892, 0, 2, -0.6866498, -2, 1
0.501969, 0, 2, -0.6937261, -2, 1
0.5660459, 0, 2, -0.7084661, -2, 1
0.6301228, 0, 2, -0.722666, -2, 1
0.6941997, 0, 2, -0.7364995, -2, 1
0.7582766, 0, 2, -0.7501121, -3, 1
0.8223536, 0, 2, -0.7629836, -3, 1
0.8864305, 0, 2, -0.7693989, -3, 1
0.9505074, 0, 2, -0.7820432, -3, 1
1.014584, -1, 2, -0.7946115, -3, 1
1.078661, -1, 2, -0.8069754, -3, 1
1.142738, -1, 2, -0.8131237, -3, 1
1.206815, -1, 2, -0.8256063, -3, 1
1.270892, -1, 2, -0.8383327, -3, 1
1.334969, -1, 2, -0.8515809, -3, 1
1.399046, -1, 2, -0.8645139, -3, 1
1.463123, -1, 2, -0.8710341, -3, 1
1.5272, -1, 2, -0.8840609, -3, 1
1.591277, -1, 2, -0.8968987, -3, 1
1.655354, -1, 2, -0.9096622, -3, 1
1.719431, -1, 2, -0.9222999, -3, 1
1.783508, -1, 2, -0.928484, -3, 1
1.847585, -1, 2, -0.9404526, -3, 1
1.911662, -1, 2, -0.9535098, -3, 1
1.975739, -1, 2, -0.9668417, -3, 1
2.039816, -2, 2, -0.9793634, -3, 1
2.103893, -2, 2, -0.9863124, -3, 1
2.16797, -2, 2, -0.9999175, -3, 1
2.232047, -2, 2, -1.011994, -4, 1
2.296124, -2, 2, -1.024858, -4, 1
2.360201, -2, 2, -1.038429, -4, 1
2.424278, -2, 2, -1.044852, -4, 1
2.488355, -2, 2, -1.056613, -4, 1
2.552432, -2, 2, -1.067461, -4, 1
2.616509, -2, 2, -1.078185, -4, 1
2.680586, -2, 2, -1.088328, -4, 1
2.744663, -2, 2, -1.098174, -4, 1
2.80874, -2, 2, -1.1029, -4, 1
2.872817, -2, 2, -1.111774, -4, 1
2.936894, -2, 2, -1.119977, -4, 1
3.000971, -3, 2, -1.127152, -4, 1
3.065048, -3, 2, -1.13358, -4, 1
3.129125, -3, 2, -1.136638, -4, 1
3.193202, -3, 2, -1.142082, -4, 1
3.257279, -3, 2, -1.146643, -4, 1
3.321356, -3, 2, -1.150237, -4, 1
3.385433, -3, 2, -1.152983, -4, 1
3.44951, -3, 2, -1.154104, -4, 1
3.513587, -3, 2, -1.15653, -4, 1
3.577664, -3, 2, -1.158276, -4, 1
3.641741, -3, 2, -1.159519, -4, 1
3.705818, -3, 2, -1.161776, -4, 1
3.769895, -3, 2, -1.162395, -4, 1
3.833972, -3, 2, -1.163194, -4, 1
3.898049, -3, 2, -1.164088, -4, 1
3.962126, -3, 2, -1.164458, -4, 1
4.026203, -4, 2, -1.164874, -4, 1
4.090281, -4, 2, -1.165634, -4, 1
4.154357, -4, 2, -1.166186, -4, 1
4.218434, -4, 2, -1.167354, -4, 1
4.282511, -4, 2, -1.168026, -4, 1
4.346588, -4, 2, -1.168562, -4, 1
4.410666, -4, 2, -1.169269, -4, 1
4.474742, -4, 2, -1.170285, -4, 1
4.538819, -4, 2, -1.170867, -4, 1
4.602896, -4, 2, -1.171434, -4, 1
4.666974, -4, 2, -1.172047, -4, 1
4.73105, -4, 2, -1.172427, -4, 1
4.795127, -4, 2, -1.172757, -4, 1
4.859204, -4, 2, -1.173, -4, 1
4.923282, -4, 2, -1.17279, -4, 1
4.987359, -4, 2, -1.172887, -4, 1
5.051435, -5, 2, -1.172637, -4, 1
5.115512, -5, 2, -1.172543, -4, 1
5.17959, -5, 2, -1.172999, -4, 1
5.243667, -5, 2, -1.17399, -4, 1
5.307744, -5, 2, -1.174599, -4, 1
5.37182, -5, 2, -1.176144, -4, 1
5.435897, -5, 2, -1.177987, -4, 1
5.499975, -5, 2, -1.179387, -4, 1
5.564052, -5, 2, -1.180365, -4, 1
5.628129, -5, 2, -1.180882, -4, 1
5.692205, -5, 2, -1.183199, -4, 1
5.756283, -5, 2, -1.184506, -4, 1
5.82036, -5, 2, -1.18473, -4, 1
5.884437, -5, 2, -1.184909, -4, 1
5.948514, -5, 2, -1.185115, -4, 1
6.012591, -6, 2, -1.185717, -4, 1
6.076668, -6, 2, -1.186616, -4, 1
6.140744, -6, 2, -1.18663, -4, 1
6.204821, -6, 2, -1.186234, -4, 1
6.268898, -6, 2, -1.185742, -4, 1
6.332974, -6, 2, -1.184633, -4, 1
6.397051, -6, 2, -1.183512, -4, 1
6.461128, -6, 2, -1.182695, -4, 1
6.525204, -6, 2, -1.180523, -4, 1
6.589281, -6, 2, -1.178286, -4, 1
6.653358, -6, 2, -1.175995, -4, 1
6.717434, -6, 2, -1.174353, -4, 1
6.781511, -6, 2, -1.171696, -4, 1
6.845587, -6, 2, -1.168872, -4, 1
6.909664, -6, 2, -1.166126, -4, 1
6.973741, -6, 2, -1.164171, -4, 1
7.037817, -7, 2, -1.160888, -4, 1
7.101894, -7, 2, -1.157487, -4, 1
7.165971, -7, 2, -1.1526, -4, 1
7.230047, -7, 2, -1.147176, -4, 1
7.294124, -7, 2, -1.145065, -4, 1
7.358201, -7, 2, -1.139642, -4, 1
7.422277, -7, 2, -1.135945, -4, 1
7.486354, -7, 2, -1.130271, -4, 1
7.550431, -7, 2, -1.124647, -4, 1
7.614507, -7, 2, -1.12178, -4, 1
7.678584, -7, 2, -1.114978, -4, 1
7.742661, -7, 2, -1.108138, -4, 1
7.806737, -7, 2, -1.099812, -4, 1
7.870814, -7, 2, -1.091965, -4, 1
7.93489, -7, 2, -1.087804, -4, 1
7.998967, -7, 2, -1.080182, -4, 1
8.063044, -8, 2, -1.073112, -4, 1
8.12712, -8, 2, -1.065691, -4, 1
8.191197, -8, 2, -1.062649, -4, 1
8.255274, -8, 2, -1.056016, -4, 1
8.31935, -8, 2, -1.050163, -4, 1
