timestamp_sec,frame_id,game_played,yielding,player1discrete,player2discrete,player1yieldprob,player2yieldprob,player1_pose_x,player1_pose_y,player1_pose_z,player1_pose_orient_x,player1_pose_orient_y,player1_pose_orient_z,player1_pose_orient_w,player2_pose_x,player2_pose_y,player2_pose_z,player2_pose_orient_x,player2_pose_orient_y,player2_pose_orient_z,player2_pose_orient_w
1718118558.4595592,map,True,False,3,5,0.0,0.0,2.013470411300659,-1.682185173034668,0.0,0.0,0.0,0.051526757555536366,0.9986716179532927,3.9296382604096394,-6.690920230852527,0.6017670369355816,0.0,0.0,0.0,1.0
1718118558.5072708,map,True,False,3,5,0.0,0.0,2.013470411300659,-1.682185173034668,0.0,0.0,0.0,0.051526757555536366,0.9986716179532927,3.965384294575425,-6.884105288956828,0.861899311501505,0.0,0.0,0.0,1.0
1718118558.6072602,map,True,False,3,5,0.0,0.0,2.013470411300659,-1.682185173034668,0.0,0.0,0.0,0.051526757555536366,0.9986716179532927,3.965384294575425,-6.884105288956828,0.861899311501505,0.0,0.0,0.0,1.0
1718118558.6572587,map,True,False,3,5,0.0,0.0,2.013470411300659,-1.682185173034668,0.0,0.0,0.0,0.051526757555536366,0.9986716179532927,3.965384294575425,-6.884105288956828,0.861899311501505,0.0,0.0,0.0,1.0
1718118558.7576275,map,True,False,3,5,0.0,0.0,2.013470411300659,-1.682185173034668,0.0,0.0,0.0,0.051526757555536366,0.9986716179532927,3.965384294575425,-6.884105288956828,0.861899311501505,0.0,0.0,0.0,1.0
1718118558.857735,map,True,False,3,6,0.0,0.0,2.1570723056793213,-1.7340569496154785,0.0,0.0,0.0,0.05190767476533581,0.9986518922203327,4.055392954408068,-6.978683905360054,0.9743819958352663,0.0,0.0,0.0,1.0
1718118558.9080071,map,True,False,3,6,0.0,0.0,2.1570723056793213,-1.7340569496154785,0.0,0.0,0.0,0.05190767476533581,0.9986518922203327,4.055392954408068,-6.978683905360054,0.9743819958352663,0.0,0.0,0.0,1.0
1718118558.9595037,map,True,False,3,6,0.0,0.0,2.1570723056793213,-1.7340569496154785,0.0,0.0,0.0,0.05190767476533581,0.9986518922203327,4.055392954408068,-6.978683905360054,0.9743819958352663,0.0,0.0,0.0,1.0
1718118559.061045,map,True,False,3,6,0.0,0.0,2.1570723056793213,-1.7340569496154785,0.0,0.0,0.0,0.05190767476533581,0.9986518922203327,4.055392954408068,-6.978683905360054,0.9743819958352663,0.0,0.0,0.0,1.0
1718118559.1134796,map,True,False,3,6,0.0,0.0,2.1570723056793213,-1.7340569496154785,0.0,0.0,0.0,0.05190767476533581,0.9986518922203327,4.055392954408068,-6.978683905360054,0.9743819958352663,0.0,0.0,0.0,1.0
1718118559.163532,map,True,False,3,6,0.0,0.0,2.1570723056793213,-1.7340569496154785,0.0,0.0,0.0,0.05190767476533581,0.9986518922203327,4.055392954408068,-6.978683905360054,0.9743819958352663,0.0,0.0,0.0,1.0
1718118559.4614162,map,True,True,3,3,0.6616527499769684,0.6616527499769684,2.1570723056793213,-1.7340569496154785,0.0,0.0,0.0,0.05190767476533581,0.9986518922203327,3.694435969137101,-3.93578427691704,0.6482866144305884,0.0,0.0,0.0,1.0
1718118559.5120916,map,True,False,3,3,0.6616527499769684,0.6616527499769684,2.1570723056793213,-1.7340569496154785,0.0,0.0,0.0,0.05190767476533581,0.9986518922203327,3.694435969137101,-3.93578427691704,0.6482866144305884,0.0,0.0,0.0,1.0
1718118559.5630052,map,True,True,3,3,0.6616527499769684,0.6616527499769684,2.3154468536376953,-1.7667789459228516,0.0,0.0,0.0,0.05308264421618601,0.9985901162241522,3.694435969137101,-3.93578427691704,0.6482866144305884,0.0,0.0,0.0,1.0
1718118559.6625178,map,True,False,3,3,0.6616527499769684,0.6616527499769684,2.3154468536376953,-1.7667789459228516,0.0,0.0,0.0,0.05308264421618601,0.9985901162241522,3.694435969137101,-3.93578427691704,0.6482866144305884,0.0,0.0,0.0,1.0
1718118559.7132952,map,True,True,3,3,0.6616527499769684,0.6616527499769684,2.3154468536376953,-1.7667789459228516,0.0,0.0,0.0,0.05308264421618601,0.9985901162241522,3.694435969137101,-3.93578427691704,0.6482866144305884,0.0,0.0,0.0,1.0
1718118559.7646277,map,True,True,3,3,0.6616527499769684,0.6616527499769684,2.3154468536376953,-1.7667789459228516,0.0,0.0,0.0,0.05308264421618601,0.9985901162241522,3.694435969137101,-3.93578427691704,0.6482866144305884,0.0,0.0,0.0,1.0
1718118559.815396,map,True,False,3,2,0.0,0.0,2.3154468536376953,-1.7667789459228516,0.0,0.0,0.0,0.05308264421618601,0.9985901162241522,3.717677845617971,-3.7028098916347103,0.6844263629395226,0.0,0.0,0.0,1.0
1718118559.8670013,map,True,False,3,2,0.0,0.0,2.3154468536376953,-1.7667789459228516,0.0,0.0,0.0,0.05308264421618601,0.9985901162241522,3.717677845617971,-3.7028098916347103,0.6844263629395226,0.0,0.0,0.0,1.0
1718118559.9168386,map,True,False,3,2,0.0,0.0,2.3154468536376953,-1.7667789459228516,0.0,0.0,0.0,0.05308264421618601,0.9985901162241522,3.717677845617971,-3.7028098916347103,0.6844263629395226,0.0,0.0,0.0,1.0
1718118559.9647222,map,True,False,3,2,0.0,0.0,2.3154468536376953,-1.7667789459228516,0.0,0.0,0.0,0.05308264421618601,0.9985901162241522,3.717677845617971,-3.7028098916347103,0.6844263629395226,0.0,0.0,0.0,1.0
1718118560.016103,map,True,False,3,2,0.0,0.0,2.3154468536376953,-1.7667789459228516,0.0,0.0,0.0,0.05308264421618601,0.9985901162241522,3.717677845617971,-3.7028098916347103,0.6844263629395226,0.0,0.0,0.0,1.0
1718118560.0665092,map,True,False,3,2,0.0,0.0,2.3154468536376953,-1.7667789459228516,0.0,0.0,0.0,0.05308264421618601,0.9985901162241522,3.717677845617971,-3.7028098916347103,0.6844263629395226,0.0,0.0,0.0,1.0
1718118560.1656346,map,True,False,3,2,0.0,0.0,2.3154468536376953,-1.7667789459228516,0.0,0.0,0.0,0.05308264421618601,0.9985901162241522,3.764376581831211,-3.6193616762050604,0.692806177779036,0.0,0.0,0.0,1.0
1718118560.2164083,map,True,False,3,2,0.0,0.0,2.3154468536376953,-1.7667789459228516,0.0,0.0,0.0,0.05308264421618601,0.9985901162241522,3.764376581831211,-3.6193616762050604,0.692806177779036,0.0,0.0,0.0,1.0
1718118560.4660883,map,True,False,2,2,0.49874686716791977,0.49874686716791977,2.4573135375976562,-1.8038800954818726,0.0,0.0,0.0,0.05252740754174688,0.998619482681479,3.7661617137047356,-3.2985841655194643,0.6858509354191494,0.0,0.0,0.0,1.0
1718118560.5675495,map,True,True,2,2,0.49874686716791977,0.49874686716791977,2.4573135375976562,-1.8038800954818726,0.0,0.0,0.0,0.05252740754174688,0.998619482681479,3.7661617137047356,-3.2985841655194643,0.6858509354191494,0.0,0.0,0.0,1.0
1718118560.688714,map,True,False,2,2,0.49874686716791977,0.49874686716791977,2.4573135375976562,-1.8038800954818726,0.0,0.0,0.0,0.05252740754174688,0.998619482681479,3.7661617137047356,-3.2985841655194643,0.6858509354191494,0.0,0.0,0.0,1.0
1718118560.7805,map,True,False,2,2,0.49874686716791977,0.49874686716791977,2.4573135375976562,-1.8038800954818726,0.0,0.0,0.0,0.05252740754174688,0.998619482681479,3.859329458343919,-3.288409799023234,0.6856697847406362,0.0,0.0,0.0,1.0
1718118560.8790252,map,True,False,2,4,0.0,0.0,2.4573135375976562,-1.8038800954818726,0.0,0.0,0.0,0.05252740754174688,0.998619482681479,4.588061922477645,-4.741616154969465,0.6852023148754591,0.0,0.0,0.0,1.0
1718118560.9300227,map,True,False,2,4,0.0,0.0,2.4573135375976562,-1.8038800954818726,0.0,0.0,0.0,0.05252740754174688,0.998619482681479,4.588061922477645,-4.741616154969465,0.6852023148754591,0.0,0.0,0.0,1.0
1718118561.0300386,map,True,False,2,4,0.0,0.0,2.5805134773254395,-1.8526065349578857,0.0,0.0,0.0,0.05468576560366227,0.9985036084850591,4.588061922477645,-4.741616154969465,0.6852023148754591,0.0,0.0,0.0,1.0
1718118561.1323073,map,True,False,2,4,0.0,0.0,2.5805134773254395,-1.8526065349578857,0.0,0.0,0.0,0.05468576560366227,0.9985036084850591,4.674847981078308,-4.7627449823980275,0.690107391192264,0.0,0.0,0.0,1.0
1718118561.1812706,map,True,False,2,4,0.0,0.0,2.5805134773254395,-1.8526065349578857,0.0,0.0,0.0,0.05468576560366227,0.9985036084850591,4.638934890358749,-4.789830500507753,0.6902731305668549,0.0,0.0,0.0,1.0
1718118561.490631,map,True,False,2,4,0.0,0.0,2.5805134773254395,-1.8526065349578857,0.0,0.0,0.0,0.05468576560366227,0.9985036084850591,4.5695882068118125,-4.834353473739895,0.6856790229455658,0.0,0.0,0.0,1.0
1718118561.5368066,map,True,False,2,4,0.0,0.0,2.5805134773254395,-1.8526065349578857,0.0,0.0,0.0,0.05468576560366227,0.9985036084850591,4.526580619304154,-4.824786619766415,0.6857664718210779,0.0,0.0,0.0,1.0
1718118561.636187,map,True,False,2,4,0.0,0.0,2.5805134773254395,-1.8526065349578857,0.0,0.0,0.0,0.05468576560366227,0.9985036084850591,4.526580619304154,-4.824786619766415,0.6857664718210779,0.0,0.0,0.0,1.0
1718118561.736175,map,True,False,2,4,0.0,0.0,2.678825855255127,-1.892247200012207,0.0,0.0,0.0,0.057297547711507406,0.9983571385860731,4.526580619304154,-4.824786619766415,0.6857664718210779,0.0,0.0,0.0,1.0
1718118561.789134,map,True,False,2,4,0.0,0.0,2.678825855255127,-1.892247200012207,0.0,0.0,0.0,0.057297547711507406,0.9983571385860731,4.526580619304154,-4.824786619766415,0.6857664718210779,0.0,0.0,0.0,1.0
1718118561.8892446,map,True,False,2,4,0.0,0.0,2.678825855255127,-1.892247200012207,0.0,0.0,0.0,0.057297547711507406,0.9983571385860731,4.538370997906432,-4.887124194302028,0.6860825869343165,0.0,0.0,0.0,1.0
1718118561.9390833,map,True,False,2,4,0.0,0.0,2.678825855255127,-1.892247200012207,0.0,0.0,0.0,0.057297547711507406,0.9983571385860731,4.538370997906432,-4.887124194302028,0.6860825869343165,0.0,0.0,0.0,1.0
1718118562.038921,map,True,False,2,4,0.0,0.0,2.678825855255127,-1.892247200012207,0.0,0.0,0.0,0.057297547711507406,0.9983571385860731,4.538370997906432,-4.887124194302028,0.6860825869343165,0.0,0.0,0.0,1.0
1718118562.1414504,map,True,False,2,4,0.0,0.0,2.678825855255127,-1.892247200012207,0.0,0.0,0.0,0.057297547711507406,0.9983571385860731,4.537624205136236,-5.140221551478516,0.7806787859807898,0.0,0.0,0.0,1.0
1718118562.1916294,map,True,False,2,4,0.0,0.0,2.6909289360046387,-1.8903610706329346,0.0,0.0,0.0,0.057370816358573135,0.9983529444606154,4.408761140264714,-5.218257321433662,0.7392484029547894,0.0,0.0,0.0,1.0
1718118562.242086,map,True,False,2,4,0.0,0.0,2.6909289360046387,-1.8903610706329346,0.0,0.0,0.0,0.057370816358573135,0.9983529444606154,4.408761140264714,-5.218257321433662,0.7392484029547894,0.0,0.0,0.0,1.0
