car_pos_meter , car_pos_cell, car_speed, ped_pos_meter, ped_pos_cell, ped_speed
-25.625, 25, 2, 3.998833, 25, 1
-25.52088, 25, 2, 3.995968, 25, 1
-25.41675, 25, 2, 3.99445, 25, 1
-25.31263, 25, 2, 3.992203, 25, 1
-25.2085, 25, 2, 3.989939, 25, 1
-25.10438, 25, 2, 3.988547, 25, 1
-25.00025, 25, 2, 3.987453, 25, 1
-24.89613, 24, 2, 3.987005, 25, 1
-24.792, 24, 2, 3.986269, 25, 1
-24.68788, 24, 2, 3.986077, 25, 1
-24.58375, 24, 2, 3.986195, 25, 1
-24.47963, 24, 2, 3.986595, 25, 1
-24.37551, 24, 2, 3.987218, 25, 1
-24.27138, 24, 2, 3.987689, 25, 1
-24.16726, 24, 2, 3.988442, 25, 1
-24.06313, 24, 2, 3.989554, 25, 1
-23.95901, 23, 2, 3.990633, 25, 1
-23.85488, 23, 2, 3.991971, 25, 1
-18.64865, 18, 2, 3.987216, 25, 1
-13.44243, 13, 2, 3.645402, 23, 1
-8.23619, 8, 2, 3.292819, 21, 1
-3.029933, 3, 2, 3.089551, 20, 1
2.176317, -2, 2, 2.986154, 19, 1
7.382574, -7, 2, 3.092331, 20, 1
12.58882, -12, 2, 3.126518, 20, 1
17.79504, -17, 2, 3.158492, 20, 1
23.00127, -23, 2, 3.125671, 20, 1
28.2075, -28, 2, 3.129832, 20, 1
33.41372, -33, 2, 3.131091, 20, 1
