timestamp_sec,frame_id,game_played,yielding,player1discrete,player2discrete,player1yieldprob,player2yieldprob,player1_pose_x,player1_pose_y,player1_pose_z,player1_pose_orient_x,player1_pose_orient_y,player1_pose_orient_z,player1_pose_orient_w,player2_pose_x,player2_pose_y,player2_pose_z,player2_pose_orient_x,player2_pose_orient_y,player2_pose_orient_z,player2_pose_orient_w
1717775441.3845406,map,True,False,4,4,0.5922520728754596,0.5922520728754596,2.683351993560791,-2.6094493865966797,0.0,0.0,0.0,0.05434335810016885,0.9985223074461762,4.2913834593936535,-6.1642052268492025,0.7362979467095393,0.0,0.0,0.0,1.0
1717775441.4355848,map,True,True,4,4,0.5922520728754596,0.5922520728754596,2.683351993560791,-2.6094493865966797,0.0,0.0,0.0,0.05434335810016885,0.9985223074461762,4.2913834593936535,-6.1642052268492025,0.7362979467095393,0.0,0.0,0.0,1.0
1717775441.4886348,map,True,True,4,4,0.5922520728754596,0.5922520728754596,2.683351993560791,-2.6094493865966797,0.0,0.0,0.0,0.05434335810016885,0.9985223074461762,4.2913834593936535,-6.1642052268492025,0.7362979467095393,0.0,0.0,0.0,1.0
1717775441.5847795,map,True,False,4,4,0.5922520728754596,0.5922520728754596,2.683351993560791,-2.6094493865966797,0.0,0.0,0.0,0.05434335810016885,0.9985223074461762,4.2913834593936535,-6.1642052268492025,0.7362979467095393,0.0,0.0,0.0,1.0
1717775441.7402747,map,True,False,4,4,0.5922520728754596,0.5922520728754596,2.683351993560791,-2.6094493865966797,0.0,0.0,0.0,0.05434335810016885,0.9985223074461762,4.334968594249679,-5.875584447829013,0.7267462729623219,0.0,0.0,0.0,1.0
1717775441.7862878,map,True,False,4,4,0.5922520728754596,0.5922520728754596,2.683351993560791,-2.6094493865966797,0.0,0.0,0.0,0.05434335810016885,0.9985223074461762,4.334968594249679,-5.875584447829013,0.7267462729623219,0.0,0.0,0.0,1.0
1717775441.8357363,map,True,False,4,4,0.5922520728754596,0.5922520728754596,2.8156850337982178,-2.636305809020996,0.0,0.0,0.0,0.049526658570285514,0.9987728069265206,4.334968594249679,-5.875584447829013,0.7267462729623219,0.0,0.0,0.0,1.0
1717775441.8858762,map,True,True,4,4,0.5922520728754596,0.5922520728754596,2.8156850337982178,-2.636305809020996,0.0,0.0,0.0,0.049526658570285514,0.9987728069265206,4.334968594249679,-5.875584447829013,0.7267462729623219,0.0,0.0,0.0,1.0
1717775441.936327,map,True,True,4,4,0.5922520728754596,0.5922520728754596,2.8156850337982178,-2.636305809020996,0.0,0.0,0.0,0.049526658570285514,0.9987728069265206,4.334968594249679,-5.875584447829013,0.7267462729623219,0.0,0.0,0.0,1.0
1717775442.036187,map,True,False,4,3,0.0,0.0,2.8156850337982178,-2.636305809020996,0.0,0.0,0.0,0.049526658570285514,0.9987728069265206,4.363558666850289,-5.5667978023492175,0.7045207218934355,0.0,0.0,0.0,1.0
1717775442.0876157,map,True,False,4,3,0.0,0.0,2.8156850337982178,-2.636305809020996,0.0,0.0,0.0,0.049526658570285514,0.9987728069265206,4.366237548600064,-5.559283288445489,0.7134505672406817,0.0,0.0,0.0,1.0
1717775442.1403248,map,True,False,4,3,0.0,0.0,2.8156850337982178,-2.636305809020996,0.0,0.0,0.0,0.049526658570285514,0.9987728069265206,4.366237548600064,-5.559283288445489,0.7134505672406817,0.0,0.0,0.0,1.0
1717775442.2366333,map,True,False,4,3,0.0,0.0,2.8156850337982178,-2.636305809020996,0.0,0.0,0.0,0.049526658570285514,0.9987728069265206,4.366237548600064,-5.559283288445489,0.7134505672406817,0.0,0.0,0.0,1.0
1717775442.2893872,map,True,False,4,3,0.0,0.0,2.8156850337982178,-2.636305809020996,0.0,0.0,0.0,0.049526658570285514,0.9987728069265206,4.366237548600064,-5.559283288445489,0.7134505672406817,0.0,0.0,0.0,1.0
1717775442.3389394,map,True,False,4,3,0.0,0.0,2.8156850337982178,-2.636305809020996,0.0,0.0,0.0,0.049526658570285514,0.9987728069265206,4.366237548600064,-5.559283288445489,0.7134505672406817,0.0,0.0,0.0,1.0
1717775442.3943322,map,True,False,4,3,0.0,0.0,2.8156850337982178,-2.636305809020996,0.0,0.0,0.0,0.049526658570285514,0.9987728069265206,4.402730318549047,-5.292703512945808,0.7187175844059169,0.0,0.0,0.0,1.0
1717775442.4397545,map,True,False,4,3,0.0,0.0,2.8156850337982178,-2.636305809020996,0.0,0.0,0.0,0.049526658570285514,0.9987728069265206,4.406491964852075,-5.249515604091426,0.7018818790095515,0.0,0.0,0.0,1.0
1717775442.4895318,map,True,False,4,3,0.0,0.0,2.8156850337982178,-2.636305809020996,0.0,0.0,0.0,0.049526658570285514,0.9987728069265206,4.406491964852075,-5.249515604091426,0.7018818790095515,0.0,0.0,0.0,1.0
1717775442.5917327,map,True,False,4,3,0.0,0.0,2.8156850337982178,-2.636305809020996,0.0,0.0,0.0,0.049526658570285514,0.9987728069265206,4.406491964852075,-5.249515604091426,0.7018818790095515,0.0,0.0,0.0,1.0
1717775442.790301,map,True,False,4,3,0.0,0.0,2.8156850337982178,-2.636305809020996,0.0,0.0,0.0,0.049526658570285514,0.9987728069265206,4.464684910697603,-5.003476257802401,0.6777070783843272,0.0,0.0,0.0,1.0
1717775442.8425827,map,True,True,3,3,0.6616527499769684,0.6616527499769684,2.964242935180664,-2.6715359687805176,0.0,0.0,0.0,0.04499078649491433,0.9989874004527923,4.464684910697603,-5.003476257802401,0.6777070783843272,0.0,0.0,0.0,1.0
1717775442.8918016,map,True,True,3,3,0.6616527499769684,0.6616527499769684,2.964242935180664,-2.6715359687805176,0.0,0.0,0.0,0.04499078649491433,0.9989874004527923,4.464684910697603,-5.003476257802401,0.6777070783843272,0.0,0.0,0.0,1.0
1717775442.942935,map,True,True,3,3,0.6616527499769684,0.6616527499769684,2.964242935180664,-2.6715359687805176,0.0,0.0,0.0,0.04499078649491433,0.9989874004527923,4.464684910697603,-5.003476257802401,0.6777070783843272,0.0,0.0,0.0,1.0
1717775443.04427,map,True,True,3,3,0.6616527499769684,0.6616527499769684,2.964242935180664,-2.6715359687805176,0.0,0.0,0.0,0.04499078649491433,0.9989874004527923,4.464684910697603,-5.003476257802401,0.6777070783843272,0.0,0.0,0.0,1.0
1717775443.1447403,map,True,False,3,2,0.0,0.0,2.964242935180664,-2.6715359687805176,0.0,0.0,0.0,0.04499078649491433,0.9989874004527923,4.48762090532233,-4.734593526543364,0.6844660354516194,0.0,0.0,0.0,1.0
1717775443.2007928,map,True,False,3,2,0.0,0.0,2.964242935180664,-2.6715359687805176,0.0,0.0,0.0,0.04499078649491433,0.9989874004527923,4.48762090532233,-4.734593526543364,0.6844660354516194,0.0,0.0,0.0,1.0
1717775443.2514994,map,True,False,3,2,0.0,0.0,2.964242935180664,-2.6715359687805176,0.0,0.0,0.0,0.04499078649491433,0.9989874004527923,4.48762090532233,-4.734593526543364,0.6844660354516194,0.0,0.0,0.0,1.0
1717775443.299061,map,True,False,3,2,0.0,0.0,2.964242935180664,-2.6715359687805176,0.0,0.0,0.0,0.04499078649491433,0.9989874004527923,4.48762090532233,-4.734593526543364,0.6844660354516194,0.0,0.0,0.0,1.0
1717775443.40246,map,True,False,3,2,0.0,0.0,2.964242935180664,-2.6715359687805176,0.0,0.0,0.0,0.04499078649491433,0.9989874004527923,4.452199042439894,-4.527628174980044,0.6869206853115524,0.0,0.0,0.0,1.0
1717775443.4514883,map,True,False,3,2,0.0,0.0,2.964242935180664,-2.6715359687805176,0.0,0.0,0.0,0.04499078649491433,0.9989874004527923,4.4511662047959035,-4.437960305408446,0.6865729693145464,0.0,0.0,0.0,1.0
1717775443.55098,map,True,False,3,2,0.0,0.0,2.964242935180664,-2.6715359687805176,0.0,0.0,0.0,0.04499078649491433,0.9989874004527923,4.45376684517376,-4.407191799967877,0.6864485116397825,0.0,0.0,0.0,1.0
1717775443.6020687,map,True,False,3,2,0.0,0.0,2.964242935180664,-2.6715359687805176,0.0,0.0,0.0,0.04499078649491433,0.9989874004527923,4.45376684517376,-4.407191799967877,0.6864485116397825,0.0,0.0,0.0,1.0
1717775443.7584107,map,True,False,3,2,0.0,0.0,2.964242935180664,-2.6715359687805176,0.0,0.0,0.0,0.04499078649491433,0.9989874004527923,4.525666241945021,-4.250135812752927,0.6832222791295564,0.0,0.0,0.0,1.0
1717775443.8066366,map,True,False,3,2,0.0,0.0,2.964242935180664,-2.6715359687805176,0.0,0.0,0.0,0.04499078649491433,0.9989874004527923,4.525666241945021,-4.250135812752927,0.6832222791295564,0.0,0.0,0.0,1.0
1717775443.9075234,map,True,False,3,2,0.0,0.0,2.964242935180664,-2.6715359687805176,0.0,0.0,0.0,0.04499078649491433,0.9989874004527923,4.525666241945021,-4.250135812752927,0.6832222791295564,0.0,0.0,0.0,1.0
1717775443.9570727,map,True,False,3,2,0.0,0.0,3.0978193283081055,-2.68170166015625,0.0,0.0,0.0,0.04410868807806165,0.9990267338703024,4.525666241945021,-4.250135812752927,0.6832222791295564,0.0,0.0,0.0,1.0
1717775444.0097258,map,True,False,3,2,0.0,0.0,3.0978193283081055,-2.68170166015625,0.0,0.0,0.0,0.04410868807806165,0.9990267338703024,4.525666241945021,-4.250135812752927,0.6832222791295564,0.0,0.0,0.0,1.0
1717775444.1173823,map,True,False,3,2,0.0,0.0,3.0978193283081055,-2.68170166015625,0.0,0.0,0.0,0.04410868807806165,0.9990267338703024,4.516048869222833,-4.0293817262272675,0.6849981613077086,0.0,0.0,0.0,1.0
1717775444.160817,map,True,False,3,2,0.0,0.0,3.0978193283081055,-2.68170166015625,0.0,0.0,0.0,0.04410868807806165,0.9990267338703024,4.500829984730419,-3.9591097120555467,0.6847507889569772,0.0,0.0,0.0,1.0
1717775444.211427,map,True,False,3,2,0.0,0.0,3.0978193283081055,-2.68170166015625,0.0,0.0,0.0,0.04410868807806165,0.9990267338703024,4.475910366284063,-3.917302694443129,0.6846312489942626,0.0,0.0,0.0,1.0
1717775444.319051,map,True,False,3,2,0.0,0.0,3.0978193283081055,-2.68170166015625,0.0,0.0,0.0,0.04410868807806165,0.9990267338703024,4.475910366284063,-3.917302694443129,0.6846312489942626,0.0,0.0,0.0,1.0
1717775444.376026,map,True,False,3,2,0.0,0.0,3.0978193283081055,-2.68170166015625,0.0,0.0,0.0,0.04410868807806165,0.9990267338703024,4.475910366284063,-3.917302694443129,0.6846312489942626,0.0,0.0,0.0,1.0
1717775444.4216223,map,True,False,3,2,0.0,0.0,3.0978193283081055,-2.68170166015625,0.0,0.0,0.0,0.04410868807806165,0.9990267338703024,4.475910366284063,-3.917302694443129,0.6846312489942626,0.0,0.0,0.0,1.0
1717775444.470022,map,True,False,3,2,0.0,0.0,3.0978193283081055,-2.68170166015625,0.0,0.0,0.0,0.04410868807806165,0.9990267338703024,4.475910366284063,-3.917302694443129,0.6846312489942626,0.0,0.0,0.0,1.0
1717775444.5332522,map,True,False,3,2,0.0,0.0,3.0978193283081055,-2.68170166015625,0.0,0.0,0.0,0.04410868807806165,0.9990267338703024,4.513344884170464,-3.890745097771415,0.6845168019019424,0.0,0.0,0.0,1.0
1717775444.62567,map,True,False,3,2,0.0,0.0,3.0978193283081055,-2.68170166015625,0.0,0.0,0.0,0.04410868807806165,0.9990267338703024,4.499763176656936,-3.8641949009864236,0.684437100077217,0.0,0.0,0.0,1.0
1717775444.8314555,map,True,False,3,2,0.0,0.0,3.0978193283081055,-2.68170166015625,0.0,0.0,0.0,0.04410868807806165,0.9990267338703024,4.496164199408887,-3.7695907685801,0.6841276282485466,0.0,0.0,0.0,1.0
1717775444.8814416,map,True,False,3,2,0.0,0.0,3.0978193283081055,-2.68170166015625,0.0,0.0,0.0,0.04410868807806165,0.9990267338703024,4.551663807712678,-3.7639411101478752,0.6840686286958596,0.0,0.0,0.0,1.0
1717775444.9286041,map,True,False,3,2,0.0,0.0,3.2874770164489746,-2.745314836502075,0.0,0.0,0.0,0.04773516378417153,0.998860022341749,4.551663807712678,-3.7639411101478752,0.6840686286958596,0.0,0.0,0.0,1.0
1717775444.978729,map,True,False,3,2,0.0,0.0,3.2874770164489746,-2.745314836502075,0.0,0.0,0.0,0.04773516378417153,0.998860022341749,4.551663807712678,-3.7639411101478752,0.6840686286958596,0.0,0.0,0.0,1.0
1717775445.0300694,map,True,False,3,2,0.0,0.0,3.2874770164489746,-2.745314836502075,0.0,0.0,0.0,0.04773516378417153,0.998860022341749,4.551663807712678,-3.7639411101478752,0.6840686286958596,0.0,0.0,0.0,1.0
1717775445.0814207,map,True,False,3,2,0.0,0.0,3.2874770164489746,-2.745314836502075,0.0,0.0,0.0,0.04773516378417153,0.998860022341749,4.551663807712678,-3.7639411101478752,0.6840686286958596,0.0,0.0,0.0,1.0
1717775445.1285532,map,True,False,3,2,0.0,0.0,3.2874770164489746,-2.745314836502075,0.0,0.0,0.0,0.04773516378417153,0.998860022341749,4.551663807712678,-3.7639411101478752,0.6840686286958596,0.0,0.0,0.0,1.0
1717775445.2307506,map,True,False,3,2,0.0,0.0,3.2874770164489746,-2.745314836502075,0.0,0.0,0.0,0.04773516378417153,0.998860022341749,4.567946447269776,-3.723432011098682,0.682310349194418,0.0,0.0,0.0,1.0
1717775445.3309386,map,True,False,3,2,0.0,0.0,3.2874770164489746,-2.745314836502075,0.0,0.0,0.0,0.04773516378417153,0.998860022341749,4.567946447269776,-3.723432011098682,0.682310349194418,0.0,0.0,0.0,1.0
1717775445.3835745,map,True,False,3,2,0.0,0.0,3.330613613128662,-2.74188494682312,0.0,0.0,0.0,0.045865864070047696,0.9989476030639932,4.567946447269776,-3.723432011098682,0.682310349194418,0.0,0.0,0.0,1.0
1717775445.4793298,map,True,False,3,2,0.0,0.0,3.330613613128662,-2.74188494682312,0.0,0.0,0.0,0.045865864070047696,0.9989476030639932,4.567946447269776,-3.723432011098682,0.682310349194418,0.0,0.0,0.0,1.0
1717775445.529241,map,True,False,3,2,0.0,0.0,3.330613613128662,-2.74188494682312,0.0,0.0,0.0,0.045865864070047696,0.9989476030639932,4.681791400453358,-3.747619322981566,0.6823101570951395,0.0,0.0,0.0,1.0
1717775445.9312596,map,True,False,3,2,0.0,0.0,3.330613613128662,-2.74188494682312,0.0,0.0,0.0,0.045865864070047696,0.9989476030639932,4.630722651505525,-3.7086498703409516,0.6823455010401066,0.0,0.0,0.0,1.0
1717775445.98404,map,True,False,3,2,0.0,0.0,3.330613613128662,-2.74188494682312,0.0,0.0,0.0,0.045865864070047696,0.9989476030639932,4.630722651505525,-3.7086498703409516,0.6823455010401066,0.0,0.0,0.0,1.0
1717775446.0330923,map,True,False,3,2,0.0,0.0,3.330613613128662,-2.74188494682312,0.0,0.0,0.0,0.045865864070047696,0.9989476030639932,4.630722651505525,-3.7086498703409516,0.6823455010401066,0.0,0.0,0.0,1.0
1717775446.1317828,map,True,False,2,2,0.49874686716791977,0.49874686716791977,3.581393241882324,-2.8140709400177,0.0,0.0,0.0,0.04560209705146566,0.9989596856472395,4.630722651505525,-3.7086498703409516,0.6823455010401066,0.0,0.0,0.0,1.0
1717775446.1836982,map,True,False,2,2,0.49874686716791977,0.49874686716791977,3.581393241882324,-2.8140709400177,0.0,0.0,0.0,0.04560209705146566,0.9989596856472395,4.630722651505525,-3.7086498703409516,0.6823455010401066,0.0,0.0,0.0,1.0
1717775446.237499,map,True,True,2,2,0.49874686716791977,0.49874686716791977,3.581393241882324,-2.8140709400177,0.0,0.0,0.0,0.04560209705146566,0.9989596856472395,4.695984714120963,-3.722917491921929,0.6823973955197159,0.0,0.0,0.0,1.0
1717775446.2851992,map,True,True,2,2,0.49874686716791977,0.49874686716791977,3.581393241882324,-2.8140709400177,0.0,0.0,0.0,0.04560209705146566,0.9989596856472395,4.690435020333049,-3.729965233856263,0.6854391738152419,0.0,0.0,0.0,1.0
1717775446.3353102,map,True,True,2,2,0.49874686716791977,0.49874686716791977,3.581393241882324,-2.8140709400177,0.0,0.0,0.0,0.04560209705146566,0.9989596856472395,4.690435020333049,-3.729965233856263,0.6854391738152419,0.0,0.0,0.0,1.0
1717775446.3847497,map,True,False,2,2,0.49874686716791977,0.49874686716791977,3.581393241882324,-2.8140709400177,0.0,0.0,0.0,0.04560209705146566,0.9989596856472395,4.690435020333049,-3.729965233856263,0.6854391738152419,0.0,0.0,0.0,1.0
1717775446.4353607,map,True,True,2,2,0.49874686716791977,0.49874686716791977,3.581393241882324,-2.8140709400177,0.0,0.0,0.0,0.04560209705146566,0.9989596856472395,4.690435020333049,-3.729965233856263,0.6854391738152419,0.0,0.0,0.0,1.0
1717775446.4885535,map,True,False,2,2,0.49874686716791977,0.49874686716791977,3.581393241882324,-2.8140709400177,0.0,0.0,0.0,0.04560209705146566,0.9989596856472395,4.690435020333049,-3.729965233856263,0.6854391738152419,0.0,0.0,0.0,1.0
1717775446.584344,map,True,False,2,2,0.49874686716791977,0.49874686716791977,3.581393241882324,-2.8140709400177,0.0,0.0,0.0,0.04560209705146566,0.9989596856472395,4.690435020333049,-3.729965233856263,0.6854391738152419,0.0,0.0,0.0,1.0
1717775446.9366214,map,True,False,2,6,0.0,0.0,3.581393241882324,-2.8140709400177,0.0,0.0,0.0,0.04560209705146566,0.9989596856472395,5.636136706075717,-7.705477331056517,1.1140219577138928,0.0,0.0,0.0,1.0
1717775446.9886549,map,True,False,2,6,0.0,0.0,3.7412283420562744,-2.8339903354644775,0.0,0.0,0.0,0.04589144399779524,0.9989464395482628,5.636136706075717,-7.705477331056517,1.1140219577138928,0.0,0.0,0.0,1.0
1717775447.0398338,map,True,False,2,6,0.0,0.0,3.7412283420562744,-2.8339903354644775,0.0,0.0,0.0,0.04589144399779524,0.9989464395482628,5.636136706075717,-7.705477331056517,1.1140219577138928,0.0,0.0,0.0,1.0
1717775447.0897777,map,True,False,2,6,0.0,0.0,3.7412283420562744,-2.8339903354644775,0.0,0.0,0.0,0.04589144399779524,0.9989464395482628,5.636136706075717,-7.705477331056517,1.1140219577138928,0.0,0.0,0.0,1.0
1717775447.1374834,map,True,False,2,6,0.0,0.0,3.7412283420562744,-2.8339903354644775,0.0,0.0,0.0,0.04589144399779524,0.9989464395482628,5.636136706075717,-7.705477331056517,1.1140219577138928,0.0,0.0,0.0,1.0
1717775447.2469654,map,True,False,2,6,0.0,0.0,3.7412283420562744,-2.8339903354644775,0.0,0.0,0.0,0.04589144399779524,0.9989464395482628,5.636136706075717,-7.705477331056517,1.1140219577138928,0.0,0.0,0.0,1.0
1717775447.3523045,map,True,False,2,6,0.0,0.0,3.7412283420562744,-2.8339903354644775,0.0,0.0,0.0,0.04589144399779524,0.9989464395482628,5.636136706075717,-7.705477331056517,1.1140219577138928,0.0,0.0,0.0,1.0
1717775447.399953,map,True,False,2,6,0.0,0.0,3.7412283420562744,-2.8339903354644775,0.0,0.0,0.0,0.04589144399779524,0.9989464395482628,5.636136706075717,-7.705477331056517,1.1140219577138928,0.0,0.0,0.0,1.0
1717775447.4983678,map,True,False,2,6,0.0,0.0,3.7412283420562744,-2.8339903354644775,0.0,0.0,0.0,0.04589144399779524,0.9989464395482628,5.636136706075717,-7.705477331056517,1.1140219577138928,0.0,0.0,0.0,1.0
1717775447.5945404,map,True,False,2,6,0.0,0.0,3.7412283420562744,-2.8339903354644775,0.0,0.0,0.0,0.04589144399779524,0.9989464395482628,5.636136706075717,-7.705477331056517,1.1140219577138928,0.0,0.0,0.0,1.0
