timestamp_sec,frame_id,game_played,yielding,player1discrete,player2discrete,player1yieldprob,player2yieldprob,player1_pose_x,player1_pose_y,player1_pose_z,player1_pose_orient_x,player1_pose_orient_y,player1_pose_orient_z,player1_pose_orient_w,player2_pose_x,player2_pose_y,player2_pose_z,player2_pose_orient_x,player2_pose_orient_y,player2_pose_orient_z,player2_pose_orient_w
1718031557.6389189,map,True,False,5,6,0.0,0.0,1.3769755363464355,-1.6332107782363892,0.0,0.0,0.0,0.03671056570791109,0.9993259423139321,3.2603953475111327,-7.786847328770072,0.9293336388492136,0.0,0.0,0.0,1.0
1718031557.7379298,map,True,False,5,6,0.0,0.0,1.4635655879974365,-1.6457325220108032,0.0,0.0,0.0,0.03638343683893926,0.9993379010345717,3.256424825194336,-7.759165818106354,0.9372458891606227,0.0,0.0,0.0,1.0
1718031557.7872865,map,True,False,5,6,0.0,0.0,1.4635655879974365,-1.6457325220108032,0.0,0.0,0.0,0.03638343683893926,0.9993379010345717,3.256424825194336,-7.759165818106354,0.9372458891606227,0.0,0.0,0.0,1.0
1718031557.9884543,map,True,False,5,6,0.0,0.0,1.4635655879974365,-1.6457325220108032,0.0,0.0,0.0,0.03638343683893926,0.9993379010345717,3.242089263274802,-7.475887489761506,0.9166082929403168,0.0,0.0,0.0,1.0
1718031558.0384257,map,True,False,5,6,0.0,0.0,1.4635655879974365,-1.6457325220108032,0.0,0.0,0.0,0.03638343683893926,0.9993379010345717,3.242089263274802,-7.475887489761506,0.9166082929403168,0.0,0.0,0.0,1.0
1718031558.1370556,map,True,False,5,6,0.0,0.0,1.4635655879974365,-1.6457325220108032,0.0,0.0,0.0,0.03638343683893926,0.9993379010345717,3.242089263274802,-7.475887489761506,0.9166082929403168,0.0,0.0,0.0,1.0
1718031558.1872544,map,True,False,5,6,0.0,0.0,1.4635655879974365,-1.6457325220108032,0.0,0.0,0.0,0.03638343683893926,0.9993379010345717,3.242089263274802,-7.475887489761506,0.9166082929403168,0.0,0.0,0.0,1.0
1718031558.23908,map,True,False,5,6,0.0,0.0,1.4635655879974365,-1.6457325220108032,0.0,0.0,0.0,0.03638343683893926,0.9993379010345717,3.242089263274802,-7.475887489761506,0.9166082929403168,0.0,0.0,0.0,1.0
1718031558.2879174,map,True,False,5,6,0.0,0.0,1.5837321281433105,-1.6639399528503418,0.0,0.0,0.0,0.03663539035275911,0.9993287008843837,3.302669264075435,-7.423421254548012,0.8119688709363111,0.0,0.0,0.0,1.0
1718031558.338453,map,True,False,5,6,0.0,0.0,1.5837321281433105,-1.6639399528503418,0.0,0.0,0.0,0.03663539035275911,0.9993287008843837,3.3207138091124873,-7.389177539615055,0.7859878828597779,0.0,0.0,0.0,1.0
1718031558.393348,map,True,False,5,6,0.0,0.0,1.5837321281433105,-1.6639399528503418,0.0,0.0,0.0,0.03663539035275911,0.9993287008843837,3.3207138091124873,-7.389177539615055,0.7859878828597779,0.0,0.0,0.0,1.0
1718031558.4450183,map,True,False,5,6,0.0,0.0,1.5837321281433105,-1.6639399528503418,0.0,0.0,0.0,0.03663539035275911,0.9993287008843837,3.3207138091124873,-7.389177539615055,0.7859878828597779,0.0,0.0,0.0,1.0
1718031558.4938817,map,True,False,5,6,0.0,0.0,1.5837321281433105,-1.6639399528503418,0.0,0.0,0.0,0.03663539035275911,0.9993287008843837,3.3207138091124873,-7.389177539615055,0.7859878828597779,0.0,0.0,0.0,1.0
1718031558.5938296,map,True,False,5,6,0.0,0.0,1.5837321281433105,-1.6639399528503418,0.0,0.0,0.0,0.03663539035275911,0.9993287008843837,3.3207138091124873,-7.389177539615055,0.7859878828597779,0.0,0.0,0.0,1.0
1718031558.6445963,map,True,False,5,6,0.0,0.0,1.5837321281433105,-1.6639399528503418,0.0,0.0,0.0,0.03663539035275911,0.9993287008843837,3.3792928946630156,-7.142068646957101,0.7978365072966435,0.0,0.0,0.0,1.0
1718031558.6944873,map,True,False,5,6,0.0,0.0,1.5837321281433105,-1.6639399528503418,0.0,0.0,0.0,0.03663539035275911,0.9993287008843837,3.3793002884058323,-7.142026567684221,0.8059722967252426,0.0,0.0,0.0,1.0
1718031558.7452946,map,True,False,5,6,0.0,0.0,1.5837321281433105,-1.6639399528503418,0.0,0.0,0.0,0.03663539035275911,0.9993287008843837,3.3793002884058323,-7.142026567684221,0.8059722967252426,0.0,0.0,0.0,1.0
1718031558.8449576,map,True,False,4,6,0.0,0.0,1.6795542240142822,-1.686131238937378,0.0,0.0,0.0,0.03661224689864747,0.9993295508207721,3.3793002884058323,-7.142026567684221,0.8059722967252426,0.0,0.0,0.0,1.0
1718031558.9962854,map,True,False,4,5,0.0,0.0,1.6795542240142822,-1.686131238937378,0.0,0.0,0.0,0.03661224689864747,0.9993295508207721,3.409611359846611,-6.708608322188997,0.7661006351610359,0.0,0.0,0.0,1.0
1718031559.0476062,map,True,False,4,5,0.0,0.0,1.6795542240142822,-1.686131238937378,0.0,0.0,0.0,0.03661224689864747,0.9993295508207721,3.3745527461792166,-6.4902436771882215,0.7695949364097409,0.0,0.0,0.0,1.0
1718031559.1469948,map,True,False,4,5,0.0,0.0,1.6795542240142822,-1.686131238937378,0.0,0.0,0.0,0.03661224689864747,0.9993295508207721,3.3745527461792166,-6.4902436771882215,0.7695949364097409,0.0,0.0,0.0,1.0
1718031559.1962578,map,True,False,4,5,0.0,0.0,1.6795542240142822,-1.686131238937378,0.0,0.0,0.0,0.03661224689864747,0.9993295508207721,3.3745527461792166,-6.4902436771882215,0.7695949364097409,0.0,0.0,0.0,1.0
1718031559.296925,map,True,False,4,5,0.0,0.0,1.7663943767547607,-1.700221300125122,0.0,0.0,0.0,0.03663975042850065,0.9993285368614887,3.3745527461792166,-6.4902436771882215,0.7695949364097409,0.0,0.0,0.0,1.0
1718031559.3968618,map,True,False,4,5,0.0,0.0,1.7663943767547607,-1.700221300125122,0.0,0.0,0.0,0.03663975042850065,0.9993285368614887,3.4567662754120088,-6.609520332327628,0.7867201919027215,0.0,0.0,0.0,1.0
1718031559.4975088,map,True,False,4,5,0.0,0.0,1.7663943767547607,-1.700221300125122,0.0,0.0,0.0,0.03663975042850065,0.9993285368614887,3.4567662754120088,-6.609520332327628,0.7867201919027215,0.0,0.0,0.0,1.0
1718031559.5510836,map,True,False,4,5,0.0,0.0,1.7663943767547607,-1.700221300125122,0.0,0.0,0.0,0.03663975042850065,0.9993285368614887,3.4567662754120088,-6.609520332327628,0.7867201919027215,0.0,0.0,0.0,1.0
1718031559.600533,map,True,False,4,5,0.0,0.0,1.7663943767547607,-1.700221300125122,0.0,0.0,0.0,0.03663975042850065,0.9993285368614887,3.4567662754120088,-6.609520332327628,0.7867201919027215,0.0,0.0,0.0,1.0
1718031559.6506164,map,True,False,4,5,0.0,0.0,1.7663943767547607,-1.700221300125122,0.0,0.0,0.0,0.03663975042850065,0.9993285368614887,3.4923547664389405,-6.399996774488492,0.7822237965337017,0.0,0.0,0.0,1.0
1718031559.699907,map,True,False,4,5,0.0,0.0,1.7663943767547607,-1.700221300125122,0.0,0.0,0.0,0.03663975042850065,0.9993285368614887,3.4460990457464007,-6.053522467191922,0.7814883495895927,0.0,0.0,0.0,1.0
1718031559.7494912,map,True,False,4,5,0.0,0.0,1.7663943767547607,-1.700221300125122,0.0,0.0,0.0,0.03663975042850065,0.9993285368614887,3.4460990457464007,-6.053522467191922,0.7814883495895927,0.0,0.0,0.0,1.0
1718031559.7997382,map,True,False,4,5,0.0,0.0,1.7663943767547607,-1.700221300125122,0.0,0.0,0.0,0.03663975042850065,0.9993285368614887,3.4460990457464007,-6.053522467191922,0.7814883495895927,0.0,0.0,0.0,1.0
1718031559.8506289,map,True,False,4,5,0.0,0.0,1.7663943767547607,-1.700221300125122,0.0,0.0,0.0,0.03663975042850065,0.9993285368614887,3.4460990457464007,-6.053522467191922,0.7814883495895927,0.0,0.0,0.0,1.0
1718031560.0010622,map,True,True,4,4,0.5922520728754596,0.5922520728754596,1.8486473560333252,-1.7129582166671753,0.0,0.0,0.0,0.036542929151337084,0.9993320857144796,3.5357329026164734,-5.884016929267334,0.7523174911822894,0.0,0.0,0.0,1.0
1718031560.1033535,map,True,False,4,4,0.5922520728754596,0.5922520728754596,1.8486473560333252,-1.7129582166671753,0.0,0.0,0.0,0.036542929151337084,0.9993320857144796,3.53024859326446,-5.8221602714043055,0.7513015261899156,0.0,0.0,0.0,1.0
1718031560.1515055,map,True,False,4,4,0.5922520728754596,0.5922520728754596,1.8486473560333252,-1.7129582166671753,0.0,0.0,0.0,0.036542929151337084,0.9993320857144796,3.53024859326446,-5.8221602714043055,0.7513015261899156,0.0,0.0,0.0,1.0
1718031560.2507894,map,True,True,4,4,0.5922520728754596,0.5922520728754596,1.8486473560333252,-1.7129582166671753,0.0,0.0,0.0,0.036542929151337084,0.9993320857144796,3.53024859326446,-5.8221602714043055,0.7513015261899156,0.0,0.0,0.0,1.0
1718031560.351056,map,True,False,4,4,0.5922520728754596,0.5922520728754596,1.8486473560333252,-1.7129582166671753,0.0,0.0,0.0,0.036542929151337084,0.9993320857144796,3.592575653462588,-5.797202570860021,0.7756811234133391,0.0,0.0,0.0,1.0
1718031560.4030619,map,True,True,4,4,0.5922520728754596,0.5922520728754596,1.8486473560333252,-1.7129582166671753,0.0,0.0,0.0,0.036542929151337084,0.9993320857144796,3.592575653462588,-5.797202570860021,0.7756811234133391,0.0,0.0,0.0,1.0
1718031560.4546897,map,True,True,4,4,0.5922520728754596,0.5922520728754596,1.8486473560333252,-1.7129582166671753,0.0,0.0,0.0,0.036542929151337084,0.9993320857144796,3.592575653462588,-5.797202570860021,0.7756811234133391,0.0,0.0,0.0,1.0
1718031560.5020602,map,True,False,4,4,0.5922520728754596,0.5922520728754596,1.8486473560333252,-1.7129582166671753,0.0,0.0,0.0,0.036542929151337084,0.9993320857144796,3.592575653462588,-5.797202570860021,0.7756811234133391,0.0,0.0,0.0,1.0
1718031560.5524585,map,True,False,4,4,0.5922520728754596,0.5922520728754596,1.8486473560333252,-1.7129582166671753,0.0,0.0,0.0,0.036542929151337084,0.9993320857144796,3.592575653462588,-5.797202570860021,0.7756811234133391,0.0,0.0,0.0,1.0
1718031560.653234,map,True,True,4,4,0.5922520728754596,0.5922520728754596,1.969905138015747,-1.734315037727356,0.0,0.0,0.0,0.036638626722619014,0.9993285815950083,3.545656164684072,-5.402469713537475,0.7611755751491635,0.0,0.0,0.0,1.0
1718031560.7524412,map,True,True,4,4,0.5922520728754596,0.5922520728754596,1.969905138015747,-1.734315037727356,0.0,0.0,0.0,0.036638626722619014,0.9993285815950083,3.5297820389378587,-5.237479000761133,0.7307628152266966,0.0,0.0,0.0,1.0
1718031560.8584583,map,True,True,4,4,0.5922520728754596,0.5922520728754596,1.969905138015747,-1.734315037727356,0.0,0.0,0.0,0.036638626722619014,0.9993285815950083,3.5297820389378587,-5.237479000761133,0.7307628152266966,0.0,0.0,0.0,1.0
1718031561.005284,map,True,False,4,4,0.5922520728754596,0.5922520728754596,1.969905138015747,-1.734315037727356,0.0,0.0,0.0,0.036638626722619014,0.9993285815950083,3.57706508395591,-4.9742106922315585,0.7220044615288375,0.0,0.0,0.0,1.0
1718031561.103299,map,True,False,4,4,0.5922520728754596,0.5922520728754596,1.969905138015747,-1.734315037727356,0.0,0.0,0.0,0.036638626722619014,0.9993285815950083,3.578480956960443,-4.958675230957697,0.7168194199575812,0.0,0.0,0.0,1.0
1718031561.153265,map,True,False,3,4,0.0,0.0,2.063244581222534,-1.748439073562622,0.0,0.0,0.0,0.03623215502992303,0.9993434031908873,3.578480956960443,-4.958675230957697,0.7168194199575812,0.0,0.0,0.0,1.0
1718031561.2032251,map,True,False,3,4,0.0,0.0,2.063244581222534,-1.748439073562622,0.0,0.0,0.0,0.03623215502992303,0.9993434031908873,3.578480956960443,-4.958675230957697,0.7168194199575812,0.0,0.0,0.0,1.0
1718031561.2536356,map,True,False,3,4,0.0,0.0,2.063244581222534,-1.748439073562622,0.0,0.0,0.0,0.03623215502992303,0.9993434031908873,3.578480956960443,-4.958675230957697,0.7168194199575812,0.0,0.0,0.0,1.0
1718031561.3044527,map,True,False,3,4,0.0,0.0,2.063244581222534,-1.748439073562622,0.0,0.0,0.0,0.03623215502992303,0.9993434031908873,3.578480956960443,-4.958675230957697,0.7168194199575812,0.0,0.0,0.0,1.0
1718031561.3543699,map,True,True,3,3,0.6616527499769684,0.6616527499769684,2.063244581222534,-1.748439073562622,0.0,0.0,0.0,0.03623215502992303,0.9993434031908873,3.609267295331328,-4.632382655658224,0.7223416580153914,0.0,0.0,0.0,1.0
1718031561.4053106,map,True,True,3,3,0.6616527499769684,0.6616527499769684,2.063244581222534,-1.748439073562622,0.0,0.0,0.0,0.03623215502992303,0.9993434031908873,3.609267295331328,-4.632382655658224,0.7223416580153914,0.0,0.0,0.0,1.0
1718031561.4555051,map,True,True,3,3,0.6616527499769684,0.6616527499769684,2.063244581222534,-1.748439073562622,0.0,0.0,0.0,0.03623215502992303,0.9993434031908873,3.609267295331328,-4.632382655658224,0.7223416580153914,0.0,0.0,0.0,1.0
1718031561.5059478,map,True,True,3,3,0.6616527499769684,0.6616527499769684,2.063244581222534,-1.748439073562622,0.0,0.0,0.0,0.03623215502992303,0.9993434031908873,3.609267295331328,-4.632382655658224,0.7223416580153914,0.0,0.0,0.0,1.0
1718031561.6056385,map,True,False,3,3,0.6616527499769684,0.6616527499769684,2.063244581222534,-1.748439073562622,0.0,0.0,0.0,0.03623215502992303,0.9993434031908873,3.609267295331328,-4.632382655658224,0.7223416580153914,0.0,0.0,0.0,1.0
1718031561.6558158,map,True,True,3,3,0.6616527499769684,0.6616527499769684,2.1111886501312256,-1.761384129524231,0.0,0.0,0.0,0.03634913318044331,0.9993391535606237,3.6955490591481652,-4.474753549502504,0.6985602756238504,0.0,0.0,0.0,1.0
1718031561.7063386,map,True,False,3,3,0.6616527499769684,0.6616527499769684,2.1111886501312256,-1.761384129524231,0.0,0.0,0.0,0.03634913318044331,0.9993391535606237,3.7095170227234515,-4.326544199249018,0.7017805793157063,0.0,0.0,0.0,1.0
1718031561.8057647,map,True,True,3,3,0.6616527499769684,0.6616527499769684,2.1111886501312256,-1.761384129524231,0.0,0.0,0.0,0.03634913318044331,0.9993391535606237,3.7095170227234515,-4.326544199249018,0.7017805793157063,0.0,0.0,0.0,1.0
1718031561.856284,map,True,True,3,3,0.6616527499769684,0.6616527499769684,2.1111886501312256,-1.761384129524231,0.0,0.0,0.0,0.03634913318044331,0.9993391535606237,3.7095170227234515,-4.326544199249018,0.7017805793157063,0.0,0.0,0.0,1.0
1718031562.0559,map,True,False,3,3,0.6616527499769684,0.6616527499769684,2.1111886501312256,-1.761384129524231,0.0,0.0,0.0,0.03634913318044331,0.9993391535606237,3.7619798107962223,-4.046547162883162,0.6842477443649154,0.0,0.0,0.0,1.0
1718031562.1067345,map,True,True,3,3,0.6616527499769684,0.6616527499769684,2.1111886501312256,-1.761384129524231,0.0,0.0,0.0,0.03634913318044331,0.9993391535606237,3.7619798107962223,-4.046547162883162,0.6842477443649154,0.0,0.0,0.0,1.0
1718031562.1571124,map,True,True,3,3,0.6616527499769684,0.6616527499769684,2.1591861248016357,-1.7348471879959106,0.0,0.0,0.0,0.035106368159312756,0.9993835873977415,3.7619798107962223,-4.046547162883162,0.6842477443649154,0.0,0.0,0.0,1.0
1718031562.257741,map,True,True,3,3,0.6616527499769684,0.6616527499769684,2.1591861248016357,-1.7348471879959106,0.0,0.0,0.0,0.035106368159312756,0.9993835873977415,3.7619798107962223,-4.046547162883162,0.6842477443649154,0.0,0.0,0.0,1.0
1718031562.3562672,map,True,False,3,2,0.0,0.0,2.1591861248016357,-1.7348471879959106,0.0,0.0,0.0,0.035106368159312756,0.9993835873977415,3.752925996225663,-3.7547200531760403,0.6869862343818006,0.0,0.0,0.0,1.0
1718031562.4068565,map,True,False,3,2,0.0,0.0,2.1591861248016357,-1.7348471879959106,0.0,0.0,0.0,0.035106368159312756,0.9993835873977415,3.752925996225663,-3.7547200531760403,0.6869862343818006,0.0,0.0,0.0,1.0
1718031562.4584017,map,True,False,3,2,0.0,0.0,2.1591861248016357,-1.7348471879959106,0.0,0.0,0.0,0.035106368159312756,0.9993835873977415,3.752925996225663,-3.7547200531760403,0.6869862343818006,0.0,0.0,0.0,1.0
1718031562.5560524,map,True,False,3,2,0.0,0.0,2.202561140060425,-1.740257978439331,0.0,0.0,0.0,0.0348549971117431,0.9993923844667759,3.752925996225663,-3.7547200531760403,0.6869862343818006,0.0,0.0,0.0,1.0
1718031562.6064043,map,True,False,3,2,0.0,0.0,2.202561140060425,-1.740257978439331,0.0,0.0,0.0,0.0348549971117431,0.9993923844667759,3.752925996225663,-3.7547200531760403,0.6869862343818006,0.0,0.0,0.0,1.0
1718031562.6582713,map,True,False,3,2,0.0,0.0,2.202561140060425,-1.740257978439331,0.0,0.0,0.0,0.0348549971117431,0.9993923844667759,3.756192970289769,-3.5083182481282886,0.6800084875499801,0.0,0.0,0.0,1.0
1718031562.7718968,map,True,False,3,2,0.0,0.0,2.202561140060425,-1.740257978439331,0.0,0.0,0.0,0.0348549971117431,0.9993923844667759,3.811847598237078,-3.4021291277967842,0.682664498028603,0.0,0.0,0.0,1.0
1718031562.8185644,map,True,False,3,2,0.0,0.0,2.202561140060425,-1.740257978439331,0.0,0.0,0.0,0.0348549971117431,0.9993923844667759,3.811847598237078,-3.4021291277967842,0.682664498028603,0.0,0.0,0.0,1.0
1718031562.8712091,map,True,False,3,2,0.0,0.0,2.202561140060425,-1.740257978439331,0.0,0.0,0.0,0.0348549971117431,0.9993923844667759,3.811847598237078,-3.4021291277967842,0.682664498028603,0.0,0.0,0.0,1.0
1718031563.0197408,map,True,False,3,2,0.0,0.0,2.202561140060425,-1.740257978439331,0.0,0.0,0.0,0.0348549971117431,0.9993923844667759,3.8489592782309314,-3.060851256601325,0.6842891738415845,0.0,0.0,0.0,1.0
1718031563.119398,map,True,False,3,2,0.0,0.0,2.2419354915618896,-1.750481367111206,0.0,0.0,0.0,0.035046910750699184,0.9993856748448586,3.8489592782309314,-3.060851256601325,0.6842891738415845,0.0,0.0,0.0,1.0
1718031563.17009,map,True,False,3,2,0.0,0.0,2.2419354915618896,-1.750481367111206,0.0,0.0,0.0,0.035046910750699184,0.9993856748448586,3.8489592782309314,-3.060851256601325,0.6842891738415845,0.0,0.0,0.0,1.0
1718031563.2743394,map,True,False,3,2,0.0,0.0,2.2419354915618896,-1.750481367111206,0.0,0.0,0.0,0.035046910750699184,0.9993856748448586,3.8489592782309314,-3.060851256601325,0.6842891738415845,0.0,0.0,0.0,1.0
1718031563.3741462,map,True,False,3,2,0.0,0.0,2.2419354915618896,-1.750481367111206,0.0,0.0,0.0,0.035046910750699184,0.9993856748448586,3.8890063893483773,-2.7635701044055065,0.6811244602551642,0.0,0.0,0.0,1.0
1718031563.4733934,map,True,False,3,2,0.0,0.0,2.2419354915618896,-1.750481367111206,0.0,0.0,0.0,0.035046910750699184,0.9993856748448586,3.8890063893483773,-2.7635701044055065,0.6811244602551642,0.0,0.0,0.0,1.0
1718031563.523506,map,True,False,3,2,0.0,0.0,2.3169925212860107,-1.7458393573760986,0.0,0.0,0.0,0.034036210760307065,0.999420594206536,3.8890063893483773,-2.7635701044055065,0.6811244602551642,0.0,0.0,0.0,1.0
1718031563.574309,map,True,False,3,2,0.0,0.0,2.3169925212860107,-1.7458393573760986,0.0,0.0,0.0,0.034036210760307065,0.999420594206536,3.8890063893483773,-2.7635701044055065,0.6811244602551642,0.0,0.0,0.0,1.0
1718031563.6760793,map,True,False,3,1,0.0,0.0,2.3169925212860107,-1.7458393573760986,0.0,0.0,0.0,0.034036210760307065,0.999420594206536,3.8388320598922814,-2.401612406443639,0.6819543194603063,0.0,0.0,0.0,1.0
1718031563.7264457,map,True,False,3,1,0.0,0.0,2.3169925212860107,-1.7458393573760986,0.0,0.0,0.0,0.034036210760307065,0.999420594206536,3.8679388531228853,-2.3556360794125766,0.6802599043700933,0.0,0.0,0.0,1.0
1718031563.7756534,map,True,False,3,1,0.0,0.0,2.3169925212860107,-1.7458393573760986,0.0,0.0,0.0,0.034036210760307065,0.999420594206536,3.8679388531228853,-2.3556360794125766,0.6802599043700933,0.0,0.0,0.0,1.0
1718031564.032192,map,True,False,2,1,0.0,0.0,2.408522367477417,-1.767939805984497,0.0,0.0,0.0,0.03426897176385335,0.9994126472515309,3.8898805920557704,-2.1892849243994252,0.6799236073924159,0.0,0.0,0.0,1.0
1718031564.1368828,map,True,False,2,1,0.0,0.0,2.408522367477417,-1.767939805984497,0.0,0.0,0.0,0.03426897176385335,0.9994126472515309,3.8470460820384655,-2.2227602919347405,0.6801253781441122,0.0,0.0,0.0,1.0
1718031564.2348692,map,True,False,2,1,0.0,0.0,2.408522367477417,-1.767939805984497,0.0,0.0,0.0,0.03426897176385335,0.9994126472515309,3.8470460820384655,-2.2227602919347405,0.6801253781441122,0.0,0.0,0.0,1.0
1718031564.2843416,map,True,False,2,1,0.0,0.0,2.408522367477417,-1.767939805984497,0.0,0.0,0.0,0.03426897176385335,0.9994126472515309,3.8470460820384655,-2.2227602919347405,0.6801253781441122,0.0,0.0,0.0,1.0
1718031564.384847,map,True,False,2,1,0.0,0.0,2.408522367477417,-1.767939805984497,0.0,0.0,0.0,0.03426897176385335,0.9994126472515309,3.8953988203691443,-2.1002772177020006,0.6807635851845596,0.0,0.0,0.0,1.0
1718031564.4343174,map,True,False,2,1,0.0,0.0,2.408522367477417,-1.767939805984497,0.0,0.0,0.0,0.03426897176385335,0.9994126472515309,3.8953988203691443,-2.1002772177020006,0.6807635851845596,0.0,0.0,0.0,1.0
1718031564.4845622,map,True,False,2,1,0.0,0.0,2.463608980178833,-1.8065460920333862,0.0,0.0,0.0,0.0349209735873756,0.999390073379868,3.8953988203691443,-2.1002772177020006,0.6807635851845596,0.0,0.0,0.0,1.0
1718031564.5349538,map,True,False,2,1,0.0,0.0,2.463608980178833,-1.8065460920333862,0.0,0.0,0.0,0.0349209735873756,0.999390073379868,3.8953988203691443,-2.1002772177020006,0.6807635851845596,0.0,0.0,0.0,1.0
1718031564.6351697,map,True,False,2,1,0.0,0.0,2.463608980178833,-1.8065460920333862,0.0,0.0,0.0,0.0349209735873756,0.999390073379868,3.8953988203691443,-2.1002772177020006,0.6807635851845596,0.0,0.0,0.0,1.0
1718031564.6856291,map,True,False,2,1,0.0,0.0,2.463608980178833,-1.8065460920333862,0.0,0.0,0.0,0.0349209735873756,0.999390073379868,3.8953988203691443,-2.1002772177020006,0.6807635851845596,0.0,0.0,0.0,1.0
1718031564.7359836,map,True,False,2,1,0.0,0.0,2.463608980178833,-1.8065460920333862,0.0,0.0,0.0,0.0349209735873756,0.999390073379868,3.8953988203691443,-2.1002772177020006,0.6807635851845596,0.0,0.0,0.0,1.0
1718031564.785768,map,True,False,2,1,0.0,0.0,2.463608980178833,-1.8065460920333862,0.0,0.0,0.0,0.0349209735873756,0.999390073379868,3.8953988203691443,-2.1002772177020006,0.6807635851845596,0.0,0.0,0.0,1.0
1718031564.8366973,map,True,False,2,1,0.0,0.0,2.463608980178833,-1.8065460920333862,0.0,0.0,0.0,0.0349209735873756,0.999390073379868,3.8953988203691443,-2.1002772177020006,0.6807635851845596,0.0,0.0,0.0,1.0
