car_pos_meter , car_pos_cell, car_speed, ped_pos_meter, ped_pos_cell, ped_speed
-5.125, 5, 2, 3.11662, 4, 1
-4.604377, 4, 2, 3.15596, 4, 1
-4.083755, 4, 2, 3.203303, 4, 1
-3.563132, 3, 2, 3.293734, 4, 1
-3.042509, 3, 2, 3.31787, 4, 1
-2.521886, 2, 2, 3.289566, 4, 1
-2.001264, 2, 2, 3.241559, 4, 1
-1.480638, 1, 2, 3.267392, 4, 1
-0.9600121, 0, 2, 3.266797, 4, 1
-0.4393865, 0, 2, 3.287905, 4, 1
0.08123851, 0, 2, 3.287578, 4, 1
0.6018636, 0, 2, 3.268067, 4, 1
1.122489, -1, 2, 3.282082, 4, 1
