car_pos_meter , car_pos_cell, car_speed, ped_pos_meter, ped_pos_cell, ped_speed
-15.76923, 15, 2, 3.95463, 15, 1
-15.70515, 15, 2, 3.955855, 15, 1
-15.64108, 15, 2, 3.955855, 15, 1
-15.577, 15, 2, 3.955855, 15, 1
-15.51293, 15, 2, 3.955855, 15, 1
-15.44885, 15, 2, 3.955855, 15, 1
-15.38477, 15, 2, 3.94907, 15, 1
-15.32069, 15, 2, 3.94907, 15, 1
-15.25662, 15, 2, 3.94907, 15, 1
-15.19254, 15, 2, 3.94907, 15, 1
-15.12846, 15, 2, 3.94907, 15, 1
-15.06439, 15, 1, 3.949649, 15, 1
-15.03246, 15, 2, 3.947743, 15, 1
-14.96839, 14, 2, 3.94708, 15, 1
-14.90431, 14, 2, 3.94608, 15, 1
-14.84023, 14, 2, 3.945845, 15, 1
-14.77616, 14, 2, 3.945285, 15, 1
-14.71208, 14, 2, 3.944968, 15, 1
-14.64801, 14, 2, 3.944572, 15, 1
-14.58393, 14, 2, 3.943476, 15, 1
-14.51985, 14, 2, 3.942784, 15, 1
-14.45578, 14, 2, 3.942552, 15, 1
-14.3917, 14, 2, 3.94223, 15, 1
-14.32762, 14, 2, 3.942273, 15, 1
-14.26355, 14, 2, 3.942161, 15, 1
-14.19947, 14, 2, 3.942525, 15, 1
-14.13539, 14, 2, 3.942487, 15, 1
-14.07132, 14, 2, 3.943157, 15, 1
-14.00724, 14, 2, 3.943731, 15, 1
-13.94316, 13, 2, 3.944757, 15, 1
-13.87909, 13, 2, 3.945309, 15, 1
-13.81501, 13, 2, 3.946407, 15, 1
-13.75093, 13, 2, 3.947509, 15, 1
-13.68686, 13, 2, 3.946847, 15, 1
-13.62278, 13, 2, 3.946395, 15, 1
-13.5587, 13, 2, 3.945687, 15, 1
-13.49463, 13, 2, 3.9437, 15, 1
-13.43055, 13, 2, 3.942757, 15, 1
-13.36647, 13, 2, 3.940146, 15, 1
-13.3024, 13, 2, 3.936598, 15, 1
-13.23832, 13, 2, 3.932579, 15, 1
-13.17424, 13, 2, 3.928016, 15, 1
-13.11017, 13, 2, 3.925761, 15, 1
-13.04609, 13, 2, 3.920896, 15, 1
-12.98201, 12, 2, 3.915112, 15, 1
-12.91794, 12, 2, 3.909774, 15, 1
-12.85386, 12, 2, 3.906048, 15, 1
-12.78978, 12, 2, 3.900415, 15, 1
-12.72571, 12, 2, 3.893219, 15, 1
-12.66163, 12, 2, 3.886189, 15, 1
-12.59755, 12, 2, 3.882715, 15, 1
-12.53348, 12, 2, 3.874351, 15, 1
-12.4694, 12, 2, 3.865334, 15, 1
-12.40532, 12, 2, 3.856739, 15, 1
-12.34125, 12, 2, 3.851594, 15, 1
-12.27717, 12, 2, 3.842364, 15, 1
-12.21309, 12, 2, 3.832542, 15, 1
-12.14902, 12, 2, 3.822226, 15, 1
-12.08494, 12, 2, 3.816935, 15, 1
-12.02086, 12, 2, 3.805361, 15, 1
-11.95679, 11, 2, 3.793626, 15, 1
-11.89271, 11, 2, 3.780393, 15, 1
-11.82863, 11, 2, 3.766521, 15, 1
-11.76456, 11, 2, 3.759443, 15, 1
-11.70048, 11, 2, 3.744377, 14, 1
-11.6364, 11, 2, 3.72932, 14, 1
-11.57233, 11, 2, 3.720226, 14, 1
-11.50825, 11, 2, 3.703978, 14, 1
-11.44417, 11, 2, 3.685911, 14, 1
-11.3801, 11, 2, 3.667433, 14, 1
-11.31602, 11, 2, 3.648535, 14, 1
-11.25194, 11, 2, 3.63849, 14, 1
-11.18787, 11, 2, 3.618385, 14, 1
-11.12379, 11, 2, 3.597341, 14, 1
-11.05971, 11, 2, 3.575391, 14, 1
-10.99564, 10, 2, 3.552603, 14, 1
-10.93156, 10, 2, 3.529089, 14, 1
-10.86748, 10, 2, 3.516806, 14, 1
-10.80341, 10, 2, 3.492417, 13, 1
-10.73933, 10, 2, 3.467413, 13, 1
-10.67525, 10, 2, 3.442528, 13, 1
-10.61118, 10, 2, 3.430588, 13, 1
-10.5471, 10, 2, 3.406487, 13, 1
-10.48302, 10, 2, 3.383169, 13, 1
-10.41895, 10, 2, 3.360733, 13, 1
-10.35487, 10, 2, 3.349596, 13, 1
-10.29079, 10, 2, 3.328101, 13, 1
-10.22672, 10, 2, 3.306503, 13, 1
-10.16264, 10, 2, 3.28527, 13, 1
-10.09856, 10, 2, 3.264385, 13, 1
-10.03449, 10, 2, 3.253951, 13, 1
-9.97041, 9, 2, 3.233491, 12, 1
-9.906333, 9, 2, 3.213231, 12, 1
-9.842257, 9, 2, 3.192853, 12, 1
-9.77818, 9, 2, 3.172271, 12, 1
-9.714104, 9, 2, 3.162163, 12, 1
-9.650027, 9, 2, 3.141059, 12, 1
-9.58595, 9, 2, 3.119875, 12, 1
-9.521873, 9, 2, 3.098958, 12, 1
-9.457797, 9, 2, 3.077365, 12, 1
-9.393721, 9, 2, 3.055047, 12, 1
-9.329643, 9, 2, 3.043987, 12, 1
-9.265567, 9, 2, 3.020931, 12, 1
-9.20149, 9, 2, 2.997715, 11, 1
-9.137414, 9, 2, 2.973857, 11, 1
-9.073337, 9, 2, 2.961804, 11, 1
-9.00926, 9, 2, 2.93709, 11, 1
-8.945184, 8, 2, 2.911819, 11, 1
-8.881107, 8, 2, 2.886364, 11, 1
-8.81703, 8, 2, 2.860501, 11, 1
-8.752954, 8, 2, 2.847546, 11, 1
-8.688877, 8, 2, 2.821379, 11, 1
-8.624801, 8, 2, 2.794576, 11, 1
-8.560724, 8, 2, 2.768345, 11, 1
-8.496647, 8, 2, 2.74236, 10, 1
-8.43257, 8, 2, 2.729746, 10, 1
-8.368494, 8, 2, 2.704595, 10, 1
-8.304418, 8, 2, 2.679735, 10, 1
-8.24034, 8, 2, 2.654886, 10, 1
-8.176264, 8, 2, 2.630263, 10, 1
-8.112187, 8, 2, 2.618097, 10, 1
-8.048111, 8, 2, 2.59391, 10, 1
-7.984034, 7, 2, 2.570493, 10, 1
-7.919957, 7, 2, 2.547369, 10, 1
-7.855881, 7, 2, 2.523307, 10, 1
-7.791804, 7, 2, 2.511649, 10, 1
-7.727727, 7, 2, 2.487556, 9, 1
-7.663651, 7, 2, 2.463422, 9, 1
-7.599574, 7, 2, 2.439623, 9, 1
-7.535498, 7, 2, 2.414841, 9, 1
-7.471421, 7, 2, 2.402858, 9, 1
-7.407344, 7, 2, 2.37814, 9, 1
-7.343267, 7, 2, 2.353063, 9, 1
-7.279191, 7, 2, 2.327762, 9, 1
-7.215114, 7, 2, 2.30213, 9, 1
-7.151038, 7, 2, 2.275331, 9, 1
-7.086961, 7, 2, 2.261967, 9, 1
-7.022884, 7, 2, 2.233943, 8, 1
-6.958807, 6, 2, 2.206004, 8, 1
-6.894731, 6, 2, 2.1773, 8, 1
-6.830655, 6, 2, 2.147367, 8, 1
-6.766578, 6, 2, 2.132603, 8, 1
-6.702501, 6, 2, 2.101765, 8, 1
-6.638424, 6, 2, 2.071384, 8, 1
-6.574348, 6, 2, 2.042119, 8, 1
-6.510271, 6, 2, 2.013482, 8, 1
-6.446195, 6, 2, 1.999631, 7, 1
-6.382118, 6, 2, 1.971362, 7, 1
-6.318041, 6, 2, 1.944025, 7, 1
-6.253964, 6, 2, 1.916548, 7, 1
-6.189888, 6, 2, 1.889295, 7, 1
-6.125811, 6, 2, 1.876374, 7, 1
-6.061734, 6, 2, 1.849919, 7, 1
-5.997657, 5, 2, 1.823934, 7, 1
-5.93358, 5, 2, 1.797831, 7, 1
-5.869503, 5, 2, 1.770709, 7, 1
-5.805426, 5, 2, 1.757802, 7, 1
-5.741349, 5, 2, 1.731561, 6, 1
-5.677272, 5, 2, 1.704854, 6, 1
-5.613195, 5, 2, 1.677857, 6, 1
-5.549118, 5, 2, 1.650305, 6, 1
-5.485041, 5, 2, 1.636944, 6, 1
-5.420964, 5, 2, 1.609404, 6, 1
-5.356887, 5, 2, 1.58173, 6, 1
-5.29281, 5, 2, 1.55297, 6, 1
-5.228733, 5, 2, 1.524674, 6, 1
-5.164656, 5, 1, 1.496257, 5, 1
-5.132732, 5, 2, 1.480805, 5, 1
-5.068655, 5, 1, 1.451473, 5, 1
-5.036732, 5, 2, 1.420363, 5, 1
-4.972655, 4, 2, 1.389786, 5, 1
-4.908578, 4, 2, 1.35891, 5, 1
-4.844501, 4, 2, 1.342944, 5, 1
-4.780425, 4, 2, 1.311226, 5, 1
-4.716347, 4, 2, 1.280525, 5, 1
-4.65227, 4, 2, 1.251506, 5, 1
-4.588193, 4, 1, 1.222427, 4, 1
-4.55627, 4, 1, 1.207836, 4, 1
-4.524347, 4, 1, 1.17827, 4, 1
-4.492424, 4, 1, 1.147981, 4, 1
-4.460501, 4, 1, 1.118869, 4, 1
-4.428577, 4, 1, 1.088953, 4, 1
-4.396655, 4, 2, 1.073825, 4, 1
-4.332577, 4, 2, 1.044008, 4, 1
-4.2685, 4, 1, 1.014459, 4, 1
-4.236577, 4, 2, 0.9856765, 3, 1
-4.1725, 4, 2, 0.971235, 3, 1
-4.108423, 4, 2, 0.941483, 3, 1
-4.044346, 4, 2, 0.9120708, 3, 1
-3.980269, 3, 1, 0.882575, 3, 1
-3.948346, 3, 1, 0.8532052, 3, 1
-3.916423, 3, 1, 0.8231874, 3, 1
-3.8845, 3, 1, 0.8084819, 3, 1
-3.852577, 3, 2, 0.7786622, 3, 1
-3.7885, 3, 1, 0.7500358, 3, 1
-3.756577, 3, 2, 0.7232647, 2, 1
-3.692499, 3, 2, 0.697674, 2, 1
-3.628422, 3, 2, 0.6852081, 2, 1
-3.564345, 3, 2, 0.6605167, 2, 1
-3.500268, 3, 2, 0.6355834, 2, 1
-3.436191, 3, 2, 0.6101048, 2, 1
-3.372114, 3, 2, 0.5852747, 2, 1
-3.308037, 3, 2, 0.5732651, 2, 1
-3.24396, 3, 2, 0.5491691, 2, 1
-3.179883, 3, 2, 0.5253437, 2, 1
-3.115806, 3, 2, 0.5016794, 2, 1
-3.051729, 3, 2, 0.4785724, 1, 1
-2.987652, 2, 2, 0.4669421, 1, 1
-2.923575, 2, 2, 0.4438517, 1, 1
-2.859498, 2, 2, 0.4200861, 1, 1
-2.795421, 2, 2, 0.3963819, 1, 1
-2.731344, 2, 2, 0.3847744, 1, 1
-2.667267, 2, 2, 0.361094, 1, 1
-2.60319, 2, 2, 0.3372502, 1, 1
-2.539113, 2, 2, 0.3256161, 1, 1
-2.475036, 2, 2, 0.2896781, 1, 1
-2.410959, 2, 2, 0.2775478, 1, 1
-2.346882, 2, 2, 0.2539299, 1, 1
-2.282805, 2, 2, 0.2299178, 0, 1
-2.218728, 2, 2, 0.2061844, 0, 1
-2.154651, 2, 2, 0.1827507, 0, 1
-2.090574, 2, 2, 0.1708429, 0, 1
-2.026497, 2, 2, 0.1470447, 0, 1
-1.96242, 1, 2, 0.1237173, 0, 1
-1.898343, 1, 2, 0.1012769, 0, 1
-1.834266, 1, 2, 0.07886934, 0, 1
-1.770189, 1, 2, 0.06727386, 0, 1
-1.706112, 1, 2, 0.04460692, 0, 1
-1.642035, 1, 2, 0.02284575, 0, 1
-1.577958, 1, 2, 0.002432585, 0, 1
-1.513881, 1, 2, -0.0176053, 0, 1
-1.449804, 1, 2, -0.02738857, 0, 1
-1.385727, 1, 2, -0.04659557, 0, 1
-1.32165, 1, 2, -0.06577015, 0, 1
-1.257573, 1, 2, -0.08398533, 0, 1
-1.193496, 1, 2, -0.1014891, 0, 1
-1.12942, 1, 2, -0.1100087, 0, 1
-1.065343, 1, 2, -0.1274862, 0, 1
-1.001266, 1, 2, -0.1457047, 0, 1
-0.9371888, 0, 2, -0.1641059, 0, 1
-0.8731119, 0, 2, -0.1826267, 0, 1
-0.8090349, 0, 2, -0.1926064, 0, 1
-0.744958, 0, 2, -0.213449, 0, 1
-0.6808811, 0, 2, -0.2356534, 0, 1
-0.6168042, 0, 2, -0.2581177, -1, 1
-0.5527273, 0, 2, -0.2803349, -1, 1
-0.4886504, 0, 2, -0.3004503, -1, 1
-0.4245735, 0, 2, -0.3098702, -1, 1
-0.3604965, 0, 2, -0.3294001, -1, 1
-0.2964196, 0, 2, -0.3470392, -1, 1
-0.2323427, 0, 2, -0.3621368, -1, 1
-0.1682657, 0, 2, -0.375742, -1, 1
-0.1041888, 0, 2, -0.3816648, -1, 1
-0.04011191, 0, 2, -0.3937845, -1, 1
0.02396501, 0, 2, -0.4056387, -1, 1
0.08804193, 0, 2, -0.4161353, -1, 1
0.1521188, 0, 2, -0.4262667, -1, 1
0.2161958, 0, 2, -0.4306931, -1, 1
0.2802727, 0, 2, -0.4396405, -1, 1
0.3443496, 0, 2, -0.447897, -1, 1
0.4084266, 0, 2, -0.4567938, -1, 1
0.4725035, 0, 2, -0.4668684, -1, 1
0.5365804, 0, 2, -0.4722672, -1, 1
0.6006573, 0, 2, -0.4837728, -1, 1
0.6647342, 0, 2, -0.4953918, -1, 1
0.7288111, 0, 2, -0.5084453, -2, 1
0.792888, 0, 2, -0.5226593, -2, 1
0.856965, 0, 2, -0.5298719, -2, 1
0.9210419, 0, 2, -0.5449839, -2, 1
0.9851188, 0, 2, -0.5606823, -2, 1
1.049196, -1, 2, -0.5769043, -2, 1
1.113273, -1, 2, -0.5946169, -2, 1
1.17735, -1, 2, -0.6126637, -2, 1
1.241426, -1, 2, -0.6221828, -2, 1
1.305503, -1, 2, -0.6402664, -2, 1
1.36958, -1, 2, -0.657999, -2, 1
1.433657, -1, 2, -0.6762075, -2, 1
1.497734, -1, 2, -0.6953773, -2, 1
1.561811, -1, 2, -0.7054601, -2, 1
1.625888, -1, 2, -0.7260032, -2, 1
1.689965, -1, 2, -0.7468109, -2, 1
1.754042, -1, 2, -0.7682047, -3, 1
1.818119, -1, 2, -0.7903814, -3, 1
1.882196, -1, 2, -0.8014297, -3, 1
1.946273, -1, 2, -0.8237925, -3, 1
2.01035, -2, 2, -0.8473001, -3, 1
2.074427, -2, 2, -0.8713179, -3, 1
2.138504, -2, 2, -0.8949428, -3, 1
2.202581, -2, 2, -0.9066381, -3, 1
2.266658, -2, 2, -0.9290414, -3, 1
2.330735, -2, 2, -0.9503078, -3, 1
2.394812, -2, 2, -0.9722066, -3, 1
2.458889, -2, 2, -0.9947934, -3, 1
2.522966, -2, 2, -1.005988, -4, 1
2.587044, -2, 2, -1.027755, -4, 1
2.65112, -2, 2, -1.047439, -4, 1
2.715197, -2, 2, -1.065671, -4, 1
2.779274, -2, 2, -1.074644, -4, 1
2.843351, -2, 2, -1.091768, -4, 1
2.907429, -2, 2, -1.107559, -4, 1
2.971505, -2, 2, -1.122303, -4, 1
3.035583, -3, 2, -1.135684, -4, 1
3.099659, -3, 2, -1.141882, -4, 1
3.163737, -3, 2, -1.153899, -4, 1
3.227813, -3, 2, -1.163941, -4, 1
3.291891, -3, 2, -1.172717, -4, 1
3.355968, -3, 2, -1.181011, -4, 1
3.420045, -3, 2, -1.184476, -4, 1
3.484122, -3, 2, -1.191258, -4, 1
3.548199, -3, 2, -1.196976, -4, 1
3.612276, -3, 2, -1.202181, -4, 1
3.676353, -3, 2, -1.204655, -4, 1
3.74043, -3, 2, -1.209128, -4, 1
3.804507, -3, 2, -1.212854, -4, 1
3.868584, -3, 2, -1.215982, -4, 1
3.932661, -3, 2, -1.218358, -4, 1
3.996738, -3, 2, -1.219584, -4, 1
4.060815, -4, 2, -1.22185, -4, 1
4.124892, -4, 2, -1.223737, -4, 1
4.188969, -4, 2, -1.225317, -4, 1
4.253046, -4, 2, -1.226444, -4, 1
4.317123, -4, 2, -1.227465, -4, 1
4.3812, -4, 2, -1.227805, -4, 1
4.445277, -4, 2, -1.228093, -4, 1
4.509354, -4, 2, -1.228163, -4, 1
4.573431, -4, 2, -1.228301, -4, 1
4.637508, -4, 2, -1.228065, -4, 1
4.701585, -4, 2, -1.227636, -4, 1
4.765662, -4, 2, -1.226768, -4, 1
4.829739, -4, 2, -1.225719, -4, 1
4.893816, -4, 2, -1.224262, -4, 1
4.957893, -4, 2, -1.222566, -4, 1
5.02197, -5, 2, -1.220512, -4, 1
5.086047, -5, 2, -1.219519, -4, 1
5.150124, -5, 2, -1.21697, -4, 1
5.214201, -5, 2, -1.214384, -4, 1
5.278278, -5, 2, -1.211236, -4, 1
5.342355, -5, 2, -1.209191, -4, 1
5.406432, -5, 2, -1.205215, -4, 1
5.470509, -5, 2, -1.200973, -4, 1
5.534586, -5, 2, -1.196537, -4, 1
5.598663, -5, 2, -1.191204, -4, 1
5.66274, -5, 2, -1.188075, -4, 1
5.726817, -5, 2, -1.181067, -4, 1
5.790894, -5, 2, -1.172998, -4, 1
5.854971, -5, 2, -1.163039, -4, 1
5.919048, -5, 2, -1.152519, -4, 1
5.983125, -5, 2, -1.146517, -4, 1
6.047202, -6, 2, -1.134308, -4, 1
6.111279, -6, 2, -1.120701, -4, 1
6.175356, -6, 2, -1.106752, -4, 1
6.239433, -6, 2, -1.098834, -4, 1
6.303509, -6, 2, -1.083205, -4, 1
6.367586, -6, 2, -1.067009, -4, 1
6.431663, -6, 2, -1.050806, -4, 1
6.495739, -6, 2, -1.034115, -4, 1
6.559816, -6, 2, -1.025777, -4, 1
6.623893, -6, 2, -1.008506, -4, 1
6.687969, -6, 2, -0.9922748, -3, 1
6.752046, -6, 2, -0.9767804, -3, 1
6.816123, -6, 2, -0.9618845, -3, 1
6.880199, -6, 2, -0.9547553, -3, 1
6.944276, -6, 2, -0.9408484, -3, 1
7.008353, -7, 2, -0.9276257, -3, 1
7.072429, -7, 2, -0.9146333, -3, 1
7.136506, -7, 2, -0.908884, -3, 1
7.200583, -7, 2, -0.8974085, -3, 1
7.264659, -7, 2, -0.8817873, -3, 1
7.328736, -7, 2, -0.8769941, -3, 1
7.392812, -7, 2, -0.8678718, -3, 1
7.456889, -7, 2, -0.8592796, -3, 1
7.520966, -7, 2, -0.8519034, -3, 1
