car_pos_meter , car_pos_cell, car_speed, ped_pos_meter, ped_pos_cell, ped_speed
-10.25, 10, 2, 4.096412, 11, 1
-10.20835, 10, 2, 4.079805, 11, 1
-9.791852, 9, 2, 3.902676, 10, 1
-8.750607, 8, 2, 3.522891, 9, 1
-7.709361, 7, 2, 3.100321, 8, 1
-6.668116, 6, 2, 2.637232, 7, 1
-5.62687, 5, 1, 2.207563, 5, 1
-5.483116, 5, 2, 1.78652, 4, 1
-4.48352, 4, 2, 1.365754, 3, 1
-3.442271, 3, 2, 0.930223, 2, 1
-2.40102, 2, 2, 0.5508363, 1, 1
-1.359768, 1, 2, 0.1312518, 0, 1
-0.3185178, 0, 2, -0.2422032, 0, 1
0.7227321, 0, 2, -0.5714579, -1, 1
1.763983, -1, 2, -0.8531013, -2, 1
2.805234, -2, 2, -1.121739, -3, 1
3.846486, -3, 2, -1.264506, -3, 1
4.887732, -4, 2, -1.301319, -3, 1
5.928977, -5, 2, -1.191165, -3, 1
