timestamp_sec,frame_id,game_played,yielding,player1discrete,player2discrete,player1yieldprob,player2yieldprob,player1_pose_x,player1_pose_y,player1_pose_z,player1_pose_orient_x,player1_pose_orient_y,player1_pose_orient_z,player1_pose_orient_w,player2_pose_x,player2_pose_y,player2_pose_z,player2_pose_orient_x,player2_pose_orient_y,player2_pose_orient_z,player2_pose_orient_w
1718121043.7986517,map,True,False,4,4,0.5922520728754596,0.5922520728754596,1.9375509023666382,-1.6745470762252808,0.0,0.0,0.0,0.05452020223980144,0.9985126670039662,3.513113673465516,-4.974938467146728,0.7728818013536591,0.0,0.0,0.0,1.0
1718121043.8979328,map,True,False,4,4,0.5922520728754596,0.5922520728754596,1.9375509023666382,-1.6745470762252808,0.0,0.0,0.0,0.05452020223980144,0.9985126670039662,3.5494672147655315,-5.01711563971682,0.7591011921281348,0.0,0.0,0.0,1.0
1718121043.9518526,map,True,True,4,4,0.5922520728754596,0.5922520728754596,1.9375509023666382,-1.6745470762252808,0.0,0.0,0.0,0.05452020223980144,0.9985126670039662,3.5494672147655315,-5.01711563971682,0.7591011921281348,0.0,0.0,0.0,1.0
1718121044.0510955,map,True,True,4,4,0.5922520728754596,0.5922520728754596,1.9375509023666382,-1.6745470762252808,0.0,0.0,0.0,0.05452020223980144,0.9985126670039662,3.5494672147655315,-5.01711563971682,0.7591011921281348,0.0,0.0,0.0,1.0
1718121044.1512182,map,True,False,4,3,0.0,0.0,1.9375509023666382,-1.6745470762252808,0.0,0.0,0.0,0.05452020223980144,0.9985126670039662,3.5228835903069697,-4.354121791547893,0.7481005627094396,0.0,0.0,0.0,1.0
1718121044.199527,map,True,False,4,3,0.0,0.0,1.9375509023666382,-1.6745470762252808,0.0,0.0,0.0,0.05452020223980144,0.9985126670039662,3.550146573540157,-4.382616786569574,0.7279773428367617,0.0,0.0,0.0,1.0
1718121044.5482984,map,True,False,3,2,0.0,0.0,2.069159507751465,-1.7069817781448364,0.0,0.0,0.0,0.055907299229591784,0.9984359580014639,3.5191629857268483,-3.8061234746641937,0.6947918501944217,0.0,0.0,0.0,1.0
1718121044.599127,map,True,False,3,2,0.0,0.0,2.069159507751465,-1.7069817781448364,0.0,0.0,0.0,0.055907299229591784,0.9984359580014639,3.5191629857268483,-3.8061234746641937,0.6947918501944217,0.0,0.0,0.0,1.0
1718121044.6985335,map,True,False,3,2,0.0,0.0,2.069159507751465,-1.7069817781448364,0.0,0.0,0.0,0.055907299229591784,0.9984359580014639,3.5191629857268483,-3.8061234746641937,0.6947918501944217,0.0,0.0,0.0,1.0
1718121044.7984188,map,True,False,3,2,0.0,0.0,2.069159507751465,-1.7069817781448364,0.0,0.0,0.0,0.055907299229591784,0.9984359580014639,3.539467828835536,-3.373540708463055,0.6836199605240224,0.0,0.0,0.0,1.0
1718121044.9006522,map,True,False,3,2,0.0,0.0,2.069159507751465,-1.7069817781448364,0.0,0.0,0.0,0.055907299229591784,0.9984359580014639,3.550011577975094,-3.264012008749846,0.6833020469357595,0.0,0.0,0.0,1.0
1718121044.9487364,map,True,False,3,2,0.0,0.0,2.069159507751465,-1.7069817781448364,0.0,0.0,0.0,0.055907299229591784,0.9984359580014639,3.550011577975094,-3.264012008749846,0.6833020469357595,0.0,0.0,0.0,1.0
1718121044.9992547,map,True,False,3,2,0.0,0.0,2.069159507751465,-1.7069817781448364,0.0,0.0,0.0,0.055907299229591784,0.9984359580014639,3.550011577975094,-3.264012008749846,0.6833020469357595,0.0,0.0,0.0,1.0
1718121045.0498438,map,True,False,3,2,0.0,0.0,2.069159507751465,-1.7069817781448364,0.0,0.0,0.0,0.055907299229591784,0.9984359580014639,3.550011577975094,-3.264012008749846,0.6833020469357595,0.0,0.0,0.0,1.0
1718121045.150163,map,True,False,3,2,0.0,0.0,2.069159507751465,-1.7069817781448364,0.0,0.0,0.0,0.055907299229591784,0.9984359580014639,3.6300638516721913,-2.9154002294069974,0.6844485766488485,0.0,0.0,0.0,1.0
1718121045.1998272,map,True,False,3,2,0.0,0.0,2.2066478729248047,-1.7323566675186157,0.0,0.0,0.0,0.056260605338407536,0.9984161231389683,3.6629243708611865,-2.8622685874202785,0.682075693215083,0.0,0.0,0.0,1.0
1718121045.2498307,map,True,False,3,2,0.0,0.0,2.2066478729248047,-1.7323566675186157,0.0,0.0,0.0,0.056260605338407536,0.9984161231389683,3.6629243708611865,-2.8622685874202785,0.682075693215083,0.0,0.0,0.0,1.0
1718121045.4988122,map,True,False,3,1,0.0,0.0,2.2066478729248047,-1.7323566675186157,0.0,0.0,0.0,0.056260605338407536,0.9984161231389683,3.7073521479173888,-2.3661426795809675,0.6823043170190592,0.0,0.0,0.0,1.0
1718121045.5994782,map,True,False,3,1,0.0,0.0,2.2066478729248047,-1.7323566675186157,0.0,0.0,0.0,0.056260605338407536,0.9984161231389683,3.7073521479173888,-2.3661426795809675,0.6823043170190592,0.0,0.0,0.0,1.0
1718121045.649566,map,True,False,3,1,0.0,0.0,2.2066478729248047,-1.7323566675186157,0.0,0.0,0.0,0.056260605338407536,0.9984161231389683,3.7073521479173888,-2.3661426795809675,0.6823043170190592,0.0,0.0,0.0,1.0
1718121045.7287788,map,True,False,3,1,0.0,0.0,2.2066478729248047,-1.7323566675186157,0.0,0.0,0.0,0.056260605338407536,0.9984161231389683,3.7073521479173888,-2.3661426795809675,0.6823043170190592,0.0,0.0,0.0,1.0
1718121045.7332451,map,True,False,3,1,0.0,0.0,2.2066478729248047,-1.7323566675186157,0.0,0.0,0.0,0.056260605338407536,0.9984161231389683,3.7073521479173888,-2.3661426795809675,0.6823043170190592,0.0,0.0,0.0,1.0
1718121045.7378352,map,True,False,3,1,0.0,0.0,2.2066478729248047,-1.7323566675186157,0.0,0.0,0.0,0.056260605338407536,0.9984161231389683,3.7073521479173888,-2.3661426795809675,0.6823043170190592,0.0,0.0,0.0,1.0
1718121045.7410643,map,True,False,3,1,0.0,0.0,2.2066478729248047,-1.7323566675186157,0.0,0.0,0.0,0.056260605338407536,0.9984161231389683,3.7073521479173888,-2.3661426795809675,0.6823043170190592,0.0,0.0,0.0,1.0
1718121045.7449467,map,True,False,3,1,0.0,0.0,2.2066478729248047,-1.7323566675186157,0.0,0.0,0.0,0.056260605338407536,0.9984161231389683,3.7073521479173888,-2.3661426795809675,0.6823043170190592,0.0,0.0,0.0,1.0
1718121045.7496028,map,True,False,3,1,0.0,0.0,2.2066478729248047,-1.7323566675186157,0.0,0.0,0.0,0.056260605338407536,0.9984161231389683,3.7073521479173888,-2.3661426795809675,0.6823043170190592,0.0,0.0,0.0,1.0
1718121045.7531033,map,True,False,3,1,0.0,0.0,2.3002493381500244,-1.7641427516937256,0.0,0.0,0.0,0.05847786798059775,0.9982887019883696,3.7073521479173888,-2.3661426795809675,0.6823043170190592,0.0,0.0,0.0,1.0
1718121045.7581553,map,True,False,3,1,0.0,0.0,2.3002493381500244,-1.7641427516937256,0.0,0.0,0.0,0.05847786798059775,0.9982887019883696,3.7073521479173888,-2.3661426795809675,0.6823043170190592,0.0,0.0,0.0,1.0
1718121045.761269,map,True,False,3,1,0.0,0.0,2.3002493381500244,-1.7641427516937256,0.0,0.0,0.0,0.05847786798059775,0.9982887019883696,3.7073521479173888,-2.3661426795809675,0.6823043170190592,0.0,0.0,0.0,1.0
1718121045.7656763,map,True,False,3,1,0.0,0.0,2.3002493381500244,-1.7641427516937256,0.0,0.0,0.0,0.05847786798059775,0.9982887019883696,3.7073521479173888,-2.3661426795809675,0.6823043170190592,0.0,0.0,0.0,1.0
1718121045.7689676,map,True,False,3,1,0.0,0.0,2.3002493381500244,-1.7641427516937256,0.0,0.0,0.0,0.05847786798059775,0.9982887019883696,3.7073521479173888,-2.3661426795809675,0.6823043170190592,0.0,0.0,0.0,1.0
1718121045.773964,map,True,False,3,1,0.0,0.0,2.3002493381500244,-1.7641427516937256,0.0,0.0,0.0,0.05847786798059775,0.9982887019883696,3.7073521479173888,-2.3661426795809675,0.6823043170190592,0.0,0.0,0.0,1.0
1718121045.7767715,map,True,False,3,1,0.0,0.0,2.3002493381500244,-1.7641427516937256,0.0,0.0,0.0,0.05847786798059775,0.9982887019883696,3.7073521479173888,-2.3661426795809675,0.6823043170190592,0.0,0.0,0.0,1.0
1718121045.7810903,map,True,False,3,1,0.0,0.0,2.3002493381500244,-1.7641427516937256,0.0,0.0,0.0,0.05847786798059775,0.9982887019883696,3.7073521479173888,-2.3661426795809675,0.6823043170190592,0.0,0.0,0.0,1.0
1718121045.7847953,map,True,False,3,1,0.0,0.0,2.3002493381500244,-1.7641427516937256,0.0,0.0,0.0,0.05847786798059775,0.9982887019883696,3.7073521479173888,-2.3661426795809675,0.6823043170190592,0.0,0.0,0.0,1.0
1718121045.791196,map,True,False,3,1,0.0,0.0,2.3002493381500244,-1.7641427516937256,0.0,0.0,0.0,0.05847786798059775,0.9982887019883696,3.7073521479173888,-2.3661426795809675,0.6823043170190592,0.0,0.0,0.0,1.0
1718121045.7937043,map,True,False,3,1,0.0,0.0,2.3002493381500244,-1.7641427516937256,0.0,0.0,0.0,0.05847786798059775,0.9982887019883696,3.7073521479173888,-2.3661426795809675,0.6823043170190592,0.0,0.0,0.0,1.0
1718121045.7986887,map,True,False,3,1,0.0,0.0,2.3002493381500244,-1.7641427516937256,0.0,0.0,0.0,0.05847786798059775,0.9982887019883696,3.743119082851119,-2.102454906533135,0.68017009769746,0.0,0.0,0.0,1.0
1718121045.8014438,map,True,False,3,1,0.0,0.0,2.3002493381500244,-1.7641427516937256,0.0,0.0,0.0,0.05847786798059775,0.9982887019883696,3.743119082851119,-2.102454906533135,0.68017009769746,0.0,0.0,0.0,1.0
1718121045.805463,map,True,False,3,1,0.0,0.0,2.3002493381500244,-1.7641427516937256,0.0,0.0,0.0,0.05847786798059775,0.9982887019883696,3.743119082851119,-2.102454906533135,0.68017009769746,0.0,0.0,0.0,1.0
1718121045.8096354,map,True,False,3,1,0.0,0.0,2.3002493381500244,-1.7641427516937256,0.0,0.0,0.0,0.05847786798059775,0.9982887019883696,3.743119082851119,-2.102454906533135,0.68017009769746,0.0,0.0,0.0,1.0
1718121045.814096,map,True,False,3,1,0.0,0.0,2.3002493381500244,-1.7641427516937256,0.0,0.0,0.0,0.05847786798059775,0.9982887019883696,3.743119082851119,-2.102454906533135,0.68017009769746,0.0,0.0,0.0,1.0
1718121045.8173308,map,True,False,3,1,0.0,0.0,2.3002493381500244,-1.7641427516937256,0.0,0.0,0.0,0.05847786798059775,0.9982887019883696,3.743119082851119,-2.102454906533135,0.68017009769746,0.0,0.0,0.0,1.0
1718121045.8229594,map,True,False,3,1,0.0,0.0,2.3002493381500244,-1.7641427516937256,0.0,0.0,0.0,0.05847786798059775,0.9982887019883696,3.743119082851119,-2.102454906533135,0.68017009769746,0.0,0.0,0.0,1.0
1718121045.825723,map,True,False,3,1,0.0,0.0,2.3002493381500244,-1.7641427516937256,0.0,0.0,0.0,0.05847786798059775,0.9982887019883696,3.743119082851119,-2.102454906533135,0.68017009769746,0.0,0.0,0.0,1.0
1718121045.828916,map,True,False,3,1,0.0,0.0,2.3002493381500244,-1.7641427516937256,0.0,0.0,0.0,0.05847786798059775,0.9982887019883696,3.743119082851119,-2.102454906533135,0.68017009769746,0.0,0.0,0.0,1.0
1718121045.8338792,map,True,False,3,1,0.0,0.0,2.3002493381500244,-1.7641427516937256,0.0,0.0,0.0,0.05847786798059775,0.9982887019883696,3.743119082851119,-2.102454906533135,0.68017009769746,0.0,0.0,0.0,1.0
1718121045.8370976,map,True,False,3,1,0.0,0.0,2.3002493381500244,-1.7641427516937256,0.0,0.0,0.0,0.05847786798059775,0.9982887019883696,3.743119082851119,-2.102454906533135,0.68017009769746,0.0,0.0,0.0,1.0
1718121045.841439,map,True,False,3,1,0.0,0.0,2.3002493381500244,-1.7641427516937256,0.0,0.0,0.0,0.05847786798059775,0.9982887019883696,3.743119082851119,-2.102454906533135,0.68017009769746,0.0,0.0,0.0,1.0
1718121045.8445356,map,True,False,3,1,0.0,0.0,2.3002493381500244,-1.7641427516937256,0.0,0.0,0.0,0.05847786798059775,0.9982887019883696,3.743119082851119,-2.102454906533135,0.68017009769746,0.0,0.0,0.0,1.0
1718121045.8486464,map,True,False,3,1,0.0,0.0,2.3002493381500244,-1.7641427516937256,0.0,0.0,0.0,0.05847786798059775,0.9982887019883696,3.743119082851119,-2.102454906533135,0.68017009769746,0.0,0.0,0.0,1.0
1718121045.8551927,map,True,False,3,1,0.0,0.0,2.3002493381500244,-1.7641427516937256,0.0,0.0,0.0,0.05847786798059775,0.9982887019883696,3.743119082851119,-2.102454906533135,0.68017009769746,0.0,0.0,0.0,1.0
1718121045.86459,map,True,False,3,1,0.0,0.0,2.3002493381500244,-1.7641427516937256,0.0,0.0,0.0,0.05847786798059775,0.9982887019883696,3.743119082851119,-2.102454906533135,0.68017009769746,0.0,0.0,0.0,1.0
1718121045.8732724,map,True,False,3,1,0.0,0.0,2.3002493381500244,-1.7641427516937256,0.0,0.0,0.0,0.05847786798059775,0.9982887019883696,3.743119082851119,-2.102454906533135,0.68017009769746,0.0,0.0,0.0,1.0
1718121045.8807857,map,True,False,3,1,0.0,0.0,2.3002493381500244,-1.7641427516937256,0.0,0.0,0.0,0.05847786798059775,0.9982887019883696,3.743119082851119,-2.102454906533135,0.68017009769746,0.0,0.0,0.0,1.0
1718121045.888954,map,True,False,3,1,0.0,0.0,2.3002493381500244,-1.7641427516937256,0.0,0.0,0.0,0.05847786798059775,0.9982887019883696,3.743119082851119,-2.102454906533135,0.68017009769746,0.0,0.0,0.0,1.0
1718121045.892812,map,True,False,3,1,0.0,0.0,2.3002493381500244,-1.7641427516937256,0.0,0.0,0.0,0.05847786798059775,0.9982887019883696,3.743119082851119,-2.102454906533135,0.68017009769746,0.0,0.0,0.0,1.0
1718121045.8970938,map,True,False,3,1,0.0,0.0,2.3002493381500244,-1.7641427516937256,0.0,0.0,0.0,0.05847786798059775,0.9982887019883696,3.743119082851119,-2.102454906533135,0.68017009769746,0.0,0.0,0.0,1.0
1718121045.9008355,map,True,False,3,1,0.0,0.0,2.3002493381500244,-1.7641427516937256,0.0,0.0,0.0,0.05847786798059775,0.9982887019883696,3.743119082851119,-2.102454906533135,0.68017009769746,0.0,0.0,0.0,1.0
1718121045.905276,map,True,False,3,1,0.0,0.0,2.3002493381500244,-1.7641427516937256,0.0,0.0,0.0,0.05847786798059775,0.9982887019883696,3.743119082851119,-2.102454906533135,0.68017009769746,0.0,0.0,0.0,1.0
1718121045.9097269,map,True,False,3,1,0.0,0.0,2.3002493381500244,-1.7641427516937256,0.0,0.0,0.0,0.05847786798059775,0.9982887019883696,3.743119082851119,-2.102454906533135,0.68017009769746,0.0,0.0,0.0,1.0
1718121045.9172153,map,True,False,3,1,0.0,0.0,2.3002493381500244,-1.7641427516937256,0.0,0.0,0.0,0.05847786798059775,0.9982887019883696,3.743119082851119,-2.102454906533135,0.68017009769746,0.0,0.0,0.0,1.0
1718121045.9235957,map,True,False,3,1,0.0,0.0,2.3002493381500244,-1.7641427516937256,0.0,0.0,0.0,0.05847786798059775,0.9982887019883696,3.743119082851119,-2.102454906533135,0.68017009769746,0.0,0.0,0.0,1.0
1718121045.9253297,map,True,False,3,1,0.0,0.0,2.3002493381500244,-1.7641427516937256,0.0,0.0,0.0,0.05847786798059775,0.9982887019883696,3.743119082851119,-2.102454906533135,0.68017009769746,0.0,0.0,0.0,1.0
1718121045.9336421,map,True,False,3,1,0.0,0.0,2.3002493381500244,-1.7641427516937256,0.0,0.0,0.0,0.05847786798059775,0.9982887019883696,3.743119082851119,-2.102454906533135,0.68017009769746,0.0,0.0,0.0,1.0
1718121045.9364135,map,True,False,3,1,0.0,0.0,2.3002493381500244,-1.7641427516937256,0.0,0.0,0.0,0.05847786798059775,0.9982887019883696,3.743119082851119,-2.102454906533135,0.68017009769746,0.0,0.0,0.0,1.0
1718121045.941728,map,True,False,3,1,0.0,0.0,2.3002493381500244,-1.7641427516937256,0.0,0.0,0.0,0.05847786798059775,0.9982887019883696,3.743119082851119,-2.102454906533135,0.68017009769746,0.0,0.0,0.0,1.0
1718121045.9950664,map,True,False,3,1,0.0,0.0,2.3002493381500244,-1.7641427516937256,0.0,0.0,0.0,0.05847786798059775,0.9982887019883696,3.743119082851119,-2.102454906533135,0.68017009769746,0.0,0.0,0.0,1.0
1718121046.0477147,map,True,False,3,1,0.0,0.0,2.3002493381500244,-1.7641427516937256,0.0,0.0,0.0,0.05847786798059775,0.9982887019883696,3.743119082851119,-2.102454906533135,0.68017009769746,0.0,0.0,0.0,1.0
1718121046.100136,map,True,False,3,1,0.0,0.0,2.3002493381500244,-1.7641427516937256,0.0,0.0,0.0,0.05847786798059775,0.9982887019883696,3.743119082851119,-2.102454906533135,0.68017009769746,0.0,0.0,0.0,1.0
1718121046.1176398,map,True,False,3,1,0.0,0.0,2.3002493381500244,-1.7641427516937256,0.0,0.0,0.0,0.05847786798059775,0.9982887019883696,3.743119082851119,-2.102454906533135,0.68017009769746,0.0,0.0,0.0,1.0
1718121046.1226325,map,True,False,3,1,0.0,0.0,2.3002493381500244,-1.7641427516937256,0.0,0.0,0.0,0.05847786798059775,0.9982887019883696,3.743119082851119,-2.102454906533135,0.68017009769746,0.0,0.0,0.0,1.0
1718121046.173487,map,True,False,3,1,0.0,0.0,2.3002493381500244,-1.7641427516937256,0.0,0.0,0.0,0.05847786798059775,0.9982887019883696,3.743119082851119,-2.102454906533135,0.68017009769746,0.0,0.0,0.0,1.0
1718121046.2233377,map,True,False,3,1,0.0,0.0,2.3002493381500244,-1.7641427516937256,0.0,0.0,0.0,0.05847786798059775,0.9982887019883696,3.743119082851119,-2.102454906533135,0.68017009769746,0.0,0.0,0.0,1.0
