car_pos_meter , car_pos_cell, car_speed, ped_pos_meter, ped_pos_cell, ped_speed
-5.125, 5, 2, 3.992859, 5, 1
-5.104175, 5, 1, 3.980071, 5, 1
-5.0938, 5, 2, 3.966631, 5, 1
-5.072975, 5, 2, 3.952773, 5, 1
-5.05215, 5, 1, 3.945458, 5, 1
-5.041775, 5, 2, 3.930723, 5, 1
-5.02095, 5, 1, 3.915258, 5, 1
-5.010575, 5, 1, 3.899011, 5, 1
-5.0002, 5, 1, 3.882134, 5, 1
-4.989825, 4, 2, 3.873431, 5, 1
-4.969, 4, 2, 3.855948, 5, 1
-4.948175, 4, 1, 3.838414, 4, 1
-4.9378, 4, 1, 3.82029, 4, 1
-4.927425, 4, 2, 3.802351, 4, 1
-4.9066, 4, 2, 3.793345, 4, 1
-4.885776, 4, 2, 3.775578, 4, 1
-4.864951, 4, 1, 3.757898, 4, 1
-4.854576, 4, 1, 3.740393, 4, 1
-4.844201, 4, 2, 3.723419, 4, 1
-4.823376, 4, 2, 3.715005, 4, 1
-4.802551, 4, 1, 3.698224, 4, 1
-4.792176, 4, 1, 3.681773, 4, 1
-4.781801, 4, 1, 3.664606, 4, 1
-4.771426, 4, 1, 3.647267, 4, 1
-4.761051, 4, 2, 3.638578, 4, 1
-4.740226, 4, 2, 3.621063, 4, 1
-4.719401, 4, 1, 3.603551, 4, 1
-4.709026, 4, 1, 3.585559, 4, 1
-4.698651, 4, 2, 3.567394, 4, 1
-4.677826, 4, 2, 3.558279, 4, 1
-4.657001, 4, 1, 3.54012, 4, 1
-4.646626, 4, 1, 3.521713, 4, 1
-4.636251, 4, 2, 3.502903, 4, 1
-4.615426, 4, 1, 3.48418, 4, 1
-4.605051, 4, 2, 3.4745, 4, 1
-4.584226, 4, 1, 3.455324, 4, 1
-4.573851, 4, 1, 3.435961, 4, 1
-4.563476, 4, 2, 3.416221, 4, 1
-4.542651, 4, 2, 3.396626, 4, 1
-4.521826, 4, 2, 3.386524, 4, 1
-4.501001, 4, 1, 3.366563, 4, 1
-4.490626, 4, 1, 3.346581, 4, 1
-4.480251, 4, 2, 3.326114, 4, 1
-4.459426, 4, 1, 3.305756, 4, 1
-4.449051, 4, 2, 3.295863, 4, 1
-4.428226, 4, 1, 3.276763, 4, 1
-4.417851, 4, 1, 3.258046, 4, 1
-4.407476, 4, 2, 3.239369, 4, 1
-4.386652, 4, 2, 3.221601, 4, 1
-4.365827, 4, 2, 3.212668, 4, 1
-4.345002, 4, 1, 3.195915, 4, 1
-4.334627, 4, 1, 3.179467, 4, 1
-4.324252, 4, 1, 3.162992, 4, 1
-4.313877, 4, 1, 3.146916, 4, 1
-4.303502, 4, 2, 3.139012, 4, 1
-4.282677, 4, 1, 3.12378, 4, 1
-4.272302, 4, 2, 3.108514, 4, 1
-4.251477, 4, 2, 3.092612, 4, 1
-4.230652, 4, 2, 3.077407, 4, 1
-4.209827, 4, 2, 3.069495, 3, 1
-4.189002, 4, 2, 3.054012, 3, 1
-4.168177, 4, 2, 3.038249, 3, 1
-4.147352, 4, 2, 3.021649, 3, 1
-4.126527, 4, 2, 3.01359, 3, 1
-4.105702, 4, 2, 2.997212, 3, 1
-4.084877, 4, 2, 2.980033, 3, 1
-4.064053, 4, 2, 2.962874, 3, 1
-4.043228, 4, 2, 2.944717, 3, 1
-4.022403, 4, 2, 2.926122, 3, 1
-4.001578, 4, 2, 2.916697, 3, 1
-3.980753, 3, 1, 2.897411, 3, 1
-3.970378, 3, 1, 2.877972, 3, 1
-3.960003, 3, 2, 2.858076, 3, 1
-3.939178, 3, 2, 2.838, 3, 1
-3.918353, 3, 1, 2.827983, 3, 1
-3.907978, 3, 1, 2.807832, 3, 1
-3.897603, 3, 2, 2.787966, 3, 1
-3.876778, 3, 1, 2.768015, 3, 1
-3.866403, 3, 1, 2.748345, 3, 1
-3.856028, 3, 1, 2.738593, 3, 1
-3.845653, 3, 1, 2.719422, 3, 1
-3.835278, 3, 2, 2.700741, 3, 1
-3.814453, 3, 1, 2.682213, 3, 1
-3.804078, 3, 2, 2.663073, 3, 1
-3.783253, 3, 1, 2.653554, 3, 1
-3.772878, 3, 1, 2.635004, 3, 1
-3.762503, 3, 2, 2.616306, 3, 1
-3.741678, 3, 1, 2.597453, 3, 1
-3.731303, 3, 1, 2.578831, 3, 1
-3.720928, 3, 1, 2.569547, 3, 1
-3.710553, 3, 1, 2.551558, 3, 1
-3.700178, 3, 2, 2.533363, 3, 1
-3.679353, 3, 1, 2.514704, 3, 1
-3.668978, 3, 1, 2.496331, 3, 1
-3.658603, 3, 1, 2.486766, 3, 1
-3.648228, 3, 1, 2.467992, 3, 1
-3.637853, 3, 2, 2.449283, 3, 1
-3.617028, 3, 1, 2.43065, 3, 1
-3.606653, 3, 1, 2.411358, 3, 1
-3.596278, 3, 1, 2.401435, 3, 1
-3.585903, 3, 1, 2.381703, 3, 1
-3.575528, 3, 2, 2.361791, 3, 1
-3.554703, 3, 2, 2.341579, 3, 1
-3.533878, 3, 1, 2.321445, 3, 1
-3.523503, 3, 1, 2.311183, 3, 1
-3.513128, 3, 2, 2.291492, 2, 1
-3.492303, 3, 2, 2.272125, 2, 1
-3.471478, 3, 2, 2.252476, 2, 1
-3.450654, 3, 2, 2.233766, 2, 1
-3.429829, 3, 2, 2.224026, 2, 1
-3.409004, 3, 2, 2.205591, 2, 1
-3.388179, 3, 2, 2.187016, 2, 1
-3.367354, 3, 2, 2.168621, 2, 1
-3.346529, 3, 2, 2.150674, 2, 1
-3.325704, 3, 2, 2.14176, 2, 1
-3.304879, 3, 2, 2.124521, 2, 1
-3.284054, 3, 2, 2.107808, 2, 1
-3.263229, 3, 2, 2.091147, 2, 1
-3.242404, 3, 2, 2.074944, 2, 1
-3.22158, 3, 2, 2.058696, 2, 1
-3.200755, 3, 2, 2.050481, 2, 1
-3.17993, 3, 2, 2.034217, 2, 1
-3.159105, 3, 2, 2.017601, 2, 1
-3.13828, 3, 2, 2.001218, 2, 1
-3.117455, 3, 2, 1.984516, 2, 1
-3.09663, 3, 2, 1.975895, 2, 1
-3.075805, 3, 2, 1.958849, 2, 1
-3.05498, 3, 2, 1.941174, 2, 1
-3.034155, 3, 2, 1.923876, 2, 1
-3.01333, 3, 2, 1.914712, 2, 1
-2.992506, 2, 2, 1.896754, 2, 1
-2.971681, 2, 1, 1.877741, 2, 1
-2.961306, 2, 1, 1.858215, 2, 1
-2.950931, 2, 1, 1.838327, 2, 1
-2.940556, 2, 1, 1.817994, 2, 1
-2.930181, 2, 1, 1.807509, 2, 1
-2.919806, 2, 1, 1.787138, 2, 1
-2.909431, 2, 2, 1.766418, 2, 1
-2.888606, 2, 2, 1.745819, 2, 1
-2.867781, 2, 2, 1.724769, 2, 1
-2.846956, 2, 2, 1.71404, 2, 1
-2.826131, 2, 1, 1.692999, 2, 1
-2.815756, 2, 2, 1.671893, 2, 1
-2.794931, 2, 2, 1.651274, 2, 1
-2.774106, 2, 2, 1.631168, 2, 1
-2.753281, 2, 1, 1.621074, 2, 1
-2.742906, 2, 1, 1.601317, 2, 1
-2.732531, 2, 2, 1.581427, 2, 1
-2.711706, 2, 1, 1.561842, 2, 1
-2.701331, 2, 2, 1.55184, 2, 1
-2.680506, 2, 2, 1.532132, 1, 1
-2.659681, 2, 2, 1.512623, 1, 1
-2.638856, 2, 2, 1.493542, 1, 1
-2.618032, 2, 2, 1.474789, 1, 1
-2.597207, 2, 2, 1.456147, 1, 1
-2.576382, 2, 2, 1.44667, 1, 1
-2.555557, 2, 2, 1.427948, 1, 1
-2.534732, 2, 2, 1.40905, 1, 1
-2.513907, 2, 2, 1.39023, 1, 1
-2.493082, 2, 2, 1.370776, 1, 1
-2.472257, 2, 2, 1.360618, 1, 1
-2.451432, 2, 2, 1.341398, 1, 1
-2.430607, 2, 2, 1.321778, 1, 1
-2.409782, 2, 2, 1.302145, 1, 1
-2.388958, 2, 2, 1.281833, 1, 1
-2.368133, 2, 2, 1.271605, 1, 1
-2.347308, 2, 2, 1.252356, 1, 1
-2.326483, 2, 2, 1.232202, 1, 1
-2.305658, 2, 2, 1.212086, 1, 1
-2.284833, 2, 2, 1.192311, 1, 1
-2.264008, 2, 2, 1.182311, 1, 1
-2.243183, 2, 2, 1.162326, 1, 1
-2.222358, 2, 2, 1.14232, 1, 1
-2.201533, 2, 2, 1.123197, 1, 1
-2.180708, 2, 2, 1.10396, 1, 1
-2.159883, 2, 2, 1.094664, 1, 1
-2.139059, 2, 2, 1.075571, 1, 1
-2.118234, 2, 2, 1.05695, 1, 1
-2.097409, 2, 2, 1.038767, 1, 1
-2.076584, 2, 2, 1.020799, 1, 1
-2.055759, 2, 2, 1.011794, 1, 1
-2.034934, 2, 2, 0.9940627, 1, 1
-2.014109, 2, 2, 0.9767728, 1, 1
-1.993284, 1, 2, 0.9596334, 1, 1
-1.972459, 1, 2, 0.9429255, 1, 1
-1.951634, 1, 2, 0.934623, 1, 1
-1.930809, 1, 2, 0.917877, 1, 1
-1.909984, 1, 2, 0.9012201, 1, 1
-1.889159, 1, 2, 0.8847547, 1, 1
-1.868334, 1, 2, 0.8762732, 1, 1
-1.847509, 1, 2, 0.8593686, 1, 1
-1.826684, 1, 2, 0.8420119, 1, 1
-1.805859, 1, 2, 0.8244462, 1, 1
-1.785034, 1, 2, 0.8064852, 1, 1
-1.764209, 1, 2, 0.7883749, 1, 1
-1.743384, 1, 2, 0.7788932, 1, 1
-1.722559, 1, 2, 0.7598948, 0, 1
-1.701734, 1, 2, 0.7410145, 0, 1
-1.680909, 1, 2, 0.7221038, 0, 1
-1.660084, 1, 2, 0.7032945, 0, 1
-1.639259, 1, 2, 0.6936681, 0, 1
-1.618434, 1, 2, 0.6750307, 0, 1
-1.597609, 1, 2, 0.656436, 0, 1
-1.576784, 1, 2, 0.6379924, 0, 1
-1.555959, 1, 2, 0.6202147, 0, 1
-1.535133, 1, 2, 0.6114728, 0, 1
-1.514308, 1, 2, 0.5942957, 0, 1
-1.493483, 1, 2, 0.5768778, 0, 1
-1.472658, 1, 2, 0.5596237, 0, 1
-1.451833, 1, 2, 0.5422857, 0, 1
-1.431008, 1, 2, 0.533464, 0, 1
-1.410183, 1, 2, 0.5159879, 0, 1
-1.389358, 1, 2, 0.4982176, 0, 1
-1.368533, 1, 2, 0.4809241, 0, 1
-1.347708, 1, 2, 0.4640856, 0, 1
-1.326883, 1, 2, 0.4556894, 0, 1
-1.306058, 1, 2, 0.439209, 0, 1
-1.285233, 1, 2, 0.4226553, 0, 1
-1.264408, 1, 2, 0.406323, 0, 1
-1.243583, 1, 2, 0.3900709, 0, 1
-1.222758, 1, 2, 0.3819137, 0, 1
-1.201933, 1, 2, 0.3660913, 0, 1
-1.181108, 1, 2, 0.3500423, 0, 1
-1.160283, 1, 2, 0.3344562, 0, 1
-1.139458, 1, 2, 0.3186965, 0, 1
-1.118633, 1, 2, 0.3106985, 0, 1
-1.097808, 1, 2, 0.2951729, 0, 1
-1.076983, 1, 2, 0.2795057, 0, 1
-1.056158, 1, 2, 0.2648549, 0, 1
-1.035333, 1, 2, 0.2502055, 0, 1
-1.014508, 1, 2, 0.2431128, 0, 1
-0.9936827, 0, 2, 0.2291706, 0, 1
-0.9728577, 0, 2, 0.2156034, 0, 1
-0.9520327, 0, 2, 0.2025347, 0, 1
-0.9312077, 0, 2, 0.1899524, 0, 1
-0.9103826, 0, 2, 0.1835122, 0, 1
-0.8895576, 0, 2, 0.1713419, 0, 1
-0.8687326, 0, 2, 0.1595688, 0, 1
-0.8479075, 0, 2, 0.1481719, 0, 1
-0.8270825, 0, 2, 0.1373134, 0, 1
-0.8062575, 0, 2, 0.131804, 0, 1
-0.7854325, 0, 2, 0.1207666, 0, 1
-0.7646074, 0, 2, 0.1097333, 0, 1
-0.7437824, 0, 2, 0.09888434, 0, 1
-0.7229574, 0, 2, 0.08803391, 0, 1
-0.7021323, 0, 2, 0.08280063, 0, 1
-0.6813073, 0, 2, 0.07192707, 0, 1
-0.6604823, 0, 2, 0.06116414, 0, 1
-0.6396573, 0, 2, 0.0500524, 0, 1
-0.6188322, 0, 2, 0.03891182, 0, 1
-0.5980072, 0, 2, 0.03322506, 0, 1
-0.5771822, 0, 2, 0.02184296, 0, 1
-0.5563571, 0, 2, 0.009847403, 0, 1
-0.5355321, 0, 2, -0.002297878, 0, 1
-0.5147071, 0, 2, -0.0149045, 0, 1
-0.4938821, 0, 2, -0.02112341, 0, 1
-0.4730571, 0, 2, -0.03374672, 0, 1
-0.4522321, 0, 2, -0.04653502, 0, 1
-0.4314071, 0, 2, -0.05975437, 0, 1
-0.4105821, 0, 2, -0.07299852, 0, 1
-0.3897571, 0, 2, -0.07996988, 0, 1
-0.3689321, 0, 2, -0.09402704, 0, 1
-0.3481071, 0, 2, -0.1083479, 0, 1
-0.3272821, 0, 2, -0.1235123, 0, 1
-0.3064571, 0, 2, -0.1392679, 0, 1
-0.2856321, 0, 2, -0.1474042, 0, 1
-0.2648071, 0, 2, -0.1638093, 0, 1
-0.2439821, 0, 2, -0.1801324, 0, 1
-0.2231571, 0, 2, -0.1966076, 0, 1
-0.2023321, 0, 2, -0.212502, 0, 1
-0.1815071, 0, 2, -0.2201452, 0, 1
-0.1606821, 0, 2, -0.2357206, 0, 1
-0.1398571, 0, 2, -0.2504063, 0, 1
-0.1190321, 0, 2, -0.2645235, 0, 1
-0.09820712, 0, 2, -0.2781897, 0, 1
-0.07738212, 0, 2, -0.2850037, 0, 1
-0.05655712, 0, 2, -0.2976551, 0, 1
-0.03573212, 0, 2, -0.3094816, 0, 1
-0.01490712, 0, 2, -0.3210855, 0, 1
0.005917877, 0, 2, -0.3327017, 0, 1
0.02674288, 0, 2, -0.3383269, 0, 1
0.04756787, 0, 2, -0.3487558, 0, 1
0.06839287, 0, 2, -0.3591127, 0, 1
0.08921787, 0, 2, -0.3699765, 0, 1
0.1100429, 0, 2, -0.3802996, 0, 1
0.1308679, 0, 2, -0.3856359, 0, 1
0.1516929, 0, 2, -0.3953977, 0, 1
0.1725179, 0, 2, -0.4047227, 0, 1
0.1933429, 0, 2, -0.4137516, 0, 1
0.2141679, 0, 2, -0.4217672, 0, 1
0.2349929, 0, 2, -0.4258819, 0, 1
0.2558179, 0, 2, -0.433712, 0, 1
0.2766429, 0, 2, -0.4411063, 0, 1
0.2974679, 0, 2, -0.4489236, 0, 1
0.3182929, 0, 2, -0.4568233, 0, 1
0.3391179, 0, 2, -0.4613376, 0, 1
0.3599429, 0, 2, -0.4697065, 0, 1
0.3807679, 0, 2, -0.4779949, 0, 1
0.4015929, 0, 2, -0.4865341, 0, 1
0.4224178, 0, 2, -0.4944181, 0, 1
0.4432428, 0, 2, -0.498455, 0, 1
0.4640678, 0, 2, -0.505352, 0, 1
0.4848928, 0, 2, -0.5123081, 0, 1
0.5057179, 0, 2, -0.5193939, 0, 1
0.5265429, 0, 2, -0.5268116, 0, 1
0.5473679, 0, 2, -0.5305815, 0, 1
0.568193, 0, 2, -0.5382199, 0, 1
0.589018, 0, 2, -0.5457296, 0, 1
0.609843, 0, 2, -0.5533981, 0, 1
0.630668, 0, 2, -0.5608492, 0, 1
0.6514931, 0, 2, -0.5646515, 0, 1
0.6723181, 0, 2, -0.5720472, 0, 1
0.6931431, 0, 2, -0.5799823, 0, 1
0.7139682, 0, 2, -0.5882788, 0, 1
0.7347932, 0, 2, -0.596499, 0, 1
0.7556182, 0, 2, -0.6011639, 0, 1
0.7764432, 0, 2, -0.6098919, 0, 1
0.7972683, 0, 2, -0.619565, 0, 1
0.8180933, 0, 2, -0.629324, 0, 1
0.8389183, 0, 2, -0.638835, 0, 1
0.8597434, 0, 2, -0.6442623, 0, 1
0.8805684, 0, 2, -0.6539969, 0, 1
0.9013934, 0, 2, -0.6642637, 0, 1
0.9222184, 0, 2, -0.6745291, 0, 1
0.9430435, 0, 2, -0.6850605, 0, 1
0.9638685, 0, 2, -0.6906929, 0, 1
0.9846935, 0, 2, -0.7011843, 0, 1
1.005519, -1, 2, -0.7116847, 0, 1
1.026344, -1, 2, -0.7213287, 0, 1
1.047169, -1, 2, -0.7305641, 0, 1
1.067994, -1, 2, -0.7354302, 0, 1
1.088819, -1, 2, -0.7445726, 0, 1
1.109644, -1, 2, -0.7535582, 0, 1
1.130469, -1, 2, -0.7623339, 0, 1
1.151294, -1, 2, -0.7705121, -1, 1
1.172119, -1, 2, -0.7747145, -1, 1
1.192944, -1, 2, -0.7823057, -1, 1
1.213769, -1, 2, -0.7894602, -1, 1
1.234594, -1, 2, -0.7966013, -1, 1
1.255419, -1, 2, -0.8031659, -1, 1
1.276244, -1, 2, -0.8065705, -1, 1
1.297069, -1, 2, -0.8129768, -1, 1
1.317894, -1, 2, -0.8193049, -1, 1
1.338719, -1, 2, -0.8258152, -1, 1
1.359544, -1, 2, -0.8316703, -1, 1
1.380369, -1, 2, -0.8344936, -1, 1
1.401194, -1, 2, -0.8392739, -1, 1
1.422019, -1, 2, -0.843864, -1, 1
1.442844, -1, 2, -0.8480663, -1, 1
1.463669, -1, 2, -0.8516941, -1, 1
1.484494, -1, 2, -0.8537436, -1, 1
1.505319, -1, 2, -0.856452, -1, 1
1.526144, -1, 2, -0.8587594, -1, 1
1.546969, -1, 2, -0.8604827, -1, 1
1.567794, -1, 2, -0.8628511, -1, 1
1.588619, -1, 2, -0.8638825, -1, 1
1.609444, -1, 2, -0.8662395, -1, 1
1.630269, -1, 2, -0.8686538, -1, 1
1.651094, -1, 2, -0.870594, -1, 1
1.671919, -1, 2, -0.8723192, -1, 1
1.692744, -1, 2, -0.8728876, -1, 1
1.71357, -1, 2, -0.8738089, -1, 1
1.734395, -1, 2, -0.8755474, -1, 1
1.75522, -1, 2, -0.8776097, -1, 1
1.776045, -1, 2, -0.8794255, -1, 1
1.79687, -1, 2, -0.8803349, -1, 1
1.817695, -1, 2, -0.8814335, -1, 1
1.83852, -1, 2, -0.8819656, -1, 1
1.859345, -1, 2, -0.8819871, -1, 1
1.88017, -1, 2, -0.8812203, -1, 1
1.900995, -1, 2, -0.8807445, -1, 1
1.92182, -1, 2, -0.8795772, -1, 1
1.942645, -1, 2, -0.8784366, -1, 1
1.96347, -1, 2, -0.8769288, -1, 1
1.984295, -1, 2, -0.8749762, -1, 1
2.00512, -2, 2, -0.872982, -1, 1
2.025945, -2, 2, -0.8719153, -1, 1
2.04677, -2, 2, -0.8697462, -1, 1
2.067595, -2, 2, -0.8674345, -1, 1
2.088419, -2, 2, -0.8650351, -1, 1
2.109244, -2, 2, -0.8639774, -1, 1
2.130069, -2, 2, -0.8598762, -1, 1
2.150894, -2, 2, -0.8571901, -1, 1
2.171719, -2, 2, -0.8568873, -1, 1
2.192544, -2, 2, -0.8563838, -1, 1
2.213369, -2, 2, -0.8546405, -1, 1
2.234194, -2, 2, -0.8529878, -1, 1
2.255019, -2, 2, -0.8522491, -1, 1
2.275844, -2, 2, -0.8509254, -1, 1
2.296669, -2, 2, -0.8489981, -1, 1
2.317493, -2, 2, -0.8474889, -1, 1
2.338318, -2, 2, -0.8469224, -1, 1
2.359143, -2, 2, -0.8445969, -1, 1
2.379968, -2, 2, -0.842206, -1, 1
2.400793, -2, 2, -0.8404522, -1, 1
2.421618, -2, 2, -0.8388023, -1, 1
2.442443, -2, 2, -0.8377895, -1, 1
