car_pos_meter , car_pos_cell, car_speed, ped_pos_meter, ped_pos_cell, ped_speed
-5.125, 5, 1, 3.996696, 5, 1
-5.114625, 5, 1, 3.988693, 5, 1
-5.10425, 5, 1, 3.971973, 5, 1
-5.093875, 5, 1, 3.955771, 5, 1
-5.0835, 5, 1, 3.939322, 5, 1
-5.073125, 5, 1, 3.922573, 5, 1
-4.93825, 4, 1, 3.71946, 4, 1
-4.678874, 4, 1, 3.342648, 4, 1
-4.419498, 4, 2, 2.972699, 3, 1
-3.898876, 3, 2, 2.499642, 3, 1
-3.378253, 3, 2, 2.232686, 2, 1
-2.85763, 2, 2, 2.405777, 3, 1
-2.337008, 2, 2, 2.570322, 3, 1
-1.816384, 1, 2, 2.733809, 3, 1
-1.295758, 1, 2, 2.866, 3, 1
-0.7751323, 0, 2, 2.954503, 3, 1
-0.2545069, 0, 2, 2.976737, 3, 1
0.266118, 0, 2, 2.833138, 3, 1
0.7867434, 0, 2, 2.507972, 3, 1
1.307369, -1, 2, 2.06841, 2, 1
1.827995, -1, 2, 1.606358, 2, 1
2.348619, -2, 2, 1.135937, 1, 1
2.869241, -2, 2, 0.6793747, 0, 1
3.389864, -3, 2, 0.2808151, 0, 1
3.910487, -3, 2, -0.1064739, 0, 1
4.431109, -4, 2, -0.4025793, 0, 1
4.930907, -4, 2, -0.6093955, 0, 1
5.45153, -5, 2, -0.6879463, 0, 1
5.972153, -5, 2, -0.6005001, 0, 1
6.492775, -6, 2, -0.2975397, 0, 1
7.013398, -7, 2, 0.05673885, 0, 1
7.534021, -7, 2, 0.4490347, 0, 1
8.054646, -8, 2, 0.8810503, 1, 1
8.575279, -8, 2, 1.347625, 1, 1
9.095915, -9, 2, 1.830658, 2, 1
9.616549, -9, 2, 2.321079, 3, 1
10.13718, -10, 2, 2.811863, 3, 1
10.65782, -10, 2, 3.304248, 4, 1
