timestamp_sec,frame_id,game_played,yielding,player1discrete,player2discrete,player1yieldprob,player2yieldprob,player1_pose_x,player1_pose_y,player1_pose_z,player1_pose_orient_x,player1_pose_orient_y,player1_pose_orient_z,player1_pose_orient_w,player2_pose_x,player2_pose_y,player2_pose_z,player2_pose_orient_x,player2_pose_orient_y,player2_pose_orient_z,player2_pose_orient_w
1718107486.1096935,map,True,True,5,5,0.612995793784914,0.612995793784914,1.435500144958496,-1.6127663850784302,0.0,0.0,0.0,0.05892566726338371,0.9982623709330789,3.3839501273092285,-6.581987906655758,0.7962850859417163,0.0,0.0,0.0,1.0
1718107486.1604886,map,True,True,5,5,0.612995793784914,0.612995793784914,1.435500144958496,-1.6127663850784302,0.0,0.0,0.0,0.05892566726338371,0.9982623709330789,3.3839501273092285,-6.581987906655758,0.7962850859417163,0.0,0.0,0.0,1.0
1718107486.2106555,map,True,True,5,5,0.612995793784914,0.612995793784914,1.435500144958496,-1.6127663850784302,0.0,0.0,0.0,0.05892566726338371,0.9982623709330789,3.3839501273092285,-6.581987906655758,0.7962850859417163,0.0,0.0,0.0,1.0
1718107486.306076,map,True,True,5,5,0.612995793784914,0.612995793784914,1.435500144958496,-1.6127663850784302,0.0,0.0,0.0,0.05892566726338371,0.9982623709330789,3.3839501273092285,-6.581987906655758,0.7962850859417163,0.0,0.0,0.0,1.0
1718107486.3573515,map,True,True,5,5,0.612995793784914,0.612995793784914,1.435500144958496,-1.6127663850784302,0.0,0.0,0.0,0.05892566726338371,0.9982623709330789,3.3839501273092285,-6.581987906655758,0.7962850859417163,0.0,0.0,0.0,1.0
1718107486.4076722,map,True,False,5,4,0.0,0.0,1.435500144958496,-1.6127663850784302,0.0,0.0,0.0,0.05892566726338371,0.9982623709330789,3.271515690831096,-5.732356056588902,0.7646336471386088,0.0,0.0,0.0,1.0
1718107486.4591255,map,True,False,5,4,0.0,0.0,1.435500144958496,-1.6127663850784302,0.0,0.0,0.0,0.05892566726338371,0.9982623709330789,3.251490185651098,-5.775831315664199,0.7778687792620058,0.0,0.0,0.0,1.0
1718107486.5100853,map,True,False,5,4,0.0,0.0,1.435500144958496,-1.6127663850784302,0.0,0.0,0.0,0.05892566726338371,0.9982623709330789,3.251490185651098,-5.775831315664199,0.7778687792620058,0.0,0.0,0.0,1.0
1718107486.5598824,map,True,False,5,4,0.0,0.0,1.435500144958496,-1.6127663850784302,0.0,0.0,0.0,0.05892566726338371,0.9982623709330789,3.251490185651098,-5.775831315664199,0.7778687792620058,0.0,0.0,0.0,1.0
1718107486.6597733,map,True,False,5,4,0.0,0.0,1.435500144958496,-1.6127663850784302,0.0,0.0,0.0,0.05892566726338371,0.9982623709330789,3.251490185651098,-5.775831315664199,0.7778687792620058,0.0,0.0,0.0,1.0
1718107486.712511,map,True,False,5,4,0.0,0.0,1.435500144958496,-1.6127663850784302,0.0,0.0,0.0,0.05892566726338371,0.9982623709330789,3.251490185651098,-5.775831315664199,0.7778687792620058,0.0,0.0,0.0,1.0
1718107486.761208,map,True,False,5,4,0.0,0.0,1.5481467247009277,-1.6243387460708618,0.0,0.0,0.0,0.05959709421095097,0.9982225147832305,3.3931995856256183,-5.819161420007536,0.7730905145998452,0.0,0.0,0.0,1.0
1718107487.1156514,map,True,False,5,4,0.0,0.0,1.5481467247009277,-1.6243387460708618,0.0,0.0,0.0,0.05959709421095097,0.9982225147832305,3.4688765633790197,-5.466155674019358,0.754277744683213,0.0,0.0,0.0,1.0
1718107487.1661296,map,True,False,5,4,0.0,0.0,1.5481467247009277,-1.6243387460708618,0.0,0.0,0.0,0.05959709421095097,0.9982225147832305,3.4688765633790197,-5.466155674019358,0.754277744683213,0.0,0.0,0.0,1.0
1718107487.2653093,map,True,False,5,4,0.0,0.0,1.5481467247009277,-1.6243387460708618,0.0,0.0,0.0,0.05959709421095097,0.9982225147832305,3.4688765633790197,-5.466155674019358,0.754277744683213,0.0,0.0,0.0,1.0
1718107487.364993,map,True,False,5,4,0.0,0.0,1.5481467247009277,-1.6243387460708618,0.0,0.0,0.0,0.05959709421095097,0.9982225147832305,3.4688765633790197,-5.466155674019358,0.754277744683213,0.0,0.0,0.0,1.0
1718107487.4661672,map,True,False,4,3,0.0,0.0,1.6747550964355469,-1.646315097808838,0.0,0.0,0.0,0.06000563664545495,0.9981980330633,3.402259919359194,-4.814437746332157,0.762319649545767,0.0,0.0,0.0,1.0
1718107487.5671844,map,True,False,4,3,0.0,0.0,1.6747550964355469,-1.646315097808838,0.0,0.0,0.0,0.06000563664545495,0.9981980330633,3.378663452851251,-4.670692532946843,0.7395988622128716,0.0,0.0,0.0,1.0
1718107487.6222277,map,True,False,4,3,0.0,0.0,1.6747550964355469,-1.646315097808838,0.0,0.0,0.0,0.06000563664545495,0.9981980330633,3.378663452851251,-4.670692532946843,0.7395988622128716,0.0,0.0,0.0,1.0
1718107487.720593,map,True,False,4,3,0.0,0.0,1.6747550964355469,-1.646315097808838,0.0,0.0,0.0,0.06000563664545495,0.9981980330633,3.378663452851251,-4.670692532946843,0.7395988622128716,0.0,0.0,0.0,1.0
1718107487.7707875,map,True,False,4,3,0.0,0.0,1.6747550964355469,-1.646315097808838,0.0,0.0,0.0,0.06000563664545495,0.9981980330633,3.378663452851251,-4.670692532946843,0.7395988622128716,0.0,0.0,0.0,1.0
1718107488.121979,map,True,False,4,3,0.0,0.0,1.7644164562225342,-1.6601401567459106,0.0,0.0,0.0,0.060875212625541054,0.9981453804032655,3.477242949357363,-4.4041238786182255,0.748175877387087,0.0,0.0,0.0,1.0
1718107488.221524,map,True,False,4,3,0.0,0.0,1.7644164562225342,-1.6601401567459106,0.0,0.0,0.0,0.060875212625541054,0.9981453804032655,3.4968509416913705,-4.367660616175768,0.7564872962582749,0.0,0.0,0.0,1.0
1718107488.271728,map,True,False,4,3,0.0,0.0,1.7644164562225342,-1.6601401567459106,0.0,0.0,0.0,0.060875212625541054,0.9981453804032655,3.4968509416913705,-4.367660616175768,0.7564872962582749,0.0,0.0,0.0,1.0
1718107488.3701596,map,True,False,4,3,0.0,0.0,1.7644164562225342,-1.6601401567459106,0.0,0.0,0.0,0.060875212625541054,0.9981453804032655,3.4968509416913705,-4.367660616175768,0.7564872962582749,0.0,0.0,0.0,1.0
1718107488.4205308,map,True,False,4,3,0.0,0.0,1.7644164562225342,-1.6601401567459106,0.0,0.0,0.0,0.060875212625541054,0.9981453804032655,3.4968509416913705,-4.367660616175768,0.7564872962582749,0.0,0.0,0.0,1.0
1718107488.4712753,map,True,False,4,3,0.0,0.0,1.7722992897033691,-1.6558148860931396,0.0,0.0,0.0,0.061079272761150896,0.9981329147369031,3.56357782110786,-4.097833166485589,0.7338570251028748,0.0,0.0,0.0,1.0
1718107488.5716,map,True,False,4,3,0.0,0.0,1.7722992897033691,-1.6558148860931396,0.0,0.0,0.0,0.061079272761150896,0.9981329147369031,3.5682172893079316,-4.075383885969264,0.729443579976285,0.0,0.0,0.0,1.0
1718107488.6240857,map,True,False,4,3,0.0,0.0,1.7722992897033691,-1.6558148860931396,0.0,0.0,0.0,0.061079272761150896,0.9981329147369031,3.5682172893079316,-4.075383885969264,0.729443579976285,0.0,0.0,0.0,1.0
1718107488.723017,map,True,False,4,3,0.0,0.0,1.7722992897033691,-1.6558148860931396,0.0,0.0,0.0,0.061079272761150896,0.9981329147369031,3.5682172893079316,-4.075383885969264,0.729443579976285,0.0,0.0,0.0,1.0
1718107488.822604,map,True,False,4,2,0.0,0.0,1.7722992897033691,-1.6558148860931396,0.0,0.0,0.0,0.061079272761150896,0.9981329147369031,3.5295424362702206,-3.685581613942092,0.6806357392354635,0.0,0.0,0.0,1.0
1718107488.8726716,map,True,False,4,2,0.0,0.0,1.7722992897033691,-1.6558148860931396,0.0,0.0,0.0,0.061079272761150896,0.9981329147369031,3.5295424362702206,-3.685581613942092,0.6806357392354635,0.0,0.0,0.0,1.0
1718107488.9722161,map,True,False,4,2,0.0,0.0,1.9479665756225586,-1.6855473518371582,0.0,0.0,0.0,0.06257642312085336,0.9980401712629174,3.5295424362702206,-3.685581613942092,0.6806357392354635,0.0,0.0,0.0,1.0
1718107489.0228364,map,True,False,4,2,0.0,0.0,1.9479665756225586,-1.6855473518371582,0.0,0.0,0.0,0.06257642312085336,0.9980401712629174,3.5295424362702206,-3.685581613942092,0.6806357392354635,0.0,0.0,0.0,1.0
1718107489.1224666,map,True,False,4,2,0.0,0.0,1.9479665756225586,-1.6855473518371582,0.0,0.0,0.0,0.06257642312085336,0.9980401712629174,3.5986683598857767,-3.5759829772492897,0.687074050908153,0.0,0.0,0.0,1.0
1718107489.2222688,map,True,False,4,2,0.0,0.0,1.9479665756225586,-1.6855473518371582,0.0,0.0,0.0,0.06257642312085336,0.9980401712629174,3.5842580501488963,-3.5201571903809903,0.6836764186645286,0.0,0.0,0.0,1.0
1718107489.2750146,map,True,False,4,2,0.0,0.0,1.9479665756225586,-1.6855473518371582,0.0,0.0,0.0,0.06257642312085336,0.9980401712629174,3.5842580501488963,-3.5201571903809903,0.6836764186645286,0.0,0.0,0.0,1.0
1718107489.3728857,map,True,False,3,2,0.0,0.0,2.0262374877929688,-1.6949065923690796,0.0,0.0,0.0,0.06275416934520575,0.9980290181751681,3.5842580501488963,-3.5201571903809903,0.6836764186645286,0.0,0.0,0.0,1.0
1718107489.4741282,map,True,False,3,2,0.0,0.0,2.0262374877929688,-1.6949065923690796,0.0,0.0,0.0,0.06275416934520575,0.9980290181751681,3.650925255292851,-3.3155755250768113,0.6830708962181904,0.0,0.0,0.0,1.0
1718107489.575029,map,True,False,3,2,0.0,0.0,2.0262374877929688,-1.6949065923690796,0.0,0.0,0.0,0.06275416934520575,0.9980290181751681,3.6525286078273833,-3.2909395828226904,0.6830007262847568,0.0,0.0,0.0,1.0
1718107489.6237967,map,True,False,3,2,0.0,0.0,2.0262374877929688,-1.6949065923690796,0.0,0.0,0.0,0.06275416934520575,0.9980290181751681,3.6525286078273833,-3.2909395828226904,0.6830007262847568,0.0,0.0,0.0,1.0
1718107489.723099,map,True,False,3,2,0.0,0.0,2.0262374877929688,-1.6949065923690796,0.0,0.0,0.0,0.06275416934520575,0.9980290181751681,3.6525286078273833,-3.2909395828226904,0.6830007262847568,0.0,0.0,0.0,1.0
1718107489.7775586,map,True,False,3,2,0.0,0.0,2.0262374877929688,-1.6949065923690796,0.0,0.0,0.0,0.06275416934520575,0.9980290181751681,3.6525286078273833,-3.2909395828226904,0.6830007262847568,0.0,0.0,0.0,1.0
1718107489.8250139,map,True,False,3,2,0.0,0.0,2.0262374877929688,-1.6949065923690796,0.0,0.0,0.0,0.06275416934520575,0.9980290181751681,3.7026222846440535,-2.9936304236439164,0.682200189002187,0.0,0.0,0.0,1.0
1718107489.9250164,map,True,False,3,2,0.0,0.0,2.1112046241760254,-1.7068833112716675,0.0,0.0,0.0,0.0627519138425846,0.998029152550461,3.7026222846440535,-2.9936304236439164,0.682200189002187,0.0,0.0,0.0,1.0
1718107489.9786458,map,True,False,3,2,0.0,0.0,2.1112046241760254,-1.7068833112716675,0.0,0.0,0.0,0.0627519138425846,0.998029152550461,3.7026222846440535,-2.9936304236439164,0.682200189002187,0.0,0.0,0.0,1.0
1718107490.0792572,map,True,False,3,2,0.0,0.0,2.1112046241760254,-1.7068833112716675,0.0,0.0,0.0,0.0627519138425846,0.998029152550461,3.7026222846440535,-2.9936304236439164,0.682200189002187,0.0,0.0,0.0,1.0
1718107490.1295693,map,True,False,3,1,0.0,0.0,2.1112046241760254,-1.7068833112716675,0.0,0.0,0.0,0.0627519138425846,0.998029152550461,3.710172919728894,-2.754896739838589,0.681670010177775,0.0,0.0,0.0,1.0
1718107490.1796165,map,True,False,3,1,0.0,0.0,2.1112046241760254,-1.7068833112716675,0.0,0.0,0.0,0.0627519138425846,0.998029152550461,3.7044615677315234,-2.7055585944886817,0.6815524833023495,0.0,0.0,0.0,1.0
1718107490.2293782,map,True,False,3,1,0.0,0.0,2.1112046241760254,-1.7068833112716675,0.0,0.0,0.0,0.0627519138425846,0.998029152550461,3.7044615677315234,-2.7055585944886817,0.6815524833023495,0.0,0.0,0.0,1.0
1718107490.280576,map,True,False,3,1,0.0,0.0,2.1112046241760254,-1.7068833112716675,0.0,0.0,0.0,0.0627519138425846,0.998029152550461,3.7044615677315234,-2.7055585944886817,0.6815524833023495,0.0,0.0,0.0,1.0
1718107490.3796504,map,True,False,3,1,0.0,0.0,2.207689046859741,-1.7251217365264893,0.0,0.0,0.0,0.06306179293010931,0.9980096231514546,3.7044615677315234,-2.7055585944886817,0.6815524833023495,0.0,0.0,0.0,1.0
1718107490.480614,map,True,False,3,1,0.0,0.0,2.207689046859741,-1.7251217365264893,0.0,0.0,0.0,0.06306179293010931,0.9980096231514546,3.7852128348414893,-2.4949650070437963,0.6809960589838664,0.0,0.0,0.0,1.0
1718107490.5307534,map,True,False,3,1,0.0,0.0,2.207689046859741,-1.7251217365264893,0.0,0.0,0.0,0.06306179293010931,0.9980096231514546,3.778650634847121,-2.4469258197892367,0.6808842467800327,0.0,0.0,0.0,1.0
1718107490.5807085,map,True,False,3,1,0.0,0.0,2.207689046859741,-1.7251217365264893,0.0,0.0,0.0,0.06306179293010931,0.9980096231514546,3.778650634847121,-2.4469258197892367,0.6808842467800327,0.0,0.0,0.0,1.0
1718107490.6311336,map,True,False,3,1,0.0,0.0,2.207689046859741,-1.7251217365264893,0.0,0.0,0.0,0.06306179293010931,0.9980096231514546,3.778650634847121,-2.4469258197892367,0.6808842467800327,0.0,0.0,0.0,1.0
1718107490.6812744,map,True,False,3,1,0.0,0.0,2.2837893962860107,-1.7313294410705566,0.0,0.0,0.0,0.06418125664454903,0.9979382509964708,3.778650634847121,-2.4469258197892367,0.6808842467800327,0.0,0.0,0.0,1.0
1718107490.7323725,map,True,False,3,1,0.0,0.0,2.2837893962860107,-1.7313294410705566,0.0,0.0,0.0,0.06418125664454903,0.9979382509964708,3.778650634847121,-2.4469258197892367,0.6808842467800327,0.0,0.0,0.0,1.0
1718107490.8316996,map,True,False,3,1,0.0,0.0,2.2837893962860107,-1.7313294410705566,0.0,0.0,0.0,0.06418125664454903,0.9979382509964708,3.774006353444685,-2.1832887997216988,0.6816575852851172,0.0,0.0,0.0,1.0
1718107490.8816745,map,True,False,3,1,0.0,0.0,2.2837893962860107,-1.7313294410705566,0.0,0.0,0.0,0.06418125664454903,0.9979382509964708,3.774006353444685,-2.1832887997216988,0.6816575852851172,0.0,0.0,0.0,1.0
1718107490.9322858,map,True,False,3,1,0.0,0.0,2.2837893962860107,-1.7313294410705566,0.0,0.0,0.0,0.06418125664454903,0.9979382509964708,3.774006353444685,-2.1832887997216988,0.6816575852851172,0.0,0.0,0.0,1.0
1718107490.9820595,map,True,False,3,1,0.0,0.0,2.2837893962860107,-1.7313294410705566,0.0,0.0,0.0,0.06418125664454903,0.9979382509964708,3.774006353444685,-2.1832887997216988,0.6816575852851172,0.0,0.0,0.0,1.0
1718107491.032765,map,True,False,3,1,0.0,0.0,2.2837893962860107,-1.7313294410705566,0.0,0.0,0.0,0.06418125664454903,0.9979382509964708,3.774006353444685,-2.1832887997216988,0.6816575852851172,0.0,0.0,0.0,1.0
1718107491.1342976,map,True,False,3,1,0.0,0.0,2.2837893962860107,-1.7313294410705566,0.0,0.0,0.0,0.06418125664454903,0.9979382509964708,3.7935106113003982,-2.045107936671515,0.6810495445665534,0.0,0.0,0.0,1.0
1718107491.1832871,map,True,False,3,1,0.0,0.0,2.3615543842315674,-1.7383036613464355,0.0,0.0,0.0,0.06429707854186865,0.9979307999270409,3.8259349192671053,-2.045498981728832,0.6799543134587706,0.0,0.0,0.0,1.0
1718107491.2400582,map,True,False,3,1,0.0,0.0,2.3615543842315674,-1.7383036613464355,0.0,0.0,0.0,0.06429707854186865,0.9979307999270409,3.8259349192671053,-2.045498981728832,0.6799543134587706,0.0,0.0,0.0,1.0
1718107491.3330102,map,True,False,3,1,0.0,0.0,2.3615543842315674,-1.7383036613464355,0.0,0.0,0.0,0.06429707854186865,0.9979307999270409,3.8259349192671053,-2.045498981728832,0.6799543134587706,0.0,0.0,0.0,1.0
1718107491.3830287,map,True,False,3,1,0.0,0.0,2.3615543842315674,-1.7383036613464355,0.0,0.0,0.0,0.06429707854186865,0.9979307999270409,3.8259349192671053,-2.045498981728832,0.6799543134587706,0.0,0.0,0.0,1.0
1718107491.433279,map,True,False,3,1,0.0,0.0,2.3615543842315674,-1.7383036613464355,0.0,0.0,0.0,0.06429707854186865,0.9979307999270409,3.8259349192671053,-2.045498981728832,0.6799543134587706,0.0,0.0,0.0,1.0
1718107491.4844615,map,True,False,3,8,0.0,0.0,2.3875598907470703,-1.7516841888427734,0.0,0.0,0.0,0.0640441834012101,0.9979470608063856,9.563176360385144,-5.611803217933979,0.6861566572016591,0.0,0.0,0.0,1.0
1718107491.5889034,map,True,False,3,8,0.0,0.0,2.3875598907470703,-1.7516841888427734,0.0,0.0,0.0,0.0640441834012101,0.9979470608063856,9.563176360385144,-5.611803217933979,0.6861566572016591,0.0,0.0,0.0,1.0
1718107491.636249,map,True,False,3,8,0.0,0.0,2.3875598907470703,-1.7516841888427734,0.0,0.0,0.0,0.0640441834012101,0.9979470608063856,9.563176360385144,-5.611803217933979,0.6861566572016591,0.0,0.0,0.0,1.0
1718107491.6844819,map,True,False,3,8,0.0,0.0,2.3875598907470703,-1.7516841888427734,0.0,0.0,0.0,0.0640441834012101,0.9979470608063856,9.563176360385144,-5.611803217933979,0.6861566572016591,0.0,0.0,0.0,1.0
1718107491.7349198,map,True,False,3,8,0.0,0.0,2.3875598907470703,-1.7516841888427734,0.0,0.0,0.0,0.0640441834012101,0.9979470608063856,9.563176360385144,-5.611803217933979,0.6861566572016591,0.0,0.0,0.0,1.0
