timestamp_sec,frame_id,game_played,yielding,player1discrete,player2discrete,player1yieldprob,player2yieldprob,player1_pose_x,player1_pose_y,player1_pose_z,player1_pose_orient_x,player1_pose_orient_y,player1_pose_orient_z,player1_pose_orient_w,player2_pose_x,player2_pose_y,player2_pose_z,player2_pose_orient_x,player2_pose_orient_y,player2_pose_orient_z,player2_pose_orient_w
1718106139.7705212,map,True,False,4,6,0.0,0.0,1.6245967149734497,-1.625514030456543,0.0,0.0,0.0,0.037796485007331744,0.9992854575527185,3.3312472041843693,-7.063144776415603,0.8285118635318898,0.0,0.0,0.0,1.0
1718106140.070272,map,True,False,4,5,0.0,0.0,1.6245967149734497,-1.625514030456543,0.0,0.0,0.0,0.037796485007331744,0.9992854575527185,3.332402849778288,-6.408028056217413,0.9305321596161877,0.0,0.0,0.0,1.0
1718106140.1211162,map,True,False,4,5,0.0,0.0,1.6245967149734497,-1.625514030456543,0.0,0.0,0.0,0.037796485007331744,0.9992854575527185,3.332402849778288,-6.408028056217413,0.9305321596161877,0.0,0.0,0.0,1.0
1718106140.219959,map,True,False,4,5,0.0,0.0,1.7383681535720825,-1.6530218124389648,0.0,0.0,0.0,0.037929361657461344,0.9992804173460915,3.332402849778288,-6.408028056217413,0.9305321596161877,0.0,0.0,0.0,1.0
1718106140.2699978,map,True,False,4,5,0.0,0.0,1.7383681535720825,-1.6530218124389648,0.0,0.0,0.0,0.037929361657461344,0.9992804173460915,3.332402849778288,-6.408028056217413,0.9305321596161877,0.0,0.0,0.0,1.0
1718106140.3763618,map,True,False,4,5,0.0,0.0,1.7383681535720825,-1.6530218124389648,0.0,0.0,0.0,0.037929361657461344,0.9992804173460915,3.369704796427709,-6.385685924370312,0.8378139174262869,0.0,0.0,0.0,1.0
1718106140.4247549,map,True,False,4,5,0.0,0.0,1.7383681535720825,-1.6530218124389648,0.0,0.0,0.0,0.037929361657461344,0.9992804173460915,3.431101960452006,-6.661357744686164,0.7803407742479911,0.0,0.0,0.0,1.0
1718106140.4763668,map,True,False,4,5,0.0,0.0,1.7383681535720825,-1.6530218124389648,0.0,0.0,0.0,0.037929361657461344,0.9992804173460915,3.431101960452006,-6.661357744686164,0.7803407742479911,0.0,0.0,0.0,1.0
1718106140.5750759,map,True,False,4,5,0.0,0.0,1.7383681535720825,-1.6530218124389648,0.0,0.0,0.0,0.037929361657461344,0.9992804173460915,3.431101960452006,-6.661357744686164,0.7803407742479911,0.0,0.0,0.0,1.0
1718106140.6253815,map,True,False,4,5,0.0,0.0,1.7383681535720825,-1.6530218124389648,0.0,0.0,0.0,0.037929361657461344,0.9992804173460915,3.431101960452006,-6.661357744686164,0.7803407742479911,0.0,0.0,0.0,1.0
1718106140.6755598,map,True,False,4,5,0.0,0.0,1.7383681535720825,-1.6530218124389648,0.0,0.0,0.0,0.037929361657461344,0.9992804173460915,3.431101960452006,-6.661357744686164,0.7803407742479911,0.0,0.0,0.0,1.0
1718106140.7264686,map,True,False,4,5,0.0,0.0,1.7383681535720825,-1.6530218124389648,0.0,0.0,0.0,0.037929361657461344,0.9992804173460915,3.4826514604886363,-6.25697717651719,0.7930067728507597,0.0,0.0,0.0,1.0
1718106141.07885,map,True,True,4,4,0.5922520728754596,0.5922520728754596,1.8368152379989624,-1.6740204095840454,0.0,0.0,0.0,0.038932331805446196,0.999241854450505,3.473126854181817,-5.671461649082526,0.7427557830042941,0.0,0.0,0.0,1.0
1718106141.1773958,map,True,True,4,4,0.5922520728754596,0.5922520728754596,1.8368152379989624,-1.6740204095840454,0.0,0.0,0.0,0.038932331805446196,0.999241854450505,3.473126854181817,-5.671461649082526,0.7427557830042941,0.0,0.0,0.0,1.0
1718106141.2280302,map,True,True,4,4,0.5922520728754596,0.5922520728754596,1.8368152379989624,-1.6740204095840454,0.0,0.0,0.0,0.038932331805446196,0.999241854450505,3.473126854181817,-5.671461649082526,0.7427557830042941,0.0,0.0,0.0,1.0
1718106141.3285544,map,True,True,4,4,0.5922520728754596,0.5922520728754596,1.8368152379989624,-1.6740204095840454,0.0,0.0,0.0,0.038932331805446196,0.999241854450505,3.473126854181817,-5.671461649082526,0.7427557830042941,0.0,0.0,0.0,1.0
1718106141.4286976,map,True,True,4,4,0.5922520728754596,0.5922520728754596,1.8368152379989624,-1.6740204095840454,0.0,0.0,0.0,0.038932331805446196,0.999241854450505,3.516205049752748,-5.521766465449565,0.7404351859797302,0.0,0.0,0.0,1.0
1718106141.4782145,map,True,False,4,4,0.5922520728754596,0.5922520728754596,1.8368152379989624,-1.6740204095840454,0.0,0.0,0.0,0.038932331805446196,0.999241854450505,3.516205049752748,-5.521766465449565,0.7404351859797302,0.0,0.0,0.0,1.0
1718106141.5781767,map,True,True,4,4,0.5922520728754596,0.5922520728754596,1.959433913230896,-1.7043042182922363,0.0,0.0,0.0,0.03936841559934288,0.9992247646171646,3.516205049752748,-5.521766465449565,0.7404351859797302,0.0,0.0,0.0,1.0
1718106141.628938,map,True,True,4,4,0.5922520728754596,0.5922520728754596,1.959433913230896,-1.7043042182922363,0.0,0.0,0.0,0.03936841559934288,0.9992247646171646,3.516205049752748,-5.521766465449565,0.7404351859797302,0.0,0.0,0.0,1.0
1718106141.728267,map,True,False,4,3,0.0,0.0,1.959433913230896,-1.7043042182922363,0.0,0.0,0.0,0.03936841559934288,0.9992247646171646,3.493971727431517,-4.875067368223467,0.7306384449943104,0.0,0.0,0.0,1.0
1718106142.0786197,map,True,False,4,3,0.0,0.0,1.959433913230896,-1.7043042182922363,0.0,0.0,0.0,0.03936841559934288,0.9992247646171646,3.504043449269804,-4.547455009880449,0.6949081364486438,0.0,0.0,0.0,1.0
1718106142.1786482,map,True,True,3,3,0.6616527499769684,0.6616527499769684,2.0546860694885254,-1.7235665321350098,0.0,0.0,0.0,0.039441318202212104,0.9992218864576612,3.504043449269804,-4.547455009880449,0.6949081364486438,0.0,0.0,0.0,1.0
1718106142.2296662,map,True,True,3,3,0.6616527499769684,0.6616527499769684,2.0546860694885254,-1.7235665321350098,0.0,0.0,0.0,0.039441318202212104,0.9992218864576612,3.504043449269804,-4.547455009880449,0.6949081364486438,0.0,0.0,0.0,1.0
1718106142.3302066,map,True,True,3,3,0.6616527499769684,0.6616527499769684,2.0546860694885254,-1.7235665321350098,0.0,0.0,0.0,0.039441318202212104,0.9992218864576612,3.504043449269804,-4.547455009880449,0.6949081364486438,0.0,0.0,0.0,1.0
1718106142.3819778,map,True,False,3,3,0.6616527499769684,0.6616527499769684,2.0546860694885254,-1.7235665321350098,0.0,0.0,0.0,0.039441318202212104,0.9992218864576612,3.5230186929173897,-4.377488813317866,0.7187167772604022,0.0,0.0,0.0,1.0
1718106142.4343655,map,True,False,3,3,0.6616527499769684,0.6616527499769684,2.0546860694885254,-1.7235665321350098,0.0,0.0,0.0,0.039441318202212104,0.9992218864576612,3.5230186929173897,-4.377488813317866,0.7187167772604022,0.0,0.0,0.0,1.0
1718106142.4817789,map,True,True,3,3,0.6616527499769684,0.6616527499769684,2.0546860694885254,-1.7235665321350098,0.0,0.0,0.0,0.039441318202212104,0.9992218864576612,3.5230186929173897,-4.377488813317866,0.7187167772604022,0.0,0.0,0.0,1.0
1718106142.5343761,map,True,True,3,3,0.6616527499769684,0.6616527499769684,2.0546860694885254,-1.7235665321350098,0.0,0.0,0.0,0.039441318202212104,0.9992218864576612,3.5230186929173897,-4.377488813317866,0.7187167772604022,0.0,0.0,0.0,1.0
1718106142.5820744,map,True,True,3,3,0.6616527499769684,0.6616527499769684,2.0546860694885254,-1.7235665321350098,0.0,0.0,0.0,0.039441318202212104,0.9992218864576612,3.5230186929173897,-4.377488813317866,0.7187167772604022,0.0,0.0,0.0,1.0
1718106142.6332195,map,True,True,3,3,0.6616527499769684,0.6616527499769684,2.0546860694885254,-1.7235665321350098,0.0,0.0,0.0,0.039441318202212104,0.9992218864576612,3.5230186929173897,-4.377488813317866,0.7187167772604022,0.0,0.0,0.0,1.0
1718106142.6834855,map,True,False,3,3,0.6616527499769684,0.6616527499769684,2.1273040771484375,-1.7441471815109253,0.0,0.0,0.0,0.039892047698976384,0.9992039909793905,3.560721917528383,-3.964079927753819,0.7165977451158012,0.0,0.0,0.0,1.0
1718106142.7830026,map,True,False,3,2,0.0,0.0,2.1273040771484375,-1.7441471815109253,0.0,0.0,0.0,0.039892047698976384,0.9992039909793905,3.5516760180251614,-3.914858324188497,0.7123588533611462,0.0,0.0,0.0,1.0
1718106143.0829592,map,True,False,3,2,0.0,0.0,2.1273040771484375,-1.7441471815109253,0.0,0.0,0.0,0.039892047698976384,0.9992039909793905,3.5789310501225593,-3.5944819402592403,0.6897836436685635,0.0,0.0,0.0,1.0
1718106143.1333125,map,True,False,3,2,0.0,0.0,2.1273040771484375,-1.7441471815109253,0.0,0.0,0.0,0.039892047698976384,0.9992039909793905,3.5789310501225593,-3.5944819402592403,0.6897836436685635,0.0,0.0,0.0,1.0
1718106143.1835012,map,True,False,3,2,0.0,0.0,2.1273040771484375,-1.7441471815109253,0.0,0.0,0.0,0.039892047698976384,0.9992039909793905,3.5789310501225593,-3.5944819402592403,0.6897836436685635,0.0,0.0,0.0,1.0
1718106143.2829094,map,True,False,3,2,0.0,0.0,2.1273040771484375,-1.7441471815109253,0.0,0.0,0.0,0.039892047698976384,0.9992039909793905,3.5789310501225593,-3.5944819402592403,0.6897836436685635,0.0,0.0,0.0,1.0
1718106143.3332806,map,True,False,3,2,0.0,0.0,2.209195375442505,-1.762634038925171,0.0,0.0,0.0,0.04000732353034118,0.9991993828418451,3.5789310501225593,-3.5944819402592403,0.6897836436685635,0.0,0.0,0.0,1.0
1718106143.383452,map,True,False,3,2,0.0,0.0,2.209195375442505,-1.762634038925171,0.0,0.0,0.0,0.04000732353034118,0.9991993828418451,3.6168440400168587,-3.3482439420977963,0.6777590774758947,0.0,0.0,0.0,1.0
1718106143.4337838,map,True,False,3,2,0.0,0.0,2.209195375442505,-1.762634038925171,0.0,0.0,0.0,0.04000732353034118,0.9991993828418451,3.6168440400168587,-3.3482439420977963,0.6777590774758947,0.0,0.0,0.0,1.0
1718106143.536362,map,True,False,3,2,0.0,0.0,2.209195375442505,-1.762634038925171,0.0,0.0,0.0,0.04000732353034118,0.9991993828418451,3.6168440400168587,-3.3482439420977963,0.6777590774758947,0.0,0.0,0.0,1.0
1718106143.634955,map,True,False,3,2,0.0,0.0,2.209195375442505,-1.762634038925171,0.0,0.0,0.0,0.04000732353034118,0.9991993828418451,3.6168440400168587,-3.3482439420977963,0.6777590774758947,0.0,0.0,0.0,1.0
1718106143.6888113,map,True,False,3,2,0.0,0.0,2.209195375442505,-1.762634038925171,0.0,0.0,0.0,0.04000732353034118,0.9991993828418451,3.737406761585261,-3.1910628832080765,0.6825449583616419,0.0,0.0,0.0,1.0
1718106143.735674,map,True,False,3,2,0.0,0.0,2.209195375442505,-1.762634038925171,0.0,0.0,0.0,0.04000732353034118,0.9991993828418451,3.756827257683798,-3.0906210026794723,0.6822354491603373,0.0,0.0,0.0,1.0
1718106143.7864735,map,True,False,3,2,0.0,0.0,2.209195375442505,-1.762634038925171,0.0,0.0,0.0,0.04000732353034118,0.9991993828418451,3.756827257683798,-3.0906210026794723,0.6822354491603373,0.0,0.0,0.0,1.0
1718106144.0877063,map,True,False,3,1,0.0,0.0,2.2961623668670654,-1.7925422191619873,0.0,0.0,0.0,0.04046714305352528,0.9991808755122572,3.8481370155030494,-2.673725251256925,0.6828919842797054,0.0,0.0,0.0,1.0
1718106144.1882777,map,True,False,3,1,0.0,0.0,2.2961623668670654,-1.7925422191619873,0.0,0.0,0.0,0.04046714305352528,0.9991808755122572,3.822109526607183,-2.6137476241720345,0.6827217410816394,0.0,0.0,0.0,1.0
1718106144.2399726,map,True,False,3,1,0.0,0.0,2.2961623668670654,-1.7925422191619873,0.0,0.0,0.0,0.04046714305352528,0.9991808755122572,3.822109526607183,-2.6137476241720345,0.6827217410816394,0.0,0.0,0.0,1.0
1718106144.3384395,map,True,False,3,1,0.0,0.0,2.320291519165039,-1.7980546951293945,0.0,0.0,0.0,0.04047304723118184,0.999180636898195,3.822109526607183,-2.6137476241720345,0.6827217410816394,0.0,0.0,0.0,1.0
1718106144.4388912,map,True,False,3,1,0.0,0.0,2.320291519165039,-1.7980546951293945,0.0,0.0,0.0,0.04047304723118184,0.999180636898195,3.870215630489952,-2.2911500510869343,0.6801642285117658,0.0,0.0,0.0,1.0
1718106144.4891868,map,True,False,3,1,0.0,0.0,2.320291519165039,-1.7980546951293945,0.0,0.0,0.0,0.04047304723118184,0.999180636898195,3.870215630489952,-2.2911500510869343,0.6801642285117658,0.0,0.0,0.0,1.0
1718106144.5416653,map,True,False,3,1,0.0,0.0,2.320291519165039,-1.7980546951293945,0.0,0.0,0.0,0.04047304723118184,0.999180636898195,3.870215630489952,-2.2911500510869343,0.6801642285117658,0.0,0.0,0.0,1.0
1718106144.6419518,map,True,False,3,1,0.0,0.0,2.320291519165039,-1.7980546951293945,0.0,0.0,0.0,0.04047304723118184,0.999180636898195,3.870215630489952,-2.2911500510869343,0.6801642285117658,0.0,0.0,0.0,1.0
1718106144.691909,map,True,False,3,1,0.0,0.0,2.320291519165039,-1.7980546951293945,0.0,0.0,0.0,0.04047304723118184,0.999180636898195,3.870215630489952,-2.2911500510869343,0.6801642285117658,0.0,0.0,0.0,1.0
1718106144.7431943,map,True,False,3,1,0.0,0.0,2.320291519165039,-1.7980546951293945,0.0,0.0,0.0,0.04047304723118184,0.999180636898195,3.746841101423227,-2.166011967233221,0.7192467058452939,0.0,0.0,0.0,1.0
