car_pos_meter , car_pos_cell, car_speed, ped_pos_meter, ped_pos_cell, ped_speed
-25.625, 25, 2, 3.749311, 24, 1
-23.02189, 23, 1, 3.644288, 23, 1
-21.72501, 21, 2, 3.328131, 21, 1
-19.12189, 19, 2, 2.908809, 18, 1
-16.51878, 16, 2, 2.406486, 15, 1
-13.91567, 13, 2, 1.861199, 12, 1
-11.31255, 11, 2, 1.301426, 8, 1
-8.709433, 8, 2, 0.7443702, 4, 1
-6.106304, 6, 2, 0.2624738, 1, 1
-3.503175, 3, 2, -0.1614046, -1, 1
-0.9000492, 0, 2, -0.5590057, -3, 1
1.703076, -1, 2, -0.8590145, -5, 1
4.306203, -4, 2, -1.113116, -7, 1
6.909332, -6, 2, -1.382599, -8, 1
9.51246, -9, 2, -1.254209, -8, 1
12.11558, -12, 2, -1.007267, -6, 1
14.71869, -14, 2, -0.9920163, -6, 1
17.3218, -17, 2, -1.046229, -6, 1
