car_pos_meter , car_pos_cell, car_speed, ped_pos_meter, ped_pos_cell, ped_speed
-3.727273, 3, 2, 3.988298, 3, 1
-3.712127, 3, 1, 3.973197, 3, 1
-3.704582, 3, 2, 3.957909, 3, 1
-3.689436, 3, 1, 3.950114, 3, 1
-3.681891, 3, 2, 3.93414, 3, 1
-3.666746, 3, 2, 3.91831, 3, 1
-3.6516, 3, 2, 3.902751, 3, 1
-3.636455, 3, 1, 3.887819, 3, 1
-3.628909, 3, 1, 3.880415, 3, 1
-3.621364, 3, 1, 3.866259, 3, 1
-3.613818, 3, 1, 3.852417, 3, 1
-3.606273, 3, 1, 3.83916, 3, 1
-3.598727, 3, 1, 3.826213, 3, 1
-3.591182, 3, 1, 3.819738, 3, 1
-3.583637, 3, 2, 3.806858, 3, 1
-3.568491, 3, 2, 3.793676, 3, 1
-3.553346, 3, 1, 3.781242, 3, 1
-3.5458, 3, 1, 3.76871, 3, 1
-3.538255, 3, 1, 3.762308, 3, 1
-3.530709, 3, 2, 3.749904, 3, 1
-3.515564, 3, 1, 3.737108, 3, 1
-3.508018, 3, 2, 3.724353, 3, 1
-3.492873, 3, 1, 3.711648, 3, 1
-3.485328, 3, 1, 3.704938, 3, 1
-3.477782, 3, 2, 3.692029, 3, 1
-3.462637, 3, 1, 3.678775, 3, 1
-3.455091, 3, 1, 3.665801, 3, 1
-3.447546, 3, 1, 3.652401, 3, 1
-3.44, 3, 1, 3.645511, 3, 1
-3.432455, 3, 2, 3.631861, 3, 1
-3.41731, 3, 1, 3.617659, 3, 1
-3.409764, 3, 2, 3.603169, 3, 1
-3.394619, 3, 1, 3.588536, 3, 1
-3.387073, 3, 2, 3.580861, 3, 1
-3.371928, 3, 2, 3.565325, 3, 1
-3.356782, 3, 1, 3.549328, 3, 1
-3.349237, 3, 1, 3.532972, 3, 1
-3.341691, 3, 1, 3.516258, 3, 1
-3.334146, 3, 1, 3.507675, 3, 1
-3.326601, 3, 2, 3.490524, 3, 1
-3.311455, 3, 1, 3.472484, 3, 1
-3.30391, 3, 1, 3.453446, 3, 1
-3.296364, 3, 1, 3.433858, 3, 1
-3.288819, 3, 2, 3.423555, 3, 1
-3.273673, 3, 1, 3.402643, 3, 1
-3.266128, 3, 1, 3.381136, 3, 1
-3.258582, 3, 1, 3.358749, 3, 1
-3.251037, 3, 2, 3.336888, 3, 1
-3.235892, 3, 2, 3.32573, 2, 1
-3.220746, 3, 2, 3.302795, 2, 1
-3.205601, 3, 2, 3.279977, 2, 1
-3.190455, 3, 2, 3.256946, 2, 1
-3.17531, 3, 2, 3.235328, 2, 1
-3.160165, 3, 2, 3.224902, 2, 1
-3.145019, 3, 2, 3.205384, 2, 1
-3.129874, 3, 2, 3.187037, 2, 1
-3.114728, 3, 2, 3.169603, 2, 1
-3.099583, 3, 2, 3.15399, 2, 1
-3.084438, 3, 2, 3.146164, 2, 1
-3.069292, 3, 2, 3.130599, 2, 1
-3.054147, 3, 2, 3.115824, 2, 1
-3.039001, 3, 2, 3.100728, 2, 1
-3.023856, 3, 2, 3.085609, 2, 1
-3.008711, 3, 2, 3.078185, 2, 1
-2.993565, 2, 1, 3.063557, 2, 1
-2.98602, 2, 1, 3.048812, 2, 1
-2.978474, 2, 2, 3.033595, 2, 1
-2.963329, 2, 2, 3.018417, 2, 1
-2.948184, 2, 2, 3.010715, 2, 1
-2.933038, 2, 2, 2.995164, 2, 1
-2.917893, 2, 1, 2.9797, 2, 1
-2.910347, 2, 1, 2.96343, 2, 1
-2.902802, 2, 1, 2.947052, 2, 1
-2.895256, 2, 2, 2.938645, 2, 1
-2.880111, 2, 1, 2.921353, 2, 1
-2.872566, 2, 1, 2.903698, 2, 1
-2.86502, 2, 2, 2.88511, 2, 1
-2.849875, 2, 2, 2.866026, 2, 1
-2.834729, 2, 2, 2.856342, 2, 1
-2.819584, 2, 1, 2.836602, 2, 1
-2.812038, 2, 2, 2.816664, 2, 1
-2.796893, 2, 1, 2.795882, 2, 1
-2.789348, 2, 1, 2.774839, 2, 1
-2.781802, 2, 2, 2.75393, 2, 1
-2.766657, 2, 1, 2.743138, 2, 1
-2.759111, 2, 2, 2.721905, 2, 1
-2.743966, 2, 2, 2.70028, 2, 1
-2.728821, 2, 2, 2.678503, 2, 1
-2.713675, 2, 1, 2.667973, 2, 1
-2.70613, 2, 1, 2.646621, 2, 1
-2.698584, 2, 2, 2.625753, 2, 1
-2.683439, 2, 2, 2.605131, 2, 1
-2.668293, 2, 2, 2.585097, 2, 1
-2.653148, 2, 1, 2.575571, 2, 1
-2.645602, 2, 2, 2.556558, 2, 1
-2.630457, 2, 2, 2.537981, 2, 1
-2.615312, 2, 2, 2.519166, 2, 1
-2.600166, 2, 1, 2.499821, 2, 1
-2.592621, 2, 1, 2.490553, 2, 1
-2.585075, 2, 1, 2.471922, 2, 1
-2.57753, 2, 1, 2.453966, 2, 1
-2.569984, 2, 1, 2.436487, 2, 1
-2.562439, 2, 2, 2.418269, 2, 1
-2.547294, 2, 1, 2.409566, 2, 1
-2.539748, 2, 2, 2.391711, 2, 1
-2.524603, 2, 2, 2.373986, 2, 1
-2.509457, 2, 2, 2.356317, 2, 1
-2.494312, 2, 1, 2.33738, 2, 1
-2.486767, 2, 1, 2.318764, 2, 1
-2.479221, 2, 2, 2.308823, 2, 1
-2.464076, 2, 2, 2.289636, 2, 1
-2.44893, 2, 2, 2.269959, 2, 1
-2.433785, 2, 2, 2.24958, 2, 1
-2.418639, 2, 1, 2.229082, 2, 1
-2.411094, 2, 2, 2.218839, 1, 1
-2.395949, 2, 2, 2.198461, 1, 1
-2.380803, 2, 2, 2.177253, 1, 1
-2.365658, 2, 2, 2.156118, 1, 1
-2.350513, 2, 2, 2.145506, 1, 1
-2.335367, 2, 2, 2.123572, 1, 1
-2.320222, 2, 2, 2.100871, 1, 1
-2.305076, 2, 2, 2.077482, 1, 1
-2.289931, 2, 2, 2.054252, 1, 1
-2.274786, 2, 2, 2.042633, 1, 1
-2.25964, 2, 2, 2.018919, 1, 1
-2.244495, 2, 2, 1.994889, 1, 1
-2.229349, 2, 2, 1.97129, 1, 1
-2.214204, 2, 2, 1.948018, 1, 1
-2.199059, 2, 2, 1.92597, 1, 1
-2.183913, 2, 2, 1.915111, 1, 1
-2.168768, 2, 2, 1.895743, 1, 1
-2.153622, 2, 2, 1.877027, 1, 1
-2.138477, 2, 2, 1.858907, 1, 1
-2.123332, 2, 2, 1.849982, 1, 1
-2.108186, 2, 2, 1.831803, 1, 1
-2.093041, 2, 2, 1.814285, 1, 1
-2.077895, 2, 2, 1.79695, 1, 1
-2.06275, 2, 2, 1.77986, 1, 1
-2.047605, 2, 2, 1.762928, 1, 1
-2.032459, 2, 2, 1.754057, 1, 1
-2.017314, 2, 2, 1.737323, 1, 1
-2.002168, 2, 2, 1.720289, 1, 1
-1.987023, 1, 2, 1.703073, 1, 1
-1.971878, 1, 2, 1.694577, 1, 1
-1.956732, 1, 2, 1.676641, 1, 1
-1.941587, 1, 2, 1.65866, 1, 1
-1.926442, 1, 2, 1.640378, 1, 1
-1.911296, 1, 2, 1.6216, 1, 1
-1.896151, 1, 2, 1.612198, 1, 1
-1.881005, 1, 2, 1.593124, 1, 1
-1.86586, 1, 2, 1.573916, 1, 1
-1.850715, 1, 2, 1.554366, 1, 1
-1.835569, 1, 2, 1.533995, 1, 1
-1.820424, 1, 2, 1.513535, 1, 1
-1.805278, 1, 2, 1.50298, 1, 1
-1.790133, 1, 2, 1.481828, 1, 1
-1.774988, 1, 2, 1.460013, 1, 1
-1.759842, 1, 2, 1.437857, 1, 1
-1.744697, 1, 2, 1.416374, 1, 1
-1.729551, 1, 2, 1.405426, 1, 1
-1.714406, 1, 2, 1.384668, 1, 1
-1.699261, 1, 2, 1.363169, 1, 1
-1.684115, 1, 2, 1.342903, 1, 1
-1.66897, 1, 2, 1.32184, 1, 1
-1.653825, 1, 2, 1.311506, 1, 1
-1.638679, 1, 2, 1.291174, 1, 1
-1.623534, 1, 2, 1.271275, 1, 1
-1.608388, 1, 2, 1.251318, 1, 1
-1.593243, 1, 2, 1.232696, 1, 1
-1.578098, 1, 2, 1.223248, 1, 1
-1.562952, 1, 2, 1.204308, 1, 1
-1.547807, 1, 2, 1.185338, 1, 1
-1.532661, 1, 2, 1.166823, 1, 1
-1.517516, 1, 2, 1.149101, 1, 1
-1.502371, 1, 2, 1.140477, 1, 1
-1.487225, 1, 2, 1.12304, 1, 1
-1.47208, 1, 2, 1.105639, 0, 1
-1.456934, 1, 2, 1.08814, 0, 1
-1.441789, 1, 2, 1.071105, 0, 1
-1.426643, 1, 2, 1.06257, 0, 1
-1.411498, 1, 2, 1.045562, 0, 1
-1.396353, 1, 2, 1.027982, 0, 1
-1.381207, 1, 2, 1.010019, 0, 1
-1.366062, 1, 2, 0.9923582, 0, 1
-1.350916, 1, 2, 0.9832025, 0, 1
-1.335771, 1, 2, 0.9644127, 0, 1
-1.320625, 1, 2, 0.9450858, 0, 1
-1.30548, 1, 2, 0.925293, 0, 1
-1.290334, 1, 2, 0.9048753, 0, 1
-1.275189, 1, 2, 0.894485, 0, 1
-1.260043, 1, 2, 0.8739991, 0, 1
-1.244898, 1, 2, 0.8526733, 0, 1
-1.229752, 1, 2, 0.8305173, 0, 1
-1.214607, 1, 2, 0.807934, 0, 1
-1.199461, 1, 2, 0.796262, 0, 1
-1.184316, 1, 2, 0.7716613, 0, 1
-1.16917, 1, 2, 0.7468445, 0, 1
-1.154025, 1, 2, 0.7221372, 0, 1
-1.13888, 1, 2, 0.6973867, 0, 1
-1.123734, 1, 2, 0.6845052, 0, 1
-1.108589, 1, 2, 0.6594269, 0, 1
-1.093443, 1, 2, 0.6343157, 0, 1
-1.078298, 1, 2, 0.610306, 0, 1
-1.063152, 1, 2, 0.5875981, 0, 1
-1.048007, 1, 2, 0.57688, 0, 1
-1.032861, 1, 2, 0.5562131, 0, 1
-1.017716, 1, 2, 0.5364459, 0, 1
-1.00257, 1, 2, 0.5178797, 0, 1
-0.9874248, 0, 2, 0.4998388, 0, 1
-0.9722793, 0, 2, 0.4909782, 0, 1
-0.9571338, 0, 2, 0.4733002, 0, 1
-0.9419883, 0, 2, 0.4558625, 0, 1
-0.9268429, 0, 2, 0.4386063, 0, 1
-0.9116974, 0, 2, 0.4212761, 0, 1
-0.8965519, 0, 2, 0.4126644, 0, 1
-0.8814064, 0, 2, 0.3959599, 0, 1
-0.8662609, 0, 2, 0.3790574, 0, 1
-0.8511155, 0, 2, 0.3616362, 0, 1
-0.83597, 0, 2, 0.3439209, 0, 1
-0.8208246, 0, 2, 0.3347759, 0, 1
-0.8056791, 0, 2, 0.3164244, 0, 1
-0.7905336, 0, 2, 0.2977166, 0, 1
-0.7753881, 0, 2, 0.2788026, 0, 1
-0.7602426, 0, 2, 0.25934, 0, 1
-0.7450972, 0, 2, 0.2495041, 0, 1
-0.7299517, 0, 2, 0.2295597, 0, 1
-0.7148062, 0, 2, 0.2094278, 0, 1
-0.6996607, 0, 2, 0.1889782, 0, 1
-0.6845152, 0, 2, 0.1681902, 0, 1
-0.6693698, 0, 2, 0.1575923, 0, 1
-0.6542243, 0, 2, 0.1360054, 0, 1
-0.6390789, 0, 2, 0.1132965, 0, 1
-0.6239334, 0, 2, 0.08964586, 0, 1
-0.6087879, 0, 2, 0.06428909, 0, 1
-0.5936424, 0, 2, 0.05105925, 0, 1
-0.5784969, 0, 2, 0.02340007, 0, 1
-0.5633515, 0, 2, -0.004858971, 0, 1
-0.548206, 0, 2, -0.03256607, 0, 1
-0.5330605, 0, 2, -0.05930901, 0, 1
-0.517915, 0, 2, -0.07249355, 0, 1
-0.5027695, 0, 2, -0.09806728, 0, 1
-0.4876241, 0, 2, -0.1227036, 0, 1
-0.4724786, 0, 2, -0.1462913, 0, 1
-0.4573331, 0, 2, -0.1689239, 0, 1
-0.4421877, 0, 2, -0.1796484, 0, 1
-0.4270422, 0, 2, -0.2007065, 0, 1
-0.4118967, 0, 2, -0.2199793, 0, 1
-0.3967512, 0, 2, -0.2387509, 0, 1
-0.3816057, 0, 2, -0.2569466, 0, 1
-0.3664603, 0, 2, -0.2661266, 0, 1
-0.3513148, 0, 2, -0.2836647, 0, 1
-0.3361694, 0, 2, -0.3008265, 0, 1
-0.3210239, 0, 2, -0.3178625, 0, 1
-0.3058785, 0, 2, -0.334527, 0, 1
-0.290733, 0, 2, -0.3423128, 0, 1
-0.2755876, 0, 2, -0.3580818, 0, 1
-0.2604421, 0, 2, -0.3737698, 0, 1
-0.2452967, 0, 2, -0.3894892, 0, 1
-0.2301512, 0, 2, -0.4056301, 0, 1
-0.2150057, 0, 2, -0.4136629, 0, 1
-0.1998603, 0, 2, -0.4303045, 0, 1
-0.1847148, 0, 2, -0.4464827, 0, 1
-0.1695694, 0, 2, -0.4627466, 0, 1
-0.1544239, 0, 2, -0.4791079, 0, 1
-0.1392785, 0, 2, -0.487555, 0, 1
-0.124133, 0, 2, -0.5049334, 0, 1
-0.1089876, 0, 2, -0.5212088, 0, 1
-0.09384212, 0, 2, -0.5382519, 0, 1
-0.07869666, 0, 2, -0.555438, 0, 1
-0.06355121, 0, 2, -0.5641022, 0, 1
-0.04840576, 0, 2, -0.5814152, 0, 1
-0.0332603, 0, 2, -0.599134, 0, 1
-0.01811485, 0, 2, -0.6170511, 0, 1
-0.002969395, 0, 2, -0.6352921, 0, 1
0.01217606, 0, 2, -0.6451488, 0, 1
0.02732151, 0, 2, -0.6641436, 0, 1
0.04246696, 0, 2, -0.6822519, 0, 1
0.05761242, 0, 2, -0.7004967, 0, 1
0.07275787, 0, 2, -0.7180195, 0, 1
0.08790333, 0, 2, -0.7266521, 0, 1
0.1030488, 0, 2, -0.7453499, 0, 1
0.1181942, 0, 2, -0.7620897, 0, 1
0.1333397, 0, 2, -0.778461, 0, 1
0.1484851, 0, 2, -0.794136, 0, 1
0.1636306, 0, 2, -0.8091869, 0, 1
0.178776, 0, 2, -0.816617, 0, 1
0.1939215, 0, 2, -0.8315721, 0, 1
0.209067, 0, 2, -0.846334, 0, 1
0.2242124, 0, 2, -0.8612175, 0, 1
0.2393579, 0, 2, -0.8755531, 0, 1
0.2545033, 0, 2, -0.8830843, 0, 1
0.2696488, 0, 2, -0.8976474, 0, 1
0.2847942, 0, 2, -0.9119396, 0, 1
0.2999397, 0, 2, -0.9263592, 0, 1
0.3150851, 0, 2, -0.9406357, 0, 1
0.3302306, 0, 2, -0.9480505, 0, 1
0.345376, 0, 2, -0.9625483, 0, 1
0.3605215, 0, 2, -0.9767814, 0, 1
0.375667, 0, 2, -0.9914513, 0, 1
0.3908124, 0, 2, -1.005945, 0, 1
0.4059579, 0, 2, -1.013365, 0, 1
0.4211034, 0, 2, -1.028131, 0, 1
0.4362489, 0, 2, -1.042274, 0, 1
0.4513943, 0, 2, -1.056177, 0, 1
0.4665398, 0, 2, -1.062853, 0, 1
0.4816853, 0, 2, -1.075578, 0, 1
0.4968308, 0, 2, -1.087135, 0, 1
0.5119762, 0, 2, -1.098176, 0, 1
0.5271217, 0, 2, -1.108656, 0, 1
0.5422672, 0, 2, -1.11879, -1, 1
0.5574127, 0, 2, -1.12363, -1, 1
0.5725582, 0, 2, -1.133817, -1, 1
0.5877036, 0, 2, -1.143786, -1, 1
0.6028491, 0, 2, -1.152411, -1, 1
0.6179945, 0, 2, -1.156127, -1, 1
0.63314, 0, 2, -1.162849, -1, 1
0.6482855, 0, 2, -1.168283, -1, 1
0.663431, 0, 2, -1.173484, -1, 1
0.6785765, 0, 2, -1.178524, -1, 1
0.693722, 0, 2, -1.181056, -1, 1
0.7088674, 0, 2, -1.185892, -1, 1
0.7240129, 0, 2, -1.190602, -1, 1
0.7391584, 0, 2, -1.195145, -1, 1
0.7543039, 0, 2, -1.199255, -1, 1
0.7694493, 0, 2, -1.201118, -1, 1
0.7845948, 0, 2, -1.20479, -1, 1
0.7997403, 0, 2, -1.207513, -1, 1
0.8148857, 0, 2, -1.210043, -1, 1
0.8300312, 0, 2, -1.212342, -1, 1
0.8451767, 0, 2, -1.214372, -1, 1
0.8603222, 0, 2, -1.215588, -1, 1
0.8754677, 0, 2, -1.217475, -1, 1
0.8906131, 0, 2, -1.219508, -1, 1
0.9057586, 0, 2, -1.221152, -1, 1
0.9209041, 0, 2, -1.22187, -1, 1
0.9360495, 0, 2, -1.223825, -1, 1
0.951195, 0, 2, -1.225637, -1, 1
0.9663405, 0, 2, -1.227376, -1, 1
0.981486, 0, 2, -1.229458, -1, 1
0.9966314, 0, 2, -1.229485, -1, 1
1.011777, -1, 2, -1.230782, -1, 1
1.026922, -1, 2, -1.231911, -1, 1
1.042068, -1, 2, -1.232691, -1, 1
1.057213, -1, 2, -1.233813, -1, 1
1.072359, -1, 2, -1.234129, -1, 1
1.087504, -1, 2, -1.235029, -1, 1
1.10265, -1, 2, -1.235326, -1, 1
1.117795, -1, 2, -1.23623, -1, 1
1.132941, -1, 2, -1.237022, -1, 1
1.148086, -1, 2, -1.239057, -1, 1
1.163232, -1, 2, -1.241152, -1, 1
1.178377, -1, 2, -1.243546, -1, 1
1.193523, -1, 2, -1.244828, -1, 1
1.208668, -1, 2, -1.244357, -1, 1
1.223814, -1, 2, -1.243583, -1, 1
1.238959, -1, 2, -1.242201, -1, 1
1.254104, -1, 2, -1.240667, -1, 1
1.26925, -1, 2, -1.238867, -1, 1
1.284395, -1, 2, -1.236077, -1, 1
1.299541, -1, 2, -1.231907, -1, 1
1.314686, -1, 2, -1.229814, -1, 1
1.329832, -1, 2, -1.225061, -1, 1
1.344977, -1, 2, -1.219823, -1, 1
1.360123, -1, 2, -1.214096, -1, 1
1.375268, -1, 2, -1.21089, -1, 1
1.390414, -1, 2, -1.203698, -1, 1
1.405559, -1, 2, -1.196422, -1, 1
1.420705, -1, 2, -1.189417, -1, 1
1.43585, -1, 2, -1.182348, -1, 1
1.450996, -1, 2, -1.175517, -1, 1
1.466141, -1, 2, -1.172199, -1, 1
1.481287, -1, 2, -1.165731, -1, 1
1.496432, -1, 2, -1.159415, -1, 1
1.511577, -1, 2, -1.15295, -1, 1
1.526723, -1, 2, -1.146088, -1, 1
1.541868, -1, 2, -1.142553, -1, 1
1.557013, -1, 2, -1.135338, -1, 1
1.572159, -1, 2, -1.131682, -1, 1
1.587304, -1, 2, -1.119091, -1, 1
1.60245, -1, 2, -1.110803, 0, 1
1.617595, -1, 2, -1.100378, 0, 1
1.63274, -1, 2, -1.088396, 0, 1
1.647886, -1, 2, -1.083093, 0, 1
1.663031, -1, 2, -1.069963, 0, 1
1.678177, -1, 2, -1.057665, 0, 1
1.693322, -1, 2, -1.042717, 0, 1
1.708467, -1, 2, -1.027712, 0, 1
1.723613, -1, 2, -1.021201, 0, 1
1.738758, -1, 2, -1.005334, 0, 1
1.753904, -1, 2, -0.9906206, 0, 1
1.769049, -1, 2, -0.9770617, 0, 1
1.784194, -1, 2, -0.9705343, 0, 1
1.79934, -1, 2, -0.9548874, 0, 1
1.814485, -1, 2, -0.9394283, 0, 1
1.82963, -1, 2, -0.9261856, 0, 1
1.844776, -1, 2, -0.9168019, 0, 1
1.859921, -1, 2, -0.9022408, 0, 1
1.875067, -1, 2, -0.8900137, 0, 1
1.890212, -1, 2, -0.8767123, 0, 1
1.905357, -1, 2, -0.8653064, 0, 1
1.920503, -1, 2, -0.8593326, 0, 1
1.935648, -1, 2, -0.8485832, 0, 1
1.950794, -1, 2, -0.8389554, 0, 1
1.965939, -1, 2, -0.8290462, 0, 1
1.981084, -1, 2, -0.8198404, 0, 1
1.99623, -1, 2, -0.8149252, 0, 1
2.011375, -2, 2, -0.8043809, 0, 1
2.02652, -2, 2, -0.7949438, 0, 1
2.041666, -2, 2, -0.7849979, 0, 1
2.056811, -2, 2, -0.7743726, 0, 1
2.071957, -2, 2, -0.7692041, 0, 1
2.087102, -2, 2, -0.7581472, 0, 1
2.102247, -2, 2, -0.7468901, 0, 1
2.117393, -2, 2, -0.7351522, 0, 1
2.132538, -2, 2, -0.7291241, 0, 1
2.147684, -2, 2, -0.716671, 0, 1
2.162829, -2, 2, -0.6975565, 0, 1
2.177974, -2, 2, -0.6909375, 0, 1
2.19312, -2, 2, -0.6779509, 0, 1
2.208265, -2, 2, -0.6645508, 0, 1
2.223411, -2, 2, -0.6507788, 0, 1
2.238556, -2, 2, -0.6368065, 0, 1
2.253701, -2, 2, -0.6295061, 0, 1
2.268847, -2, 2, -0.6147852, 0, 1
2.283992, -2, 2, -0.5998206, 0, 1
2.299137, -2, 2, -0.5841584, 0, 1
2.314283, -2, 2, -0.5673995, 0, 1
2.329428, -2, 2, -0.55934, 0, 1
2.344574, -2, 2, -0.5428042, 0, 1
2.359719, -2, 2, -0.5263591, 0, 1
