car_pos_meter , car_pos_cell, car_speed, ped_pos_meter, ped_pos_cell, ped_speed
-41, 41, 2, 1.14, 11, 1
-11.3453, 11, 2, 4.097602, 40, 1
-11.1787, 11, 2, 4.089477, 40, 1
-11.0121, 11, 2, 4.080057, 40, 1
-7.680097, 7, 2, 3.919349, 39, 1
0.6499078, 0, 2, 3.528345, 35, 1
8.979915, -8, 2, 3.005916, 30, 1
17.30992, -17, 2, 2.113638, 21, 1
25.63988, -25, 2, 1.166781, 11, 1
33.96984, -33, 2, 0.2929657, 2, 1
42.29981, -42, 2, -0.4313483, -4, 1
50.62977, -50, 2, -0.9003844, -9, 1
58.95974, -58, 2, -0.9709544, -9, 1
67.28977, -67, 2, -0.9962263, -9, 1
