car_pos_meter , car_pos_cell, car_speed, ped_pos_meter, ped_pos_cell, ped_speed
-41, 41, 2, 4.096888, 40, 1
-40.8334, 40, 2, 4.091247, 40, 1
-40.6668, 40, 2, 4.080276, 40, 1
-40.5002, 40, 2, 4.068414, 40, 1
-40.3336, 40, 2, 4.056024, 40, 1
-40.167, 40, 2, 4.043445, 40, 1
-40.0004, 40, 2, 4.036818, 40, 1
-39.83381, 39, 2, 4.023315, 40, 1
-39.66721, 39, 2, 4.009205, 40, 1
-39.50061, 39, 2, 3.994593, 39, 1
-39.33401, 39, 2, 3.980225, 39, 1
-39.16741, 39, 2, 3.972299, 39, 1
-39.00081, 39, 2, 3.956919, 39, 1
-38.83421, 38, 2, 3.940629, 39, 1
-38.66761, 38, 2, 3.923879, 39, 1
-38.50101, 38, 2, 3.907241, 39, 1
-38.33441, 38, 2, 3.898268, 38, 1
-38.16781, 38, 2, 3.879869, 38, 1
-38.00121, 38, 2, 3.860781, 38, 1
-37.83461, 37, 2, 3.841585, 38, 1
-37.66801, 37, 2, 3.822833, 38, 1
-37.50142, 37, 2, 3.813187, 38, 1
-37.33482, 37, 2, 3.795139, 37, 1
-37.16822, 37, 2, 3.777308, 37, 1
-37.00162, 37, 2, 3.760259, 37, 1
-36.83502, 36, 2, 3.743524, 37, 1
-36.66842, 36, 2, 3.726352, 37, 1
-36.50182, 36, 2, 3.717879, 37, 1
-36.33522, 36, 2, 3.700335, 37, 1
-36.16862, 36, 2, 3.682579, 36, 1
-36.00202, 36, 2, 3.67415, 36, 1
-35.83542, 35, 2, 3.656617, 36, 1
-35.66882, 35, 2, 3.639942, 36, 1
-35.50222, 35, 2, 3.62317, 36, 1
-35.33562, 35, 2, 3.606027, 36, 1
-35.16903, 35, 2, 3.589208, 35, 1
-35.00243, 35, 2, 3.580214, 35, 1
-34.83583, 34, 2, 3.571434, 35, 1
-34.66923, 34, 2, 3.544548, 35, 1
-34.50263, 34, 2, 3.524912, 35, 1
-34.33603, 34, 2, 3.505438, 35, 1
-34.16943, 34, 2, 3.494941, 34, 1
-34.00283, 34, 2, 3.474511, 34, 1
-33.83623, 33, 2, 3.452983, 34, 1
-33.66963, 33, 2, 3.442298, 34, 1
-33.50303, 33, 2, 3.420056, 34, 1
-33.33643, 33, 2, 3.397432, 33, 1
-33.16983, 33, 2, 3.385793, 33, 1
-33.00323, 33, 2, 3.362045, 33, 1
-32.83664, 32, 2, 3.338051, 33, 1
-32.67004, 32, 2, 3.314501, 33, 1
-32.50344, 32, 2, 3.290871, 32, 1
-32.33684, 32, 2, 3.279028, 32, 1
-32.17024, 32, 2, 3.255003, 32, 1
-32.00364, 32, 2, 3.231866, 32, 1
-31.83704, 31, 2, 3.209921, 32, 1
-31.67044, 31, 2, 3.198969, 31, 1
-31.50384, 31, 2, 3.178157, 31, 1
-31.33724, 31, 2, 3.157124, 31, 1
-31.17064, 31, 2, 3.135991, 31, 1
-31.00404, 31, 2, 3.115407, 31, 1
-30.83744, 30, 2, 3.094664, 30, 1
-30.67085, 30, 2, 3.084495, 30, 1
-30.50425, 30, 2, 3.064567, 30, 1
-30.33765, 30, 2, 3.04452, 30, 1
-30.17105, 30, 2, 3.024613, 30, 1
-30.00445, 30, 2, 3.014503, 30, 1
-29.83785, 29, 2, 2.994504, 29, 1
-29.67125, 29, 2, 2.974106, 29, 1
-29.50465, 29, 2, 2.953662, 29, 1
-29.33805, 29, 2, 2.932993, 29, 1
-29.17145, 29, 2, 2.922683, 29, 1
-29.00485, 29, 2, 2.902439, 29, 1
-28.83825, 28, 2, 2.882061, 28, 1
-28.67165, 28, 2, 2.861551, 28, 1
-28.50505, 28, 2, 2.851131, 28, 1
-28.33846, 28, 2, 2.829901, 28, 1
-28.17186, 28, 2, 2.808415, 28, 1
-28.00526, 28, 2, 2.786377, 27, 1
-27.83866, 27, 2, 2.764678, 27, 1
-27.67206, 27, 2, 2.742437, 27, 1
-27.50546, 27, 2, 2.731175, 27, 1
-27.33886, 27, 2, 2.708466, 27, 1
-27.17226, 27, 2, 2.685745, 26, 1
-27.00566, 27, 2, 2.662798, 26, 1
-26.83906, 26, 2, 2.640023, 26, 1
-26.67246, 26, 2, 2.629062, 26, 1
-26.50586, 26, 2, 2.607465, 26, 1
-26.33926, 26, 2, 2.58628, 25, 1
-26.17266, 26, 2, 2.575551, 25, 1
-26.00607, 26, 2, 2.54439, 25, 1
-25.83947, 25, 2, 2.523383, 25, 1
-25.67287, 25, 2, 2.513289, 25, 1
-25.50627, 25, 2, 2.492631, 24, 1
-25.33967, 25, 2, 2.472869, 24, 1
-25.17307, 25, 2, 2.45299, 24, 1
-25.00647, 25, 2, 2.443295, 24, 1
-24.83987, 24, 2, 2.42432, 24, 1
-24.67327, 24, 2, 2.405246, 24, 1
-24.50667, 24, 2, 2.386208, 23, 1
-24.34007, 24, 2, 2.366875, 23, 1
-24.17347, 24, 2, 2.357372, 23, 1
-24.00687, 24, 2, 2.338398, 23, 1
-23.84027, 23, 2, 2.319452, 23, 1
-23.67368, 23, 2, 2.300045, 23, 1
-23.50708, 23, 2, 2.280407, 22, 1
-23.34048, 23, 2, 2.2607, 22, 1
-23.17388, 23, 2, 2.250628, 22, 1
-23.00728, 23, 2, 2.229956, 22, 1
-22.84068, 22, 2, 2.208582, 22, 1
-22.67408, 22, 2, 2.18769, 21, 1
-22.50748, 22, 2, 2.166399, 21, 1
-22.34088, 22, 2, 2.15527, 21, 1
-22.17428, 22, 2, 2.133463, 21, 1
-22.00768, 22, 2, 2.111758, 21, 1
-21.84108, 21, 2, 2.089524, 20, 1
-21.67448, 21, 2, 2.078314, 20, 1
-21.50788, 21, 2, 2.056383, 20, 1
-21.34129, 21, 2, 2.033884, 20, 1
-21.17469, 21, 2, 2.011403, 20, 1
-21.00809, 21, 2, 1.989522, 19, 1
-20.84149, 20, 2, 1.9685, 19, 1
-20.67489, 20, 2, 1.957866, 19, 1
-20.50829, 20, 2, 1.935903, 19, 1
-20.34169, 20, 2, 1.914129, 19, 1
-20.17509, 20, 2, 1.892537, 18, 1
-20.00849, 20, 2, 1.871562, 18, 1
-19.84189, 19, 2, 1.861664, 18, 1
-19.67529, 19, 2, 1.841065, 18, 1
-19.50869, 19, 2, 1.820719, 18, 1
-19.34209, 19, 2, 1.800366, 18, 1
-19.1755, 19, 2, 1.790126, 17, 1
-19.0089, 19, 2, 1.769109, 17, 1
-18.8423, 18, 2, 1.747978, 17, 1
-18.6757, 18, 2, 1.72683, 17, 1
-18.5091, 18, 2, 1.705979, 17, 1
-18.3425, 18, 2, 1.684822, 16, 1
-18.1759, 18, 2, 1.674351, 16, 1
-18.0093, 18, 2, 1.65288, 16, 1
-17.8427, 17, 2, 1.631711, 16, 1
-17.6761, 17, 2, 1.609643, 16, 1
-17.5095, 17, 2, 1.598596, 15, 1
-17.3429, 17, 2, 1.575758, 15, 1
-17.1763, 17, 2, 1.553186, 15, 1
-17.0097, 17, 2, 1.530113, 15, 1
-16.84311, 16, 2, 1.506284, 15, 1
-16.67651, 16, 2, 1.494804, 14, 1
-16.50991, 16, 2, 1.471828, 14, 1
-16.34331, 16, 2, 1.44902, 14, 1
-16.17671, 16, 2, 1.426074, 14, 1
-16.01011, 16, 2, 1.414471, 14, 1
-15.84351, 15, 2, 1.392757, 13, 1
-15.67691, 15, 2, 1.370914, 13, 1
-15.51031, 15, 2, 1.349532, 13, 1
-15.34371, 15, 2, 1.328841, 13, 1
-15.17711, 15, 2, 1.307635, 13, 1
-15.01051, 15, 2, 1.286084, 12, 1
-14.84391, 14, 2, 1.275409, 12, 1
-14.67731, 14, 2, 1.254324, 12, 1
-14.51071, 14, 2, 1.234434, 12, 1
-14.34411, 14, 2, 1.22381, 12, 1
-14.17751, 14, 2, 1.194305, 11, 1
-14.01091, 14, 2, 1.184335, 11, 1
-13.84431, 13, 2, 1.164405, 11, 1
-13.6777, 13, 2, 1.144911, 11, 1
-13.5111, 13, 2, 1.125229, 11, 1
-13.3445, 13, 2, 1.105301, 11, 1
-13.1779, 13, 2, 1.094931, 10, 1
-13.0113, 13, 2, 1.074968, 10, 1
-12.8447, 12, 2, 1.055098, 10, 1
-12.6781, 12, 2, 1.035336, 10, 1
-12.5115, 12, 2, 1.015603, 10, 1
-12.3449, 12, 2, 1.005352, 10, 1
-12.1783, 12, 2, 0.9851708, 9, 1
-12.0117, 12, 2, 0.9648764, 9, 1
-11.8451, 11, 2, 0.9442599, 9, 1
-11.6785, 11, 2, 0.9343286, 9, 1
-11.5119, 11, 2, 0.9136362, 9, 1
-11.3453, 11, 2, 0.8928146, 8, 1
-11.1787, 11, 2, 0.8724074, 8, 1
-11.0121, 11, 2, 0.8512607, 8, 1
-10.8455, 10, 2, 0.8408809, 8, 1
-10.6789, 10, 2, 0.8196752, 8, 1
-10.5123, 10, 2, 0.7987051, 7, 1
-10.3457, 10, 2, 0.7775233, 7, 1
-10.1791, 10, 2, 0.7672641, 7, 1
-10.0125, 10, 2, 0.7469926, 7, 1
-9.8459, 9, 2, 0.7273517, 7, 1
-9.679299, 9, 2, 0.7072651, 7, 1
-9.512699, 9, 2, 0.6872439, 6, 1
-9.346099, 9, 2, 0.6677015, 6, 1
-9.179499, 9, 2, 0.648597, 6, 1
-9.012898, 9, 2, 0.6390324, 6, 1
-8.846298, 8, 2, 0.6199844, 6, 1
-8.679698, 8, 2, 0.6106951, 6, 1
-8.513098, 8, 2, 0.5831075, 5, 1
-8.346498, 8, 2, 0.5643299, 5, 1
-8.179897, 8, 2, 0.5548444, 5, 1
-8.013297, 8, 2, 0.5355697, 5, 1
-7.846697, 7, 2, 0.51636, 5, 1
-7.680097, 7, 2, 0.4972763, 4, 1
-7.513496, 7, 2, 0.4877214, 4, 1
-7.346896, 7, 2, 0.4682994, 4, 1
-7.180296, 7, 2, 0.4489088, 4, 1
-7.013696, 7, 2, 0.4290991, 4, 1
-6.847095, 6, 2, 0.4091284, 4, 1
-6.680495, 6, 2, 0.3894963, 3, 1
-6.513895, 6, 2, 0.3796945, 3, 1
-6.347295, 6, 2, 0.3603368, 3, 1
-6.180695, 6, 2, 0.3412464, 3, 1
-6.014094, 6, 2, 0.3220103, 3, 1
-5.847494, 5, 2, 0.3123417, 3, 1
-5.680894, 5, 2, 0.2930875, 2, 1
-5.514294, 5, 2, 0.2734365, 2, 1
-5.347693, 5, 2, 0.2538629, 2, 1
-5.181093, 5, 2, 0.2341456, 2, 1
-5.014493, 5, 2, 0.224452, 2, 1
-4.847893, 4, 2, 0.2057071, 2, 1
-4.681293, 4, 2, 0.1877387, 1, 1
-4.514692, 4, 2, 0.1702294, 1, 1
-4.348092, 4, 2, 0.1521497, 1, 1
-4.181492, 4, 2, 0.1429548, 1, 1
-4.014892, 4, 2, 0.1250811, 1, 1
-3.848292, 3, 2, 0.1078038, 1, 1
-3.681692, 3, 2, 0.09109783, 0, 1
-3.515092, 3, 2, 0.075634, 0, 1
-3.348492, 3, 2, 0.06032276, 0, 1
-3.181892, 3, 2, 0.05311799, 0, 1
-3.015292, 3, 2, 0.03759718, 0, 1
-2.848692, 2, 2, 0.02222586, 0, 1
-2.682092, 2, 2, 0.01469612, 0, 1
-2.515492, 2, 2, -0.007601023, 0, 1
-2.348892, 2, 2, -0.01508379, 0, 1
-2.182292, 2, 2, -0.03040886, 0, 1
-2.015692, 2, 2, -0.04637408, 0, 1
-1.849092, 1, 2, -0.06262302, 0, 1
-1.682492, 1, 2, -0.07951069, 0, 1
-1.515892, 1, 2, -0.08816385, 0, 1
-1.349292, 1, 2, -0.1064425, -1, 1
-1.182692, 1, 2, -0.126133, -1, 1
-1.016092, 1, 2, -0.1466246, -1, 1
-0.8494921, 0, 2, -0.1676259, -1, 1
-0.6828921, 0, 2, -0.1786656, -1, 1
-0.5162921, 0, 2, -0.2001421, -2, 1
-0.3496921, 0, 2, -0.2213798, -2, 1
-0.1830921, 0, 2, -0.2434897, -2, 1
-0.01649214, 0, 2, -0.2648356, -2, 1
0.1501078, 0, 2, -0.2755561, -2, 1
0.3167078, 0, 2, -0.2952361, -2, 1
0.4833078, 0, 2, -0.3138652, -3, 1
0.6499078, 0, 2, -0.3319454, -3, 1
0.8165078, 0, 2, -0.348423, -3, 1
0.9831078, 0, 2, -0.3649411, -3, 1
1.149708, -1, 2, -0.3726168, -3, 1
1.316308, -1, 2, -0.3875756, -3, 1
1.482908, -1, 2, -0.4018722, -4, 1
1.649508, -1, 2, -0.4162145, -4, 1
1.816108, -1, 2, -0.4232707, -4, 1
1.982708, -1, 2, -0.437676, -4, 1
2.149308, -2, 2, -0.4515061, -4, 1
2.315908, -2, 2, -0.465301, -4, 1
2.482508, -2, 2, -0.4787569, -4, 1
2.649108, -2, 2, -0.4849749, -4, 1
2.815708, -2, 2, -0.4980221, -4, 1
2.982308, -2, 2, -0.5108304, -5, 1
3.148908, -3, 2, -0.5231838, -5, 1
3.315508, -3, 2, -0.5289898, -5, 1
3.482108, -3, 2, -0.5403976, -5, 1
3.648708, -3, 2, -0.5518484, -5, 1
3.815308, -3, 2, -0.5631952, -5, 1
3.981908, -3, 2, -0.5749688, -5, 1
4.148508, -4, 2, -0.5867343, -5, 1
4.315108, -4, 2, -0.5923085, -5, 1
4.481709, -4, 2, -0.6037307, -6, 1
4.648309, -4, 2, -0.6147809, -6, 1
4.814909, -4, 2, -0.6256728, -6, 1
4.981509, -4, 2, -0.6366653, -6, 1
5.148109, -5, 2, -0.6424642, -6, 1
5.31471, -5, 2, -0.6538591, -6, 1
5.48131, -5, 2, -0.6652803, -6, 1
5.64791, -5, 2, -0.676338, -6, 1
5.81451, -5, 2, -0.6871934, -6, 1
5.981111, -5, 2, -0.6928651, -6, 1
6.147711, -6, 2, -0.704761, -7, 1
6.314311, -6, 2, -0.717751, -7, 1
6.480911, -6, 2, -0.7319007, -7, 1
6.647511, -6, 2, -0.7462478, -7, 1
6.814112, -6, 2, -0.753149, -7, 1
6.980712, -6, 2, -0.7675884, -7, 1
7.147312, -7, 2, -0.7818604, -7, 1
7.313912, -7, 2, -0.7951894, -7, 1
7.480513, -7, 2, -0.8079696, -8, 1
7.647113, -7, 2, -0.8141017, -8, 1
7.813713, -7, 2, -0.8260245, -8, 1
7.980313, -7, 2, -0.8382792, -8, 1
8.146914, -8, 2, -0.8495879, -8, 1
8.313514, -8, 2, -0.8605275, -8, 1
8.480114, -8, 2, -0.8658276, -8, 1
8.646714, -8, 2, -0.8763361, -8, 1
8.813314, -8, 2, -0.8871512, -8, 1
8.979915, -8, 2, -0.8975358, -8, 1
9.146515, -9, 2, -0.9027014, -9, 1
9.313115, -9, 2, -0.917388, -9, 1
9.479715, -9, 2, -0.9218431, -9, 1
9.646316, -9, 2, -0.9301739, -9, 1
9.812916, -9, 2, -0.938386, -9, 1
9.979516, -9, 2, -0.944797, -9, 1
10.14612, -10, 2, -0.9521317, -9, 1
10.31272, -10, 2, -0.9559684, -9, 1
10.47932, -10, 2, -0.9638462, -9, 1
10.64592, -10, 2, -0.9720116, -9, 1
10.81252, -10, 2, -0.9801311, -9, 1
10.97912, -10, 2, -0.984314, -9, 1
11.14572, -11, 2, -0.9924922, -9, 1
11.31232, -11, 2, -1.001627, -10, 1
11.47892, -11, 2, -1.01057, -10, 1
11.64552, -11, 2, -1.0198, -10, 1
11.81212, -11, 2, -1.028958, -10, 1
11.97872, -11, 2, -1.033661, -10, 1
12.14532, -12, 2, -1.043336, -10, 1
12.31192, -12, 2, -1.053194, -10, 1
12.47852, -12, 2, -1.0634, -10, 1
12.64512, -12, 2, -1.068447, -10, 1
12.81172, -12, 2, -1.078291, -10, 1
12.97832, -12, 2, -1.088088, -10, 1
13.14492, -13, 2, -1.097908, -10, 1
13.31152, -13, 2, -1.107528, -11, 1
13.47812, -13, 2, -1.112235, -11, 1
13.64472, -13, 2, -1.121544, -11, 1
13.81132, -13, 2, -1.131374, -11, 1
13.97792, -13, 2, -1.14136, -11, 1
14.14452, -14, 2, -1.146227, -11, 1
14.31112, -14, 2, -1.161023, -11, 1
14.47772, -14, 2, -1.165841, -11, 1
14.64432, -14, 2, -1.175988, -11, 1
14.81092, -14, 2, -1.186317, -11, 1
14.97752, -14, 2, -1.196582, -11, 1
15.14412, -15, 2, -1.2019, -12, 1
15.31072, -15, 2, -1.212322, -12, 1
15.47732, -15, 2, -1.222713, -12, 1
15.64392, -15, 2, -1.232907, -12, 1
15.81052, -15, 2, -1.242695, -12, 1
15.97712, -15, 2, -1.247837, -12, 1
16.14372, -16, 2, -1.257562, -12, 1
16.31032, -16, 2, -1.266963, -12, 1
16.47692, -16, 2, -1.275219, -12, 1
16.64352, -16, 2, -1.282327, -12, 1
16.81012, -16, 2, -1.288976, -12, 1
16.97672, -16, 2, -1.292222, -12, 1
17.14332, -17, 2, -1.299105, -12, 1
17.30992, -17, 2, -1.306559, -13, 1
17.47652, -17, 2, -1.313696, -13, 1
17.64312, -17, 2, -1.317026, -13, 1
17.80972, -17, 2, -1.322661, -13, 1
17.97631, -17, 2, -1.327188, -13, 1
18.14291, -18, 2, -1.330382, -13, 1
18.30951, -18, 2, -1.331516, -13, 1
