timestamp_sec,frame_id,game_played,yielding,player1discrete,player2discrete,player1yieldprob,player2yieldprob,player1_pose_x,player1_pose_y,player1_pose_z,player1_pose_orient_x,player1_pose_orient_y,player1_pose_orient_z,player1_pose_orient_w,player2_pose_x,player2_pose_y,player2_pose_z,player2_pose_orient_x,player2_pose_orient_y,player2_pose_orient_z,player2_pose_orient_w
1717767607.4531643,map,True,False,5,7,0.0,0.0,2.519484043121338,-2.5253663063049316,0.0,0.0,0.0,0.025072898281571707,0.9996856254901108,4.115480545962946,-8.862755123868109,0.6569009928193391,0.0,0.0,0.0,1.0
1717767607.5026512,map,True,False,5,7,0.0,0.0,2.519484043121338,-2.5253663063049316,0.0,0.0,0.0,0.025072898281571707,0.9996856254901108,4.115480545962946,-8.862755123868109,0.6569009928193391,0.0,0.0,0.0,1.0
1717767607.552814,map,True,False,5,7,0.0,0.0,2.519484043121338,-2.5253663063049316,0.0,0.0,0.0,0.025072898281571707,0.9996856254901108,4.115480545962946,-8.862755123868109,0.6569009928193391,0.0,0.0,0.0,1.0
1717767607.653087,map,True,False,5,7,0.0,0.0,2.519484043121338,-2.5253663063049316,0.0,0.0,0.0,0.025072898281571707,0.9996856254901108,4.115480545962946,-8.862755123868109,0.6569009928193391,0.0,0.0,0.0,1.0
1717767607.7517552,map,True,False,5,7,0.0,0.0,2.525629997253418,-2.5275988578796387,0.0,0.0,0.0,0.025299779330721788,0.9996799165343272,4.243451183863247,-9.442394612453278,0.6140888259994974,0.0,0.0,0.0,1.0
1717767607.8544576,map,True,False,5,7,0.0,0.0,2.525629997253418,-2.5275988578796387,0.0,0.0,0.0,0.025299779330721788,0.9996799165343272,4.243451183863247,-9.442394612453278,0.6140888259994974,0.0,0.0,0.0,1.0
1717767608.055479,map,True,False,5,6,0.0,0.0,2.525629997253418,-2.5275988578796387,0.0,0.0,0.0,0.025299779330721788,0.9996799165343272,4.196415483174569,-8.761086739365942,0.5390768474952897,0.0,0.0,0.0,1.0
1717767608.104768,map,True,False,5,6,0.0,0.0,2.525629997253418,-2.5275988578796387,0.0,0.0,0.0,0.025299779330721788,0.9996799165343272,4.196415483174569,-8.761086739365942,0.5390768474952897,0.0,0.0,0.0,1.0
1717767608.1571765,map,True,False,5,6,0.0,0.0,2.525629997253418,-2.5275988578796387,0.0,0.0,0.0,0.025299779330721788,0.9996799165343272,4.196415483174569,-8.761086739365942,0.5390768474952897,0.0,0.0,0.0,1.0
1717767608.2066913,map,True,False,5,6,0.0,0.0,2.525629997253418,-2.5275988578796387,0.0,0.0,0.0,0.025299779330721788,0.9996799165343272,4.196415483174569,-8.761086739365942,0.5390768474952897,0.0,0.0,0.0,1.0
1717767608.256709,map,True,False,5,6,0.0,0.0,2.5386266708374023,-2.5292956829071045,0.0,0.0,0.0,0.024948494589519768,0.999688740807324,4.196415483174569,-8.761086739365942,0.5390768474952897,0.0,0.0,0.0,1.0
1717767608.3078082,map,True,False,5,6,0.0,0.0,2.5386266708374023,-2.5292956829071045,0.0,0.0,0.0,0.024948494589519768,0.999688740807324,4.196415483174569,-8.761086739365942,0.5390768474952897,0.0,0.0,0.0,1.0
1717767608.4076416,map,True,False,5,6,0.0,0.0,2.5386266708374023,-2.5292956829071045,0.0,0.0,0.0,0.024948494589519768,0.999688740807324,4.232689438877357,-8.321898372247258,0.6504193667829345,0.0,0.0,0.0,1.0
1717767608.4595277,map,True,False,5,6,0.0,0.0,2.5386266708374023,-2.5292956829071045,0.0,0.0,0.0,0.024948494589519768,0.999688740807324,4.232689438877357,-8.321898372247258,0.6504193667829345,0.0,0.0,0.0,1.0
1717767608.511552,map,True,False,5,6,0.0,0.0,2.5386266708374023,-2.5292956829071045,0.0,0.0,0.0,0.024948494589519768,0.999688740807324,4.232689438877357,-8.321898372247258,0.6504193667829345,0.0,0.0,0.0,1.0
1717767608.6107056,map,True,False,5,6,0.0,0.0,2.5386266708374023,-2.5292956829071045,0.0,0.0,0.0,0.024948494589519768,0.999688740807324,4.232689438877357,-8.321898372247258,0.6504193667829345,0.0,0.0,0.0,1.0
1717767608.6611779,map,True,False,5,6,0.0,0.0,2.5386266708374023,-2.5292956829071045,0.0,0.0,0.0,0.024948494589519768,0.999688740807324,4.232689438877357,-8.321898372247258,0.6504193667829345,0.0,0.0,0.0,1.0
1717767608.760098,map,True,True,5,5,0.612995793784914,0.612995793784914,2.5386266708374023,-2.5292956829071045,0.0,0.0,0.0,0.024948494589519768,0.999688740807324,4.230648255606051,-7.2799998141240465,0.6553329120478568,0.0,0.0,0.0,1.0
1717767608.8104897,map,True,True,5,5,0.612995793784914,0.612995793784914,2.5386266708374023,-2.5292956829071045,0.0,0.0,0.0,0.024948494589519768,0.999688740807324,4.186166386584327,-6.9592753930087845,0.6374147524132865,0.0,0.0,0.0,1.0
1717767608.860591,map,True,False,5,5,0.612995793784914,0.612995793784914,2.5386266708374023,-2.5292956829071045,0.0,0.0,0.0,0.024948494589519768,0.999688740807324,4.186166386584327,-6.9592753930087845,0.6374147524132865,0.0,0.0,0.0,1.0
1717767609.1611714,map,True,False,4,5,0.0,0.0,2.709550380706787,-2.5636019706726074,0.0,0.0,0.0,0.026024404984273487,0.9996613137576844,4.225624729515885,-6.827773838744843,0.6452057667644878,0.0,0.0,0.0,1.0
1717767609.211623,map,True,False,4,5,0.0,0.0,2.709550380706787,-2.5636019706726074,0.0,0.0,0.0,0.026024404984273487,0.9996613137576844,4.225624729515885,-6.827773838744843,0.6452057667644878,0.0,0.0,0.0,1.0
1717767609.2618449,map,True,False,4,5,0.0,0.0,2.709550380706787,-2.5636019706726074,0.0,0.0,0.0,0.026024404984273487,0.9996613137576844,4.225624729515885,-6.827773838744843,0.6452057667644878,0.0,0.0,0.0,1.0
1717767609.3121598,map,True,False,4,5,0.0,0.0,2.709550380706787,-2.5636019706726074,0.0,0.0,0.0,0.026024404984273487,0.9996613137576844,4.225624729515885,-6.827773838744843,0.6452057667644878,0.0,0.0,0.0,1.0
1717767609.4116347,map,True,False,4,5,0.0,0.0,2.709550380706787,-2.5636019706726074,0.0,0.0,0.0,0.026024404984273487,0.9996613137576844,4.225624729515885,-6.827773838744843,0.6452057667644878,0.0,0.0,0.0,1.0
1717767609.4620264,map,True,False,4,4,0.5922520728754596,0.5922520728754596,2.709550380706787,-2.5636019706726074,0.0,0.0,0.0,0.026024404984273487,0.9996613137576844,4.297585845682534,-6.7037931872049725,0.6336115365687017,0.0,0.0,0.0,1.0
1717767609.5120702,map,True,False,4,4,0.5922520728754596,0.5922520728754596,2.810192823410034,-2.588602304458618,0.0,0.0,0.0,0.02740868397801749,0.9996243158605004,4.297585845682534,-6.7037931872049725,0.6336115365687017,0.0,0.0,0.0,1.0
1717767609.6179273,map,True,True,4,4,0.5922520728754596,0.5922520728754596,2.810192823410034,-2.588602304458618,0.0,0.0,0.0,0.02740868397801749,0.9996243158605004,4.297585845682534,-6.7037931872049725,0.6336115365687017,0.0,0.0,0.0,1.0
1717767609.670085,map,True,False,4,4,0.5922520728754596,0.5922520728754596,2.810192823410034,-2.588602304458618,0.0,0.0,0.0,0.02740868397801749,0.9996243158605004,4.297585845682534,-6.7037931872049725,0.6336115365687017,0.0,0.0,0.0,1.0
1717767609.717217,map,True,False,4,4,0.5922520728754596,0.5922520728754596,2.810192823410034,-2.588602304458618,0.0,0.0,0.0,0.02740868397801749,0.9996243158605004,4.297585845682534,-6.7037931872049725,0.6336115365687017,0.0,0.0,0.0,1.0
1717767609.8169382,map,True,True,4,4,0.5922520728754596,0.5922520728754596,2.810192823410034,-2.588602304458618,0.0,0.0,0.0,0.02740868397801749,0.9996243158605004,4.349557112922671,-6.141780559387447,0.6499603296709635,0.0,0.0,0.0,1.0
1717767610.1666145,map,True,False,4,3,0.0,0.0,2.8923919200897217,-2.6066830158233643,0.0,0.0,0.0,0.028364069269799407,0.9995976622157258,4.385664680238518,-5.773674293813224,0.6286728923094476,0.0,0.0,0.0,1.0
1717767610.2169557,map,True,False,4,3,0.0,0.0,2.8923919200897217,-2.6066830158233643,0.0,0.0,0.0,0.028364069269799407,0.9995976622157258,4.385664680238518,-5.773674293813224,0.6286728923094476,0.0,0.0,0.0,1.0
1717767610.2670474,map,True,False,4,3,0.0,0.0,2.8923919200897217,-2.6066830158233643,0.0,0.0,0.0,0.028364069269799407,0.9995976622157258,4.385664680238518,-5.773674293813224,0.6286728923094476,0.0,0.0,0.0,1.0
1717767610.3173616,map,True,False,4,3,0.0,0.0,2.8923919200897217,-2.6066830158233643,0.0,0.0,0.0,0.028364069269799407,0.9995976622157258,4.385664680238518,-5.773674293813224,0.6286728923094476,0.0,0.0,0.0,1.0
1717767610.4188151,map,True,False,4,3,0.0,0.0,2.8923919200897217,-2.6066830158233643,0.0,0.0,0.0,0.028364069269799407,0.9995976622157258,4.385664680238518,-5.773674293813224,0.6286728923094476,0.0,0.0,0.0,1.0
1717767610.4696274,map,True,False,4,3,0.0,0.0,2.8923919200897217,-2.6066830158233643,0.0,0.0,0.0,0.028364069269799407,0.9995976622157258,4.3921459799055045,-5.517827119148305,0.6417078312015719,0.0,0.0,0.0,1.0
1717767610.5189497,map,True,False,4,3,0.0,0.0,2.8923919200897217,-2.6066830158233643,0.0,0.0,0.0,0.028364069269799407,0.9995976622157258,4.539862753431402,-5.6614748974165625,0.6240694014657647,0.0,0.0,0.0,1.0
1717767610.618364,map,True,False,4,3,0.0,0.0,2.8923919200897217,-2.6066830158233643,0.0,0.0,0.0,0.028364069269799407,0.9995976622157258,4.539862753431402,-5.6614748974165625,0.6240694014657647,0.0,0.0,0.0,1.0
1717767610.6687605,map,True,False,4,3,0.0,0.0,2.8923919200897217,-2.6066830158233643,0.0,0.0,0.0,0.028364069269799407,0.9995976622157258,4.539862753431402,-5.6614748974165625,0.6240694014657647,0.0,0.0,0.0,1.0
1717767610.7673004,map,True,False,4,3,0.0,0.0,2.8923919200897217,-2.6066830158233643,0.0,0.0,0.0,0.028364069269799407,0.9995976622157258,4.539862753431402,-5.6614748974165625,0.6240694014657647,0.0,0.0,0.0,1.0
1717767611.1712291,map,True,True,3,3,0.6616527499769684,0.6616527499769684,3.0071239471435547,-2.632002353668213,0.0,0.0,0.0,0.029033165010213115,0.9995784467032022,4.5993210001241405,-4.916395728977488,0.6145048583546289,0.0,0.0,0.0,1.0
1717767611.2712083,map,True,True,3,3,0.6616527499769684,0.6616527499769684,3.0357186794281006,-2.6369380950927734,0.0,0.0,0.0,0.029272133983412725,0.999571484901921,4.5993210001241405,-4.916395728977488,0.6145048583546289,0.0,0.0,0.0,1.0
1717767611.3206422,map,True,True,3,3,0.6616527499769684,0.6616527499769684,3.0357186794281006,-2.6369380950927734,0.0,0.0,0.0,0.029272133983412725,0.999571484901921,4.5993210001241405,-4.916395728977488,0.6145048583546289,0.0,0.0,0.0,1.0
1717767611.3710713,map,True,False,3,3,0.6616527499769684,0.6616527499769684,3.0357186794281006,-2.6369380950927734,0.0,0.0,0.0,0.029272133983412725,0.999571484901921,4.5993210001241405,-4.916395728977488,0.6145048583546289,0.0,0.0,0.0,1.0
1717767611.4231002,map,True,True,3,3,0.6616527499769684,0.6616527499769684,3.0357186794281006,-2.6369380950927734,0.0,0.0,0.0,0.029272133983412725,0.999571484901921,4.5993210001241405,-4.916395728977488,0.6145048583546289,0.0,0.0,0.0,1.0
1717767611.4740071,map,True,False,3,2,0.0,0.0,3.0357186794281006,-2.6369380950927734,0.0,0.0,0.0,0.029272133983412725,0.999571484901921,4.584605653308106,-4.672615754030136,0.6316695735145524,0.0,0.0,0.0,1.0
1717767611.526345,map,True,False,3,2,0.0,0.0,3.0357186794281006,-2.6369380950927734,0.0,0.0,0.0,0.029272133983412725,0.999571484901921,4.577168950686347,-4.645460650029375,0.6742508935131782,0.0,0.0,0.0,1.0
1717767611.626613,map,True,False,3,2,0.0,0.0,3.1121957302093506,-2.657142400741577,0.0,0.0,0.0,0.030374329762221573,0.999538598307161,4.577168950686347,-4.645460650029375,0.6742508935131782,0.0,0.0,0.0,1.0
1717767611.6795843,map,True,False,3,2,0.0,0.0,3.1121957302093506,-2.657142400741577,0.0,0.0,0.0,0.030374329762221573,0.999538598307161,4.577168950686347,-4.645460650029375,0.6742508935131782,0.0,0.0,0.0,1.0
1717767611.7267983,map,True,False,3,2,0.0,0.0,3.1121957302093506,-2.657142400741577,0.0,0.0,0.0,0.030374329762221573,0.999538598307161,4.577168950686347,-4.645460650029375,0.6742508935131782,0.0,0.0,0.0,1.0
1717767611.8282678,map,True,False,3,2,0.0,0.0,3.1121957302093506,-2.657142400741577,0.0,0.0,0.0,0.030374329762221573,0.999538598307161,4.632852671987016,-4.280244013593369,0.6856834893542896,0.0,0.0,0.0,1.0
1717767612.194003,map,True,False,3,2,0.0,0.0,3.1761231422424316,-2.666640281677246,0.0,0.0,0.0,0.030827030020218367,0.999524733734,4.704109368711309,-4.068514855502558,0.6848162121772398,0.0,0.0,0.0,1.0
1717767612.2795937,map,True,False,3,2,0.0,0.0,3.1761231422424316,-2.666640281677246,0.0,0.0,0.0,0.030827030020218367,0.999524733734,4.765017794250035,-3.981855297163264,0.6843703759352556,0.0,0.0,0.0,1.0
1717767612.3296478,map,True,False,3,2,0.0,0.0,3.1761231422424316,-2.666640281677246,0.0,0.0,0.0,0.030827030020218367,0.999524733734,4.765017794250035,-3.981855297163264,0.6843703759352556,0.0,0.0,0.0,1.0
1717767612.380599,map,True,False,3,2,0.0,0.0,3.1761231422424316,-2.666640281677246,0.0,0.0,0.0,0.030827030020218367,0.999524733734,4.765017794250035,-3.981855297163264,0.6843703759352556,0.0,0.0,0.0,1.0
1717767612.4313114,map,True,False,3,2,0.0,0.0,3.2832565307617188,-2.6900033950805664,0.0,0.0,0.0,0.031788261488264996,0.9994946186222317,4.765017794250035,-3.981855297163264,0.6843703759352556,0.0,0.0,0.0,1.0
1717767612.4816792,map,True,False,3,2,0.0,0.0,3.2832565307617188,-2.6900033950805664,0.0,0.0,0.0,0.031788261488264996,0.9994946186222317,4.765017794250035,-3.981855297163264,0.6843703759352556,0.0,0.0,0.0,1.0
1717767612.5318642,map,True,False,3,2,0.0,0.0,3.2832565307617188,-2.6900033950805664,0.0,0.0,0.0,0.031788261488264996,0.9994946186222317,4.794732694703964,-3.76820712120979,0.6835969865490759,0.0,0.0,0.0,1.0
1717767612.5818763,map,True,False,3,2,0.0,0.0,3.2832565307617188,-2.6900033950805664,0.0,0.0,0.0,0.031788261488264996,0.9994946186222317,4.786196579322882,-3.680358991136304,0.6813135214562414,0.0,0.0,0.0,1.0
1717767612.6322014,map,True,False,3,2,0.0,0.0,3.2832565307617188,-2.6900033950805664,0.0,0.0,0.0,0.031788261488264996,0.9994946186222317,4.786196579322882,-3.680358991136304,0.6813135214562414,0.0,0.0,0.0,1.0
1717767612.731785,map,True,False,3,2,0.0,0.0,3.2832565307617188,-2.6900033950805664,0.0,0.0,0.0,0.031788261488264996,0.9994946186222317,4.786196579322882,-3.680358991136304,0.6813135214562414,0.0,0.0,0.0,1.0
1717767612.7824254,map,True,False,3,2,0.0,0.0,3.2832565307617188,-2.6900033950805664,0.0,0.0,0.0,0.031788261488264996,0.9994946186222317,4.786196579322882,-3.680358991136304,0.6813135214562414,0.0,0.0,0.0,1.0
1717767612.83221,map,True,False,3,2,0.0,0.0,3.2832565307617188,-2.6900033950805664,0.0,0.0,0.0,0.031788261488264996,0.9994946186222317,4.786196579322882,-3.680358991136304,0.6813135214562414,0.0,0.0,0.0,1.0
1717767612.9334178,map,True,False,2,1,0.0,0.0,3.3663330078125,-2.7030746936798096,0.0,0.0,0.0,0.03249927354662952,0.9994717633303004,4.667176963530445,-3.332098668493094,0.6809086765653812,0.0,0.0,0.0,1.0
1717767613.0332415,map,True,False,2,1,0.0,0.0,3.3663330078125,-2.7030746936798096,0.0,0.0,0.0,0.03249927354662952,0.9994717633303004,4.667176963530445,-3.332098668493094,0.6809086765653812,0.0,0.0,0.0,1.0
1717767613.084766,map,True,False,2,1,0.0,0.0,3.3663330078125,-2.7030746936798096,0.0,0.0,0.0,0.03249927354662952,0.9994717633303004,4.667176963530445,-3.332098668493094,0.6809086765653812,0.0,0.0,0.0,1.0
1717767613.1836286,map,True,False,2,1,0.0,0.0,3.3663330078125,-2.7030746936798096,0.0,0.0,0.0,0.03249927354662952,0.9994717633303004,4.667176963530445,-3.332098668493094,0.6809086765653812,0.0,0.0,0.0,1.0
1717767613.2364323,map,True,False,2,1,0.0,0.0,3.462080955505371,-2.7173330783843994,0.0,0.0,0.0,0.032469312173251205,0.9994727324172157,4.850190777851845,-3.1790771414638286,0.681403321258476,0.0,0.0,0.0,1.0
1717767613.287771,map,True,False,2,1,0.0,0.0,3.462080955505371,-2.7173330783843994,0.0,0.0,0.0,0.032469312173251205,0.9994727324172157,4.808214285244507,-3.1326479600335833,0.6802235382310328,0.0,0.0,0.0,1.0
1717767613.3374672,map,True,False,2,1,0.0,0.0,3.462080955505371,-2.7173330783843994,0.0,0.0,0.0,0.032469312173251205,0.9994727324172157,4.808214285244507,-3.1326479600335833,0.6802235382310328,0.0,0.0,0.0,1.0
1717767613.4376113,map,True,False,2,1,0.0,0.0,3.462080955505371,-2.7173330783843994,0.0,0.0,0.0,0.032469312173251205,0.9994727324172157,4.808214285244507,-3.1326479600335833,0.6802235382310328,0.0,0.0,0.0,1.0
1717767613.4882843,map,True,False,2,1,0.0,0.0,3.462080955505371,-2.7173330783843994,0.0,0.0,0.0,0.032469312173251205,0.9994727324172157,4.808214285244507,-3.1326479600335833,0.6802235382310328,0.0,0.0,0.0,1.0
1717767613.591338,map,True,False,2,1,0.0,0.0,3.518110752105713,-2.7250802516937256,0.0,0.0,0.0,0.032574375508484396,0.9994693182452918,4.7808116847447835,-2.9716594969566503,0.6815357116348304,0.0,0.0,0.0,1.0
1717767613.6387331,map,True,False,2,1,0.0,0.0,3.518110752105713,-2.7250802516937256,0.0,0.0,0.0,0.032574375508484396,0.9994693182452918,4.7808116847447835,-2.9716594969566503,0.6815357116348304,0.0,0.0,0.0,1.0
1717767613.6899807,map,True,False,2,1,0.0,0.0,3.518110752105713,-2.7250802516937256,0.0,0.0,0.0,0.032574375508484396,0.9994693182452918,4.7808116847447835,-2.9716594969566503,0.6815357116348304,0.0,0.0,0.0,1.0
1717767613.694356,map,True,False,2,1,0.0,0.0,3.518110752105713,-2.7250802516937256,0.0,0.0,0.0,0.032574375508484396,0.9994693182452918,4.7808116847447835,-2.9716594969566503,0.6815357116348304,0.0,0.0,0.0,1.0
