car_pos_meter , car_pos_cell, car_speed, ped_pos_meter, ped_pos_cell, ped_speed
-25.625, 25, 2, 3.99912, 25, 1
-25.52088, 25, 2, 3.997164, 25, 1
-25.41675, 25, 2, 3.99374, 25, 1
-25.31263, 25, 2, 3.990856, 25, 1
-25.2085, 25, 2, 3.989047, 25, 1
-25.10438, 25, 2, 3.987771, 25, 1
-25.00025, 25, 2, 3.987267, 25, 1
-24.89613, 24, 2, 3.986595, 25, 1
-24.792, 24, 2, 3.98611, 25, 1
-24.68788, 24, 2, 3.985987, 25, 1
-24.58375, 24, 2, 3.985928, 25, 1
-24.47963, 24, 2, 3.986053, 25, 1
-24.37551, 24, 2, 3.986006, 25, 1
-24.27138, 24, 2, 3.985878, 25, 1
-24.16726, 24, 2, 3.985951, 25, 1
-24.06313, 24, 2, 3.98594, 25, 1
-23.95901, 23, 2, 3.985835, 25, 1
-23.85488, 23, 2, 3.985353, 25, 1
-23.75076, 23, 2, 3.984801, 25, 1
-23.64663, 23, 2, 3.983521, 25, 1
-23.54251, 23, 2, 3.98109, 25, 1
-23.43839, 23, 2, 3.979436, 25, 1
-23.33426, 23, 2, 3.975536, 25, 1
-23.23013, 23, 2, 3.97188, 25, 1
-23.12601, 23, 2, 3.967466, 25, 1
-23.02189, 23, 2, 3.962238, 25, 1
-22.91776, 22, 2, 3.959382, 25, 1
-22.81364, 22, 2, 3.953049, 25, 1
-22.70951, 22, 2, 3.94657, 25, 1
-22.60539, 22, 2, 3.940115, 25, 1
-22.50126, 22, 2, 3.933539, 25, 1
-22.39714, 22, 2, 3.930104, 25, 1
-22.29301, 22, 2, 3.923168, 25, 1
-22.18889, 22, 2, 3.915707, 25, 1
-22.08476, 22, 2, 3.907935, 25, 1
-21.98064, 21, 2, 3.900489, 25, 1
-21.87652, 21, 2, 3.896735, 25, 1
-21.77239, 21, 2, 3.88882, 25, 1
-21.66827, 21, 2, 3.880635, 25, 1
-21.56414, 21, 2, 3.872769, 25, 1
-21.46002, 21, 2, 3.864693, 25, 1
-21.35589, 21, 2, 3.86073, 25, 1
-21.25177, 21, 2, 3.85217, 25, 1
-21.14764, 21, 2, 3.842918, 24, 1
-21.04352, 21, 2, 3.833893, 24, 1
-20.9394, 20, 2, 3.824518, 24, 1
-20.83527, 20, 2, 3.819596, 24, 1
-20.73115, 20, 2, 3.808942, 24, 1
-20.62702, 20, 2, 3.797634, 24, 1
-20.5229, 20, 2, 3.785541, 24, 1
-20.41877, 20, 2, 3.772072, 24, 1
-20.31465, 20, 2, 3.76564, 24, 1
-20.21052, 20, 2, 3.751727, 24, 1
-20.1064, 20, 2, 3.737343, 24, 1
-20.00227, 20, 2, 3.723049, 24, 1
-19.89815, 19, 2, 3.708643, 24, 1
-19.79403, 19, 2, 3.701627, 24, 1
-19.6899, 19, 2, 3.687634, 23, 1
-19.58578, 19, 2, 3.673769, 23, 1
-19.48165, 19, 2, 3.660104, 23, 1
-19.37753, 19, 2, 3.646504, 23, 1
-19.2734, 19, 2, 3.639952, 23, 1
-19.16928, 19, 2, 3.626379, 23, 1
-19.06515, 19, 2, 3.613419, 23, 1
-18.96103, 18, 2, 3.600269, 23, 1
-18.8569, 18, 2, 3.586986, 23, 1
-18.75278, 18, 2, 3.580595, 23, 1
-18.64865, 18, 2, 3.566735, 23, 1
-18.54453, 18, 2, 3.553535, 23, 1
-18.44041, 18, 2, 3.539883, 23, 1
-18.33628, 18, 2, 3.526347, 22, 1
-18.23216, 18, 2, 3.520069, 22, 1
-18.12803, 18, 2, 3.507442, 22, 1
-18.02391, 18, 2, 3.494924, 22, 1
-17.91978, 17, 2, 3.483285, 22, 1
-17.81566, 17, 2, 3.472079, 22, 1
-17.71153, 17, 2, 3.466845, 22, 1
-17.60741, 17, 2, 3.455529, 22, 1
-17.50328, 17, 2, 3.445226, 22, 1
-17.39916, 17, 2, 3.435503, 22, 1
-17.29504, 17, 2, 3.42572, 22, 1
-17.19091, 17, 2, 3.421208, 22, 1
-17.08679, 17, 2, 3.411944, 22, 1
-16.98266, 16, 2, 3.403543, 22, 1
-16.87854, 16, 2, 3.395798, 22, 1
-16.77441, 16, 2, 3.388988, 22, 1
-16.67029, 16, 2, 3.385681, 22, 1
-16.56616, 16, 2, 3.379675, 21, 1
-16.46204, 16, 2, 3.374131, 21, 1
-16.35792, 16, 2, 3.368932, 21, 1
-16.25379, 16, 2, 3.363363, 21, 1
-16.14967, 16, 2, 3.361043, 21, 1
-16.04554, 16, 2, 3.355611, 21, 1
-15.94142, 15, 2, 3.350592, 21, 1
-15.83729, 15, 2, 3.345402, 21, 1
-15.73317, 15, 2, 3.339908, 21, 1
-15.62904, 15, 2, 3.337094, 21, 1
-15.52492, 15, 2, 3.330843, 21, 1
-15.42079, 15, 2, 3.324628, 21, 1
-15.31667, 15, 2, 3.318236, 21, 1
-15.21255, 15, 2, 3.311719, 21, 1
-15.10842, 15, 2, 3.308292, 21, 1
-15.0043, 15, 2, 3.301122, 21, 1
-14.90017, 14, 2, 3.293455, 21, 1
-14.79605, 14, 2, 3.285593, 21, 1
-14.69192, 14, 2, 3.276991, 21, 1
-14.5878, 14, 2, 3.272788, 21, 1
-14.48367, 14, 2, 3.263978, 21, 1
-14.37955, 14, 2, 3.254846, 21, 1
-14.27542, 14, 2, 3.245492, 21, 1
-14.1713, 14, 2, 3.236151, 21, 1
-14.06717, 14, 2, 3.231435, 21, 1
-13.96305, 13, 2, 3.221996, 20, 1
-13.85893, 13, 2, 3.212745, 20, 1
-13.7548, 13, 2, 3.203505, 20, 1
-13.65068, 13, 2, 3.194304, 20, 1
-13.54655, 13, 2, 3.189591, 20, 1
-13.44243, 13, 2, 3.180224, 20, 1
-13.3383, 13, 2, 3.170743, 20, 1
-13.23418, 13, 2, 3.161409, 20, 1
-13.13005, 13, 2, 3.151844, 20, 1
-13.02593, 13, 2, 3.146824, 20, 1
-12.92181, 12, 2, 3.137134, 20, 1
-12.81768, 12, 2, 3.127564, 20, 1
-12.71356, 12, 2, 3.118446, 20, 1
-12.60943, 12, 2, 3.108933, 20, 1
-12.50531, 12, 2, 3.104298, 20, 1
-12.40118, 12, 2, 3.094858, 20, 1
-12.29706, 12, 2, 3.085822, 20, 1
-12.19293, 12, 2, 3.076916, 19, 1
-12.08881, 12, 2, 3.068276, 19, 1
-11.98468, 11, 2, 3.063931, 19, 1
-11.88056, 11, 2, 3.055717, 19, 1
-11.77643, 11, 2, 3.047234, 19, 1
-11.67231, 11, 2, 3.039897, 19, 1
-11.56819, 11, 2, 3.033047, 19, 1
-11.46406, 11, 2, 3.029468, 19, 1
-11.35994, 11, 2, 3.023225, 19, 1
-11.25581, 11, 2, 3.016426, 19, 1
-11.15169, 11, 2, 3.009936, 19, 1
-11.04756, 11, 2, 3.003904, 19, 1
-10.94344, 10, 2, 3.000698, 19, 1
-10.83931, 10, 2, 2.994247, 19, 1
-10.73519, 10, 2, 2.987777, 19, 1
-10.63107, 10, 2, 2.981345, 19, 1
-10.52694, 10, 2, 2.975156, 19, 1
-10.42282, 10, 2, 2.968851, 19, 1
-10.31869, 10, 2, 2.965604, 19, 1
-10.21457, 10, 2, 2.959555, 19, 1
-10.11044, 10, 2, 2.953173, 19, 1
-10.00632, 10, 2, 2.946844, 19, 1
-9.902192, 9, 2, 2.943718, 19, 1
-9.798067, 9, 2, 2.937759, 19, 1
-9.693942, 9, 2, 2.931832, 19, 1
-9.589817, 9, 2, 2.926232, 19, 1
-9.485692, 9, 2, 2.921093, 18, 1
-9.381566, 9, 2, 2.916193, 18, 1
-9.277441, 9, 2, 2.913874, 18, 1
-9.173316, 9, 2, 2.909413, 18, 1
-9.069191, 9, 2, 2.90478, 18, 1
-8.965066, 8, 2, 2.899979, 18, 1
-8.860941, 8, 2, 2.897663, 18, 1
-8.756816, 8, 2, 2.892799, 18, 1
-8.652691, 8, 2, 2.888005, 18, 1
-8.548565, 8, 2, 2.883215, 18, 1
-8.44444, 8, 2, 2.878664, 18, 1
-8.340315, 8, 2, 2.873962, 18, 1
-8.23619, 8, 2, 2.87166, 18, 1
-8.132065, 8, 2, 2.86694, 18, 1
-8.02794, 8, 2, 2.862857, 18, 1
-7.923815, 7, 2, 2.858969, 18, 1
-7.819689, 7, 2, 2.855371, 18, 1
-7.715564, 7, 2, 2.853458, 18, 1
-7.611439, 7, 2, 2.849968, 18, 1
-7.507314, 7, 2, 2.847017, 18, 1
-7.403189, 7, 2, 2.843938, 18, 1
-7.299064, 7, 2, 2.841199, 18, 1
-7.194939, 7, 2, 2.840191, 18, 1
-7.090814, 7, 2, 2.838394, 18, 1
-6.986688, 6, 2, 2.837008, 18, 1
-6.882563, 6, 2, 2.835844, 18, 1
-6.778438, 6, 2, 2.835252, 18, 1
-6.674313, 6, 2, 2.835043, 18, 1
-6.570188, 6, 2, 2.834412, 18, 1
-6.466063, 6, 2, 2.83407, 18, 1
-6.361938, 6, 2, 2.833709, 18, 1
-6.257813, 6, 2, 2.833543, 18, 1
-6.153687, 6, 2, 2.833316, 18, 1
-6.049562, 6, 2, 2.832795, 18, 1
-5.945437, 5, 2, 2.832242, 18, 1
-5.841312, 5, 2, 2.83158, 18, 1
-5.737186, 5, 2, 2.830566, 18, 1
-5.633061, 5, 2, 2.83003, 18, 1
-5.528936, 5, 2, 2.828933, 18, 1
-5.424811, 5, 2, 2.82805, 18, 1
-5.320686, 5, 2, 2.826827, 18, 1
-5.216561, 5, 2, 2.826029, 18, 1
-5.112436, 5, 2, 2.825702, 18, 1
-5.008311, 5, 2, 2.82492, 18, 1
-4.904185, 4, 2, 2.824306, 18, 1
-4.80006, 4, 2, 2.823693, 18, 1
-4.695935, 4, 2, 2.823439, 18, 1
-4.59181, 4, 2, 2.823213, 18, 1
-4.487685, 4, 2, 2.823426, 18, 1
-4.38356, 4, 2, 2.823689, 18, 1
-4.279435, 4, 2, 2.823464, 18, 1
-4.17531, 4, 2, 2.824161, 18, 1
-4.071184, 4, 2, 2.824492, 18, 1
-3.967059, 3, 2, 2.825355, 18, 1
-3.862934, 3, 2, 2.826116, 18, 1
-3.758809, 3, 2, 2.826725, 18, 1
-3.654684, 3, 2, 2.82739, 18, 1
-3.550559, 3, 2, 2.827776, 18, 1
-3.446434, 3, 2, 2.828758, 18, 1
-3.342308, 3, 2, 2.829696, 18, 1
-3.238183, 3, 2, 2.829997, 18, 1
-3.134058, 3, 2, 2.830974, 18, 1
-3.029933, 3, 2, 2.831591, 18, 1
-2.925808, 2, 2, 2.832417, 18, 1
-2.821683, 2, 2, 2.833346, 18, 1
-2.717557, 2, 2, 2.834343, 18, 1
-2.613432, 2, 2, 2.835475, 18, 1
-2.509307, 2, 2, 2.835815, 18, 1
-2.405182, 2, 2, 2.836601, 18, 1
-2.301057, 2, 2, 2.837279, 18, 1
-2.196932, 2, 2, 2.83737, 18, 1
-2.092807, 2, 2, 2.837451, 18, 1
-1.988682, 1, 2, 2.836996, 18, 1
-1.884557, 1, 2, 2.836495, 18, 1
-1.780432, 1, 2, 2.835671, 18, 1
-1.676307, 1, 2, 2.834194, 18, 1
-1.572182, 1, 2, 2.83353, 18, 1
-1.468057, 1, 2, 2.831761, 18, 1
-1.363932, 1, 2, 2.830187, 18, 1
-1.259807, 1, 2, 2.827919, 18, 1
-1.155682, 1, 2, 2.825439, 18, 1
-1.051557, 1, 2, 2.822954, 18, 1
-0.9474323, 0, 2, 2.821522, 18, 1
-0.8433074, 0, 2, 2.818616, 18, 1
-0.7391824, 0, 2, 2.815578, 18, 1
-0.6350574, 0, 2, 2.812788, 18, 1
-0.5309324, 0, 2, 2.81003, 18, 1
-0.4268074, 0, 2, 2.808617, 18, 1
-0.3226824, 0, 2, 2.806295, 18, 1
-0.2185574, 0, 2, 2.804055, 18, 1
-0.1144324, 0, 2, 2.802701, 18, 1
-0.01030743, 0, 2, 2.801616, 18, 1
0.09381756, 0, 2, 2.800998, 18, 1
0.1979426, 0, 2, 2.800529, 18, 1
0.3020675, 0, 2, 2.800699, 18, 1
0.4061925, 0, 2, 2.801697, 18, 1
0.5103175, 0, 2, 2.803222, 18, 1
0.6144425, 0, 2, 2.804675, 18, 1
0.7185675, 0, 2, 2.807291, 18, 1
0.8226925, 0, 2, 2.810395, 18, 1
0.9268175, 0, 2, 2.813953, 18, 1
1.030942, -1, 2, 2.818145, 18, 1
1.135067, -1, 2, 2.820292, 18, 1
1.239192, -1, 2, 2.825023, 18, 1
1.343318, -1, 2, 2.82994, 18, 1
1.447442, -1, 2, 2.837917, 18, 1
1.551567, -1, 2, 2.84477, 18, 1
1.655692, -1, 2, 2.847772, 18, 1
1.759817, -1, 2, 2.852962, 18, 1
1.863942, -1, 2, 2.858409, 18, 1
1.968067, -1, 2, 2.86304, 18, 1
2.072192, -2, 2, 2.866822, 18, 1
2.176317, -2, 2, 2.867645, 18, 1
2.280442, -2, 2, 2.869678, 18, 1
2.384567, -2, 2, 2.871252, 18, 1
2.488692, -2, 2, 2.872515, 18, 1
2.592818, -2, 2, 2.87393, 18, 1
2.696943, -2, 2, 2.873779, 18, 1
2.801068, -2, 2, 2.8739, 18, 1
2.905193, -2, 2, 2.873818, 18, 1
3.009318, -3, 2, 2.873408, 18, 1
3.113443, -3, 2, 2.872826, 18, 1
3.217568, -3, 2, 2.872447, 18, 1
3.321693, -3, 2, 2.872137, 18, 1
3.425819, -3, 2, 2.871471, 18, 1
3.529944, -3, 2, 2.869913, 18, 1
3.634069, -3, 2, 2.868417, 18, 1
3.738194, -3, 2, 2.867803, 18, 1
3.842319, -3, 2, 2.866682, 18, 1
3.946444, -3, 2, 2.8652, 18, 1
4.05057, -4, 2, 2.86334, 18, 1
4.154695, -4, 2, 2.860968, 18, 1
4.25882, -4, 2, 2.860015, 18, 1
4.362945, -4, 2, 2.857571, 18, 1
4.46707, -4, 2, 2.855078, 18, 1
4.571195, -4, 2, 2.852074, 18, 1
4.67532, -4, 2, 2.848532, 18, 1
4.779446, -4, 2, 2.846651, 18, 1
4.883571, -4, 2, 2.842738, 18, 1
4.987696, -4, 2, 2.838575, 18, 1
5.091821, -5, 2, 2.834484, 18, 1
5.195946, -5, 2, 2.830417, 18, 1
5.300071, -5, 2, 2.82871, 18, 1
5.404196, -5, 2, 2.825403, 18, 1
5.508321, -5, 2, 2.822819, 18, 1
5.612447, -5, 2, 2.820797, 18, 1
5.716572, -5, 2, 2.818739, 18, 1
5.820697, -5, 2, 2.817578, 18, 1
5.924822, -5, 2, 2.8148, 18, 1
6.028947, -6, 2, 2.811519, 18, 1
6.133072, -6, 2, 2.807609, 18, 1
6.237197, -6, 2, 2.802974, 18, 1
6.341322, -6, 2, 2.800682, 18, 1
6.445448, -6, 2, 2.795841, 18, 1
6.549573, -6, 2, 2.791221, 18, 1
6.653698, -6, 2, 2.78671, 18, 1
6.757823, -6, 2, 2.782864, 18, 1
6.861948, -6, 2, 2.781105, 18, 1
6.966074, -6, 2, 2.778661, 18, 1
7.070199, -7, 2, 2.775723, 18, 1
7.174324, -7, 2, 2.772139, 18, 1
7.278449, -7, 2, 2.770201, 18, 1
7.382574, -7, 2, 2.768018, 17, 1
7.486699, -7, 2, 2.765273, 17, 1
7.590824, -7, 2, 2.762234, 17, 1
7.69495, -7, 2, 2.758594, 17, 1
7.799075, -7, 2, 2.755764, 17, 1
7.9032, -7, 2, 2.754199, 17, 1
8.007325, -8, 2, 2.750388, 17, 1
8.11145, -8, 2, 2.746692, 17, 1
8.215575, -8, 2, 2.743535, 17, 1
8.3197, -8, 2, 2.739668, 17, 1
8.423825, -8, 2, 2.738469, 17, 1
8.52795, -8, 2, 2.734632, 17, 1
8.632075, -8, 2, 2.731492, 17, 1
8.7362, -8, 2, 2.728265, 17, 1
8.840326, -8, 2, 2.724803, 17, 1
8.944451, -8, 2, 2.723069, 17, 1
9.048576, -9, 2, 2.717262, 17, 1
9.152701, -9, 2, 2.71534, 17, 1
9.256826, -9, 2, 2.711768, 17, 1
9.360951, -9, 2, 2.708114, 17, 1
9.465076, -9, 2, 2.704901, 17, 1
9.569201, -9, 2, 2.702968, 17, 1
9.673327, -9, 2, 2.700323, 17, 1
9.777452, -9, 2, 2.697968, 17, 1
9.881577, -9, 2, 2.695433, 17, 1
9.985703, -9, 2, 2.693392, 17, 1
10.08983, -10, 2, 2.691734, 17, 1
10.19395, -10, 2, 2.689296, 17, 1
10.29808, -10, 2, 2.68674, 17, 1
10.4022, -10, 2, 2.683846, 17, 1
10.50633, -10, 2, 2.680825, 17, 1
10.61045, -10, 2, 2.679214, 17, 1
10.71457, -10, 2, 2.675301, 17, 1
10.8187, -10, 2, 2.670999, 17, 1
10.92282, -10, 2, 2.666332, 17, 1
11.02695, -11, 2, 2.661284, 17, 1
11.13107, -11, 2, 2.655636, 17, 1
11.2352, -11, 2, 2.652983, 17, 1
11.33932, -11, 2, 2.647493, 17, 1
11.44345, -11, 2, 2.64173, 17, 1
11.54757, -11, 2, 2.636146, 17, 1
11.6517, -11, 2, 2.630844, 17, 1
11.75582, -11, 2, 2.628271, 17, 1
11.85995, -11, 2, 2.622972, 17, 1
11.96407, -11, 2, 2.617944, 17, 1
12.06819, -12, 2, 2.612431, 16, 1
12.17232, -12, 2, 2.606421, 16, 1
12.27644, -12, 2, 2.603184, 16, 1
12.38057, -12, 2, 2.596277, 16, 1
12.48469, -12, 2, 2.58899, 16, 1
12.58882, -12, 2, 2.581089, 16, 1
12.69294, -12, 2, 2.573052, 16, 1
12.79707, -12, 2, 2.568995, 16, 1
12.90119, -12, 2, 2.560184, 16, 1
13.00531, -13, 2, 2.551663, 16, 1
13.10944, -13, 2, 2.543049, 16, 1
13.21356, -13, 2, 2.538606, 16, 1
13.31769, -13, 2, 2.529652, 16, 1
13.42181, -13, 2, 2.521057, 16, 1
13.52594, -13, 2, 2.51245, 16, 1
13.63006, -13, 2, 2.508489, 16, 1
13.73419, -13, 2, 2.50046, 16, 1
13.83831, -13, 2, 2.492731, 16, 1
13.94244, -13, 2, 2.485348, 16, 1
14.04656, -14, 2, 2.477997, 16, 1
14.15069, -14, 2, 2.474491, 16, 1
14.25481, -14, 2, 2.4673, 16, 1
14.35893, -14, 2, 2.460007, 15, 1
14.46306, -14, 2, 2.452737, 15, 1
14.56718, -14, 2, 2.445464, 15, 1
14.67131, -14, 2, 2.442307, 15, 1
14.77543, -14, 2, 2.435988, 15, 1
14.87956, -14, 2, 2.430083, 15, 1
14.98368, -14, 2, 2.42511, 15, 1
15.08781, -15, 2, 2.419901, 15, 1
15.19193, -15, 2, 2.417346, 15, 1
15.29605, -15, 2, 2.411482, 15, 1
15.40018, -15, 2, 2.405365, 15, 1
15.5043, -15, 2, 2.398946, 15, 1
15.60843, -15, 2, 2.391922, 15, 1
15.71255, -15, 2, 2.384556, 15, 1
15.81668, -15, 2, 2.380713, 15, 1
15.9208, -15, 2, 2.372588, 15, 1
16.02493, -16, 2, 2.364424, 15, 1
16.12905, -16, 2, 2.355864, 15, 1
16.23318, -16, 2, 2.351417, 15, 1
16.3373, -16, 2, 2.342587, 15, 1
16.44143, -16, 2, 2.332993, 15, 1
16.54555, -16, 2, 2.323342, 15, 1
16.64967, -16, 2, 2.313741, 15, 1
16.7538, -16, 2, 2.308535, 15, 1
16.85792, -16, 2, 2.297833, 14, 1
16.96205, -16, 2, 2.286668, 14, 1
17.06617, -17, 2, 2.275387, 14, 1
17.1703, -17, 2, 2.263653, 14, 1
17.27442, -17, 2, 2.251908, 14, 1
17.37855, -17, 2, 2.245835, 14, 1
17.48267, -17, 2, 2.233634, 14, 1
17.58679, -17, 2, 2.221168, 14, 1
17.69092, -17, 2, 2.207678, 14, 1
17.79504, -17, 2, 2.200645, 14, 1
17.89917, -17, 2, 2.186482, 14, 1
18.00329, -18, 2, 2.170728, 14, 1
18.10742, -18, 2, 2.155378, 14, 1
18.21154, -18, 2, 2.139825, 13, 1
18.31567, -18, 2, 2.123744, 13, 1
18.41979, -18, 2, 2.116359, 13, 1
18.52392, -18, 2, 2.101209, 13, 1
18.62804, -18, 2, 2.086104, 13, 1
18.73216, -18, 2, 2.0715, 13, 1
18.83629, -18, 2, 2.057275, 13, 1
18.94041, -18, 2, 2.050945, 13, 1
19.04454, -19, 2, 2.038377, 13, 1
19.14866, -19, 2, 2.02592, 13, 1
19.25279, -19, 2, 2.014245, 13, 1
19.35691, -19, 2, 2.002709, 13, 1
19.46104, -19, 2, 1.997079, 12, 1
19.56516, -19, 2, 1.986074, 12, 1
19.66928, -19, 2, 1.975032, 12, 1
19.77341, -19, 2, 1.963521, 12, 1
19.87753, -19, 2, 1.952415, 12, 1
19.98166, -19, 2, 1.946851, 12, 1
20.08578, -20, 2, 1.936052, 12, 1
20.18991, -20, 2, 1.925487, 12, 1
20.29403, -20, 2, 1.915269, 12, 1
20.39816, -20, 2, 1.905338, 12, 1
20.50228, -20, 2, 1.900321, 12, 1
20.60641, -20, 2, 1.890377, 12, 1
20.71053, -20, 2, 1.880743, 12, 1
20.81466, -20, 2, 1.871713, 12, 1
20.91878, -20, 2, 1.862889, 12, 1
21.02291, -21, 2, 1.858332, 12, 1
21.12703, -21, 2, 1.849356, 12, 1
21.23116, -21, 2, 1.840863, 11, 1
21.33528, -21, 2, 1.831695, 11, 1
21.4394, -21, 2, 1.821902, 11, 1
21.54353, -21, 2, 1.817414, 11, 1
21.64765, -21, 2, 1.80846, 11, 1
21.75178, -21, 2, 1.798659, 11, 1
21.8559, -21, 2, 1.789957, 11, 1
21.96003, -21, 2, 1.781391, 11, 1
22.06415, -22, 2, 1.776832, 11, 1
22.16828, -22, 2, 1.768144, 11, 1
22.2724, -22, 2, 1.759654, 11, 1
22.37653, -22, 2, 1.7504, 11, 1
22.48065, -22, 2, 1.741323, 11, 1
22.58477, -22, 2, 1.736251, 11, 1
22.6889, -22, 2, 1.72672, 11, 1
22.79302, -22, 2, 1.717113, 11, 1
22.89715, -22, 2, 1.707377, 11, 1
23.00127, -23, 2, 1.697031, 11, 1
23.1054, -23, 2, 1.691703, 10, 1
23.20952, -23, 2, 1.681484, 10, 1
23.31365, -23, 2, 1.671376, 10, 1
23.41777, -23, 2, 1.660689, 10, 1
23.52189, -23, 2, 1.649467, 10, 1
23.62602, -23, 2, 1.643942, 10, 1
23.73014, -23, 2, 1.63301, 10, 1
23.83427, -23, 2, 1.6219, 10, 1
23.93839, -23, 2, 1.610091, 10, 1
24.04252, -24, 2, 1.598418, 10, 1
24.14664, -24, 2, 1.592711, 10, 1
24.25077, -24, 2, 1.581152, 10, 1
24.35489, -24, 2, 1.569288, 10, 1
24.45902, -24, 2, 1.557855, 10, 1
24.56314, -24, 2, 1.546478, 10, 1
24.66726, -24, 2, 1.541086, 10, 1
24.77139, -24, 2, 1.529999, 9, 1
24.87551, -24, 2, 1.518421, 9, 1
24.97964, -24, 2, 1.507429, 9, 1
25.08376, -25, 2, 1.495881, 9, 1
25.18789, -25, 2, 1.490313, 9, 1
25.29201, -25, 2, 1.479598, 9, 1
25.39614, -25, 2, 1.468442, 9, 1
25.50026, -25, 2, 1.457601, 9, 1
25.60439, -25, 2, 1.446892, 9, 1
25.70851, -25, 2, 1.441843, 9, 1
25.81264, -25, 2, 1.431578, 9, 1
25.91676, -25, 2, 1.420758, 9, 1
26.02088, -26, 2, 1.410171, 9, 1
26.12501, -26, 2, 1.399498, 9, 1
26.22913, -26, 2, 1.394443, 9, 1
26.33326, -26, 2, 1.384415, 8, 1
26.43738, -26, 2, 1.374632, 8, 1
26.54151, -26, 2, 1.365267, 8, 1
26.64563, -26, 2, 1.356058, 8, 1
26.74976, -26, 2, 1.35118, 8, 1
26.85388, -26, 2, 1.341642, 8, 1
26.95801, -26, 2, 1.332115, 8, 1
27.06213, -27, 2, 1.321982, 8, 1
27.16625, -27, 2, 1.311797, 8, 1
27.27038, -27, 2, 1.306807, 8, 1
27.3745, -27, 2, 1.296513, 8, 1
27.47863, -27, 2, 1.286042, 8, 1
27.58275, -27, 2, 1.275513, 8, 1
27.68688, -27, 2, 1.270196, 8, 1
27.791, -27, 2, 1.259342, 8, 1
27.89513, -27, 2, 1.248366, 8, 1
27.99925, -27, 2, 1.237061, 8, 1
28.10337, -28, 2, 1.225803, 7, 1
28.2075, -28, 2, 1.214358, 7, 1
28.31162, -28, 2, 1.208931, 7, 1
28.41575, -28, 2, 1.198021, 7, 1
28.51987, -28, 2, 1.187771, 7, 1
28.624, -28, 2, 1.177715, 7, 1
28.72812, -28, 2, 1.168394, 7, 1
28.83225, -28, 2, 1.163834, 7, 1
28.93637, -28, 2, 1.154565, 7, 1
29.0405, -29, 2, 1.146356, 7, 1
29.14462, -29, 2, 1.138142, 7, 1
29.24874, -29, 2, 1.129227, 7, 1
29.35287, -29, 2, 1.12492, 7, 1
29.457, -29, 2, 1.11606, 7, 1
29.56112, -29, 2, 1.10757, 7, 1
29.66524, -29, 2, 1.098484, 7, 1
29.76937, -29, 2, 1.089263, 7, 1
29.87349, -29, 2, 1.08489, 7, 1
29.97762, -29, 2, 1.075751, 6, 1
30.08174, -30, 2, 1.067652, 6, 1
30.18587, -30, 2, 1.058897, 6, 1
30.28999, -30, 2, 1.050435, 6, 1
30.39412, -30, 2, 1.04633, 6, 1
30.49824, -30, 2, 1.038217, 6, 1
30.60236, -30, 2, 1.030507, 6, 1
30.70649, -30, 2, 1.021834, 6, 1
30.81061, -30, 2, 1.013199, 6, 1
30.91474, -30, 2, 1.00909, 6, 1
31.01886, -31, 2, 1.000415, 6, 1
31.12299, -31, 2, 0.9915831, 6, 1
31.22711, -31, 2, 0.982614, 6, 1
31.33124, -31, 2, 0.9734998, 6, 1
31.43536, -31, 2, 0.9692664, 6, 1
31.53949, -31, 2, 0.9599488, 6, 1
31.64361, -31, 2, 0.9508727, 6, 1
31.74773, -31, 2, 0.9411793, 6, 1
31.85186, -31, 2, 0.9311228, 6, 1
31.95598, -31, 2, 0.9263678, 6, 1
32.06011, -32, 2, 0.9156749, 5, 1
32.16423, -32, 2, 0.9042706, 5, 1
32.26836, -32, 2, 0.8923464, 5, 1
32.37248, -32, 2, 0.8794873, 5, 1
32.4766, -32, 2, 0.8731029, 5, 1
32.58073, -32, 2, 0.8601384, 5, 1
32.68486, -32, 2, 0.8468614, 5, 1
32.78898, -32, 2, 0.8340192, 5, 1
32.8931, -32, 2, 0.81986, 5, 1
32.99723, -32, 2, 0.8131542, 5, 1
33.10135, -33, 2, 0.7987835, 5, 1
33.20548, -33, 2, 0.7850065, 5, 1
33.3096, -33, 2, 0.7714138, 5, 1
33.41373, -33, 2, 0.7579188, 4, 1
33.51785, -33, 2, 0.751466, 4, 1
33.62197, -33, 2, 0.7377353, 4, 1
33.7261, -33, 2, 0.7246838, 4, 1
33.83022, -33, 2, 0.7120814, 4, 1
33.93435, -33, 2, 0.7001352, 4, 1
34.03848, -34, 2, 0.6943002, 4, 1
34.1426, -34, 2, 0.6828313, 4, 1
34.24672, -34, 2, 0.6711929, 4, 1
34.35085, -34, 2, 0.6596456, 4, 1
34.45497, -34, 2, 0.6512487, 4, 1
34.5591, -34, 2, 0.6458125, 4, 1
34.66322, -34, 2, 0.6348517, 4, 1
34.76735, -34, 2, 0.6238098, 4, 1
34.87147, -34, 2, 0.6128888, 3, 1
34.97559, -34, 2, 0.6014459, 3, 1
35.07972, -35, 2, 0.5959594, 3, 1
35.18385, -35, 2, 0.5848289, 3, 1
35.28797, -35, 2, 0.5740509, 3, 1
35.39209, -35, 2, 0.5631466, 3, 1
35.49622, -35, 2, 0.5525098, 3, 1
35.60034, -35, 2, 0.5470393, 3, 1
35.70447, -35, 2, 0.5357716, 3, 1
35.80859, -35, 2, 0.5243518, 3, 1
35.91272, -35, 2, 0.5126765, 3, 1
36.01684, -36, 2, 0.5007303, 3, 1
36.12096, -36, 2, 0.4950531, 3, 1
36.22509, -36, 2, 0.483186, 3, 1
36.32921, -36, 2, 0.4714291, 3, 1
36.43334, -36, 2, 0.4592671, 2, 1
36.53746, -36, 2, 0.4476385, 2, 1
36.64159, -36, 2, 0.4417291, 2, 1
36.74571, -36, 2, 0.4303336, 2, 1
36.84984, -36, 2, 0.4190347, 2, 1
36.95396, -36, 2, 0.4080434, 2, 1
37.05809, -37, 2, 0.3976679, 2, 1
37.16221, -37, 2, 0.3921835, 2, 1
37.26633, -37, 2, 0.3822365, 2, 1
37.37046, -37, 2, 0.3714635, 2, 1
37.47458, -37, 2, 0.3611581, 2, 1
37.57871, -37, 2, 0.3507988, 2, 1
37.68283, -37, 2, 0.3454697, 2, 1
37.78696, -37, 2, 0.3356156, 2, 1
37.89108, -37, 2, 0.3256338, 2, 1
37.9952, -37, 2, 0.3156645, 2, 1
38.09933, -38, 2, 0.3057334, 1, 1
38.20346, -38, 2, 0.3004136, 1, 1
38.30758, -38, 2, 0.2902198, 1, 1
38.41171, -38, 2, 0.2796226, 1, 1
38.51583, -38, 2, 0.2694192, 1, 1
38.61995, -38, 2, 0.2598524, 1, 1
38.72408, -38, 2, 0.2549577, 1, 1
38.8282, -38, 2, 0.2455664, 1, 1
38.93233, -38, 2, 0.235857, 1, 1
39.03645, -39, 2, 0.2253885, 1, 1
39.14058, -39, 2, 0.2148924, 1, 1
39.2447, -39, 2, 0.2094235, 1, 1
39.34883, -39, 2, 0.1987791, 1, 1
39.45295, -39, 2, 0.1881061, 1, 1
39.55708, -39, 2, 0.1776271, 1, 1
39.6612, -39, 2, 0.1673622, 1, 1
39.76532, -39, 2, 0.1621342, 1, 1
39.86945, -39, 2, 0.1516745, 0, 1
39.97357, -39, 2, 0.1410971, 0, 1
40.07769, -40, 2, 0.1307018, 0, 1
40.18183, -40, 2, 0.1205442, 0, 1
40.28595, -40, 2, 0.1155486, 0, 1
40.39008, -40, 2, 0.1055365, 0, 1
40.4942, -40, 2, 0.09579992, 0, 1
40.59834, -40, 2, 0.08601046, 0, 1
40.70246, -40, 2, 0.07655382, 0, 1
40.80659, -40, 2, 0.07168531, 0, 1
40.91071, -40, 2, 0.06199694, 0, 1
41.01484, -41, 2, 0.05223298, 0, 1
41.11897, -41, 2, 0.04218459, 0, 1
41.22309, -41, 2, 0.03185368, 0, 1
41.32722, -41, 2, 0.02677298, 0, 1
41.43135, -41, 2, 0.01673579, 0, 1
41.53547, -41, 2, 0.006652832, 0, 1
41.6396, -41, 2, -0.003430843, 0, 1
41.74372, -41, 2, -0.0135603, 0, 1
41.84786, -41, 2, -0.01856613, 0, 1
41.95198, -41, 2, -0.02842236, 0, 1
42.05611, -42, 2, -0.03792191, 0, 1
42.16023, -42, 2, -0.04744911, 0, 1
42.26437, -42, 2, -0.05670929, 0, 1
42.36849, -42, 2, -0.06553459, 0, 1
42.47262, -42, 2, -0.06998587, 0, 1
42.57674, -42, 2, -0.07851028, 0, 1
42.68087, -42, 2, -0.08709288, 0, 1
42.785, -42, 2, -0.0957222, 0, 1
42.88913, -42, 2, -0.10004, 0, 1
42.99325, -42, 2, -0.1089582, 0, 1
43.09738, -43, 2, -0.117794, 0, 1
43.2015, -43, 2, -0.1266866, 0, 1
43.30563, -43, 2, -0.1353512, 0, 1
43.40976, -43, 2, -0.1440525, 0, 1
43.51389, -43, 2, -0.1482592, 0, 1
43.61801, -43, 2, -0.1568151, -1, 1
43.72214, -43, 2, -0.1654463, -1, 1
43.82626, -43, 2, -0.1737943, -1, 1
43.9304, -43, 2, -0.1823483, -1, 1
44.03452, -44, 2, -0.1866488, -1, 1
44.13865, -44, 2, -0.1954527, -1, 1
44.24277, -44, 2, -0.2040014, -1, 1
44.3469, -44, 2, -0.2126102, -1, 1
44.45103, -44, 2, -0.2211695, -1, 1
44.55516, -44, 2, -0.2254577, -1, 1
44.65928, -44, 2, -0.2336664, -1, 1
44.76341, -44, 2, -0.2419534, -1, 1
44.86753, -44, 2, -0.25034, -1, 1
44.97166, -44, 2, -0.2586102, -1, 1
45.07579, -45, 2, -0.2626548, -1, 1
45.17992, -45, 2, -0.2708716, -1, 1
45.28404, -45, 2, -0.2790956, -1, 1
45.38817, -45, 2, -0.2875829, -1, 1
45.49229, -45, 2, -0.2962837, -1, 1
45.59643, -45, 2, -0.3006587, -1, 1
45.70055, -45, 2, -0.3093262, -2, 1
45.80468, -45, 2, -0.3182263, -2, 1
45.9088, -45, 2, -0.3268404, -2, 1
46.01294, -46, 2, -0.3355484, -2, 1
46.11706, -46, 2, -0.3397603, -2, 1
46.22119, -46, 2, -0.3481317, -2, 1
46.32531, -46, 2, -0.3566585, -2, 1
46.42944, -46, 2, -0.3651137, -2, 1
46.53357, -46, 2, -0.373414, -2, 1
46.6377, -46, 2, -0.3775582, -2, 1
46.74182, -46, 2, -0.3859682, -2, 1
46.84595, -46, 2, -0.3946123, -2, 1
46.95007, -46, 2, -0.4040475, -2, 1
47.0542, -47, 2, -0.4089689, -2, 1
47.15833, -47, 2, -0.4187641, -2, 1
47.26246, -47, 2, -0.428556, -2, 1
47.36658, -47, 2, -0.4388242, -2, 1
47.47071, -47, 2, -0.4491882, -2, 1
47.57483, -47, 2, -0.459579, -2, 1
47.67897, -47, 2, -0.4644179, -3, 1
47.78309, -47, 2, -0.4747138, -3, 1
47.88722, -47, 2, -0.4851332, -3, 1
47.99134, -47, 2, -0.4955974, -3, 1
48.09547, -48, 2, -0.5057917, -3, 1
48.1996, -48, 2, -0.5109324, -3, 1
48.30373, -48, 2, -0.5209804, -3, 1
48.40785, -48, 2, -0.5309324, -3, 1
48.51198, -48, 2, -0.5405974, -3, 1
48.6161, -48, 2, -0.5506287, -3, 1
48.72023, -48, 2, -0.555624, -3, 1
48.82436, -48, 2, -0.5655646, -3, 1
48.92849, -48, 2, -0.5762787, -3, 1
49.03261, -49, 2, -0.5860615, -3, 1
49.13674, -49, 2, -0.5958867, -3, 1
49.24086, -49, 2, -0.6007524, -3, 1
49.345, -49, 2, -0.6099129, -3, 1
49.44912, -49, 2, -0.6185665, -4, 1
49.55325, -49, 2, -0.6264844, -4, 1
49.65737, -49, 2, -0.633841, -4, 1
49.76151, -49, 2, -0.6374125, -4, 1
49.86563, -49, 2, -0.6442127, -4, 1
49.96976, -49, 2, -0.650445, -4, 1
50.07388, -50, 2, -0.6564288, -4, 1
50.17801, -50, 2, -0.6619658, -4, 1
50.28214, -50, 2, -0.6644859, -4, 1
50.38626, -50, 2, -0.6695127, -4, 1
50.49039, -50, 2, -0.6739244, -4, 1
50.59452, -50, 2, -0.6776924, -4, 1
50.69864, -50, 2, -0.6811423, -4, 1
50.80277, -50, 2, -0.682755, -4, 1
50.90689, -50, 2, -0.6856289, -4, 1
51.01103, -51, 2, -0.6885581, -4, 1
51.11515, -51, 2, -0.690578, -4, 1
51.21928, -51, 2, -0.6923099, -4, 1
51.3234, -51, 2, -0.693161, -4, 1
51.42754, -51, 2, -0.6943493, -4, 1
51.53166, -51, 2, -0.6947546, -4, 1
51.63579, -51, 2, -0.6947851, -4, 1
51.73991, -51, 2, -0.6946664, -4, 1
51.84404, -51, 2, -0.6941724, -4, 1
51.94817, -51, 2, -0.6938524, -4, 1
52.0523, -52, 2, -0.6934457, -4, 1
52.15642, -52, 2, -0.6930408, -4, 1
52.26055, -52, 2, -0.6924286, -4, 1
52.36467, -52, 2, -0.6918974, -4, 1
52.4688, -52, 2, -0.6909847, -4, 1
52.57293, -52, 2, -0.6902294, -4, 1
52.67706, -52, 2, -0.6895456, -4, 1
52.78118, -52, 2, -0.6894341, -4, 1
52.88531, -52, 2, -0.6891432, -4, 1
52.98943, -52, 2, -0.6891427, -4, 1
53.09357, -53, 2, -0.68923, -4, 1
53.19769, -53, 2, -0.6902323, -4, 1
53.30182, -53, 2, -0.6911106, -4, 1
53.40594, -53, 2, -0.6917205, -4, 1
53.51007, -53, 2, -0.6925941, -4, 1
53.6142, -53, 2, -0.6943846, -4, 1
53.71833, -53, 2, -0.6965847, -4, 1
53.82245, -53, 2, -0.699409, -4, 1
53.92658, -53, 2, -0.7010431, -4, 1
54.0307, -54, 2, -0.7046051, -4, 1
54.13483, -54, 2, -0.7085114, -4, 1
54.23896, -54, 2, -0.7127724, -4, 1
54.34309, -54, 2, -0.7174358, -4, 1
54.44721, -54, 2, -0.71981, -4, 1
54.55134, -54, 2, -0.7245598, -4, 1
54.65546, -54, 2, -0.7295074, -4, 1
54.7596, -54, 2, -0.7347469, -4, 1
54.86372, -54, 2, -0.7401958, -4, 1
54.96785, -54, 2, -0.7429423, -4, 1
55.07197, -55, 2, -0.7486076, -4, 1
55.17611, -55, 2, -0.7542429, -4, 1
55.28023, -55, 2, -0.7601647, -4, 1
55.38436, -55, 2, -0.7662606, -4, 1
55.48848, -55, 2, -0.7692633, -5, 1
55.59261, -55, 2, -0.7754211, -5, 1
55.69674, -55, 2, -0.7813416, -5, 1
55.80087, -55, 2, -0.7870941, -5, 1
55.90499, -55, 2, -0.7925797, -5, 1
56.00912, -56, 2, -0.7952223, -5, 1
56.11324, -56, 2, -0.8002486, -5, 1
56.21737, -56, 2, -0.8047996, -5, 1
56.3215, -56, 2, -0.8089972, -5, 1
56.42563, -56, 2, -0.8128977, -5, 1
56.52975, -56, 2, -0.81463, -5, 1
56.63388, -56, 2, -0.8179517, -5, 1
56.738, -56, 2, -0.8208566, -5, 1
56.84214, -56, 2, -0.8232527, -5, 1
56.94626, -56, 2, -0.825305, -5, 1
57.05039, -57, 2, -0.8261404, -5, 1
57.15451, -57, 2, -0.8277016, -5, 1
57.25864, -57, 2, -0.8290176, -5, 1
57.36277, -57, 2, -0.8303156, -5, 1
57.4669, -57, 2, -0.8319159, -5, 1
57.57102, -57, 2, -0.8325901, -5, 1
57.67515, -57, 2, -0.8347979, -5, 1
57.77927, -57, 2, -0.8373542, -5, 1
57.8834, -57, 2, -0.8402905, -5, 1
57.98753, -57, 2, -0.8438845, -5, 1
58.09166, -58, 2, -0.8456244, -5, 1
58.19578, -58, 2, -0.8497634, -5, 1
58.29991, -58, 2, -0.8420224, -5, 1
58.40403, -58, 2, -0.8459616, -5, 1
58.50817, -58, 2, -0.8507891, -5, 1
58.61229, -58, 2, -0.8526435, -5, 1
58.71642, -58, 2, -0.8567476, -5, 1
58.82054, -58, 2, -0.8611312, -5, 1
58.92467, -58, 2, -0.8658071, -5, 1
59.0288, -59, 2, -0.8706012, -5, 1
59.13293, -59, 2, -0.8729496, -5, 1
59.23705, -59, 2, -0.8777413, -5, 1
59.34118, -59, 2, -0.8821735, -5, 1
59.4453, -59, 2, -0.8862162, -5, 1
59.54943, -59, 2, -0.8909564, -5, 1
59.65356, -59, 2, -0.8927169, -5, 1
59.75769, -59, 2, -0.8957911, -5, 1
59.86181, -59, 2, -0.8984747, -5, 1
59.96594, -59, 2, -0.9007401, -5, 1
60.07006, -60, 2, -0.9034295, -5, 1
60.1742, -60, 2, -0.9046407, -5, 1
60.27832, -60, 2, -0.9066992, -5, 1
60.38245, -60, 2, -0.9085426, -5, 1
60.48657, -60, 2, -0.909843, -5, 1
60.59071, -60, 2, -0.9113941, -5, 1
60.69483, -60, 2, -0.9120111, -5, 1
60.79896, -60, 2, -0.9124737, -5, 1
60.90308, -60, 2, -0.912775, -5, 1
61.00721, -61, 2, -0.9133406, -5, 1
61.11134, -61, 2, -0.9136009, -5, 1
61.21547, -61, 2, -0.9138045, -5, 1
61.31959, -61, 2, -0.9144182, -5, 1
61.42372, -61, 2, -0.9152393, -5, 1
61.52784, -61, 2, -0.9160013, -5, 1
61.63197, -61, 2, -0.9167299, -5, 1
61.7361, -61, 2, -0.9171762, -5, 1
61.84023, -61, 2, -0.9183521, -5, 1
61.94435, -61, 2, -0.9195113, -5, 1
62.04848, -62, 2, -0.9206214, -5, 1
62.1526, -62, 2, -0.9213562, -5, 1
62.25674, -62, 2, -0.9216461, -5, 1
62.36086, -62, 2, -0.9224734, -5, 1
62.46499, -62, 2, -0.923305, -6, 1
62.56911, -62, 2, -0.9239845, -6, 1
62.67324, -62, 2, -0.9248419, -6, 1
62.77737, -62, 2, -0.9250536, -6, 1
62.8815, -62, 2, -0.9253092, -6, 1
62.98562, -62, 2, -0.9257131, -6, 1
63.08975, -63, 2, -0.926012, -6, 1
63.19387, -63, 2, -0.9264174, -6, 1
63.298, -63, 2, -0.9266477, -6, 1
63.40213, -63, 2, -0.9267302, -6, 1
63.50626, -63, 2, -0.927309, -6, 1
63.61038, -63, 2, -0.9208026, -5, 1
63.71451, -63, 2, -0.9227037, -5, 1
63.81863, -63, 2, -0.9244356, -6, 1
63.92277, -63, 2, -0.9244947, -6, 1
64.02689, -64, 2, -0.9252973, -6, 1
64.13102, -64, 2, -0.925281, -6, 1
64.23515, -64, 2, -0.9248986, -6, 1
64.33927, -64, 2, -0.9251137, -6, 1
64.4434, -64, 2, -0.9250145, -6, 1
64.54753, -64, 2, -0.9251804, -6, 1
64.65165, -64, 2, -0.9249997, -6, 1
64.75578, -64, 2, -0.9248452, -6, 1
64.8599, -64, 2, -0.9249029, -6, 1
64.96404, -64, 2, -0.9246941, -6, 1
65.06816, -65, 2, -0.9247451, -6, 1
65.17229, -65, 2, -0.924592, -6, 1
65.27641, -65, 2, -0.9243164, -6, 1
65.38055, -65, 2, -0.9242353, -6, 1
65.48466, -65, 2, -0.9240241, -6, 1
65.5888, -65, 2, -0.92378, -6, 1
65.69292, -65, 2, -0.9232454, -6, 1
65.79705, -65, 2, -0.922626, -5, 1
65.90118, -65, 2, -0.9223456, -5, 1
66.0053, -66, 2, -0.9216828, -5, 1
66.10943, -66, 2, -0.9209814, -5, 1
66.21356, -66, 2, -0.9203568, -5, 1
66.31768, -66, 2, -0.9198246, -5, 1
66.42181, -66, 2, -0.9195852, -5, 1
66.52593, -66, 2, -0.9190216, -5, 1
66.63007, -66, 2, -0.9183455, -5, 1
66.73419, -66, 2, -0.9176617, -5, 1
66.83832, -66, 2, -0.9171877, -5, 1
66.94244, -66, 2, -0.9168372, -5, 1
67.04658, -67, 2, -0.9160724, -5, 1
67.1507, -67, 2, -0.9155006, -5, 1
67.25483, -67, 2, -0.9148359, -5, 1
67.35895, -67, 2, -0.9142671, -5, 1
67.46308, -67, 2, -0.9140096, -5, 1
67.56721, -67, 2, -0.9136081, -5, 1
67.67133, -67, 2, -0.9132891, -5, 1
67.77546, -67, 2, -0.9129839, -5, 1
67.87959, -67, 2, -0.9128604, -5, 1
67.98371, -67, 2, -0.9126863, -5, 1
68.08784, -68, 2, -0.9125872, -5, 1
68.19196, -68, 2, -0.9125147, -5, 1
68.2961, -68, 2, -0.9124804, -5, 1
68.40022, -68, 2, -0.9123182, -5, 1
68.50435, -68, 2, -0.912281, -5, 1
68.60847, -68, 2, -0.9122081, -5, 1
68.71261, -68, 2, -0.9122829, -5, 1
68.81673, -68, 2, -0.9122581, -5, 1
68.92086, -68, 2, -0.912219, -5, 1
69.02498, -69, 2, -0.9122849, -5, 1
69.12911, -69, 2, -0.9123178, -5, 1
69.23324, -69, 2, -0.9122653, -5, 1
69.33736, -69, 2, -0.9123425, -5, 1
69.44149, -69, 2, -0.9125042, -5, 1
69.54562, -69, 2, -0.9125547, -5, 1
69.64974, -69, 2, -0.9126654, -5, 1
69.75388, -69, 2, -0.9128766, -5, 1
69.85799, -69, 2, -0.9130425, -5, 1
69.96213, -69, 2, -0.9131031, -5, 1
70.06625, -70, 2, -0.9131994, -5, 1
