car_pos_meter , car_pos_cell, car_speed, ped_pos_meter, ped_pos_cell, ped_speed
-5.125, 5, 2, 4.094917, 5, 1
-5.104175, 5, 2, 4.08303, 5, 1
-5.08335, 5, 1, 4.071272, 5, 1
-5.068976, 5, 1, 4.014609, 5, 1
-4.997105, 4, 1, 3.717047, 4, 1
-4.925233, 4, 2, 3.484608, 4, 1
-4.404611, 4, 1, 3.276163, 4, 1
-4.332739, 4, 1, 3.191956, 4, 1
-4.260868, 4, 1, 3.152938, 4, 1
-4.188997, 4, 2, 3.142578, 4, 1
-3.668374, 3, 2, 3.138041, 4, 1
-3.147751, 3, 2, 3.136599, 4, 1
-2.627129, 2, 2, 3.137791, 4, 1
-2.106506, 2, 2, 3.130259, 4, 1
-1.606706, 1, 2, 3.131572, 4, 1
-1.08608, 1, 2, 3.133328, 4, 1
-0.5654542, 0, 2, 3.1307, 4, 1
-0.04482922, 0, 2, 3.041839, 3, 1
0.4757957, 0, 2, 2.856162, 3, 1
0.9964215, 0, 2, 2.511305, 3, 1
1.517047, -1, 2, 2.133455, 2, 1
2.037673, -2, 2, 1.762414, 2, 1
2.558295, -2, 2, 1.371607, 1, 1
3.078918, -3, 2, 0.9342005, 1, 1
3.599541, -3, 2, 0.5753827, 0, 1
4.120163, -4, 2, 0.15974, 0, 1
4.640786, -4, 2, -0.249135, 0, 1
5.161409, -5, 2, -0.6046939, 0, 1
5.682032, -5, 2, -0.8737559, -1, 1
6.202654, -6, 2, -0.7630734, 0, 1
6.723277, -6, 2, -0.548701, 0, 1
