timestamp_sec,frame_id,game_played,yielding,player1discrete,player2discrete,player1yieldprob,player2yieldprob,player1_pose_x,player1_pose_y,player1_pose_z,player1_pose_orient_x,player1_pose_orient_y,player1_pose_orient_z,player1_pose_orient_w,player2_pose_x,player2_pose_y,player2_pose_z,player2_pose_orient_x,player2_pose_orient_y,player2_pose_orient_z,player2_pose_orient_w
1718122353.542453,map,True,True,5,5,0.612995793784914,0.612995793784914,1.5493745803833008,-1.6114085912704468,0.0,0.0,0.0,0.04098923115888974,0.9991595938964875,3.3238290821569176,-6.484239451218814,0.784888638628873,0.0,0.0,0.0,1.0
1718122353.6425989,map,True,False,5,5,0.612995793784914,0.612995793784914,1.5493745803833008,-1.6114085912704468,0.0,0.0,0.0,0.04098923115888974,0.9991595938964875,3.3238290821569176,-6.484239451218814,0.784888638628873,0.0,0.0,0.0,1.0
1718122353.742555,map,True,False,5,5,0.612995793784914,0.612995793784914,1.5493745803833008,-1.6114085912704468,0.0,0.0,0.0,0.04098923115888974,0.9991595938964875,3.3238290821569176,-6.484239451218814,0.784888638628873,0.0,0.0,0.0,1.0
1718122353.7949448,map,True,False,5,5,0.612995793784914,0.612995793784914,1.5493745803833008,-1.6114085912704468,0.0,0.0,0.0,0.04098923115888974,0.9991595938964875,3.3238290821569176,-6.484239451218814,0.784888638628873,0.0,0.0,0.0,1.0
1718122353.893256,map,True,False,5,4,0.0,0.0,1.5493745803833008,-1.6114085912704468,0.0,0.0,0.0,0.04098923115888974,0.9991595938964875,3.3439696118186193,-5.733884671518903,0.7878390814936045,0.0,0.0,0.0,1.0
1718122353.9468682,map,True,False,5,4,0.0,0.0,1.5493745803833008,-1.6114085912704468,0.0,0.0,0.0,0.04098923115888974,0.9991595938964875,3.3439696118186193,-5.733884671518903,0.7878390814936045,0.0,0.0,0.0,1.0
1718122353.9963875,map,True,False,4,4,0.5922520728754596,0.5922520728754596,1.6833972930908203,-1.6455851793289185,0.0,0.0,0.0,0.04303840109115614,0.9990734188520068,3.3439696118186193,-5.733884671518903,0.7878390814936045,0.0,0.0,0.0,1.0
1718122354.0944822,map,True,True,4,4,0.5922520728754596,0.5922520728754596,1.6833972930908203,-1.6455851793289185,0.0,0.0,0.0,0.04303840109115614,0.9990734188520068,3.3439696118186193,-5.733884671518903,0.7878390814936045,0.0,0.0,0.0,1.0
1718122354.1445875,map,True,False,4,4,0.5922520728754596,0.5922520728754596,1.6833972930908203,-1.6455851793289185,0.0,0.0,0.0,0.04303840109115614,0.9990734188520068,3.3439696118186193,-5.733884671518903,0.7878390814936045,0.0,0.0,0.0,1.0
1718122354.2444503,map,True,True,4,4,0.5922520728754596,0.5922520728754596,1.6833972930908203,-1.6455851793289185,0.0,0.0,0.0,0.04303840109115614,0.9990734188520068,3.337577267671852,-5.451156721236924,0.7462026991401076,0.0,0.0,0.0,1.0
1718122354.5442293,map,True,True,4,4,0.5922520728754596,0.5922520728754596,1.6833972930908203,-1.6455851793289185,0.0,0.0,0.0,0.04303840109115614,0.9990734188520068,3.4370192989813066,-5.315629102514537,0.7663937784185163,0.0,0.0,0.0,1.0
1718122354.643677,map,True,False,4,4,0.5922520728754596,0.5922520728754596,1.6833972930908203,-1.6455851793289185,0.0,0.0,0.0,0.04303840109115614,0.9990734188520068,3.4370192989813066,-5.315629102514537,0.7663937784185163,0.0,0.0,0.0,1.0
1718122354.6937244,map,True,True,4,4,0.5922520728754596,0.5922520728754596,1.6833972930908203,-1.6455851793289185,0.0,0.0,0.0,0.04303840109115614,0.9990734188520068,3.4370192989813066,-5.315629102514537,0.7663937784185163,0.0,0.0,0.0,1.0
1718122354.745675,map,True,True,4,4,0.5922520728754596,0.5922520728754596,1.6833972930908203,-1.6455851793289185,0.0,0.0,0.0,0.04303840109115614,0.9990734188520068,3.4370192989813066,-5.315629102514537,0.7663937784185163,0.0,0.0,0.0,1.0
1718122354.7966175,map,True,False,4,4,0.5922520728754596,0.5922520728754596,1.6833972930908203,-1.6455851793289185,0.0,0.0,0.0,0.04303840109115614,0.9990734188520068,3.4370192989813066,-5.315629102514537,0.7663937784185163,0.0,0.0,0.0,1.0
1718122354.896443,map,True,False,4,4,0.5922520728754596,0.5922520728754596,1.8006823062896729,-1.6685945987701416,0.0,0.0,0.0,0.04442794562443072,0.9990125937073769,3.508107336831033,-5.14305966591156,0.7680822315381098,0.0,0.0,0.0,1.0
1718122354.9482543,map,True,False,4,4,0.5922520728754596,0.5922520728754596,1.8006823062896729,-1.6685945987701416,0.0,0.0,0.0,0.04442794562443072,0.9990125937073769,3.508107336831033,-5.14305966591156,0.7680822315381098,0.0,0.0,0.0,1.0
1718122355.0474765,map,True,False,4,4,0.5922520728754596,0.5922520728754596,1.8006823062896729,-1.6685945987701416,0.0,0.0,0.0,0.04442794562443072,0.9990125937073769,3.508107336831033,-5.14305966591156,0.7680822315381098,0.0,0.0,0.0,1.0
1718122355.1110566,map,True,False,4,4,0.5922520728754596,0.5922520728754596,1.8006823062896729,-1.6685945987701416,0.0,0.0,0.0,0.04442794562443072,0.9990125937073769,3.508107336831033,-5.14305966591156,0.7680822315381098,0.0,0.0,0.0,1.0
1718122355.1615674,map,True,True,4,4,0.5922520728754596,0.5922520728754596,1.8006823062896729,-1.6685945987701416,0.0,0.0,0.0,0.04442794562443072,0.9990125937073769,3.508107336831033,-5.14305966591156,0.7680822315381098,0.0,0.0,0.0,1.0
1718122355.2087324,map,True,False,4,3,0.0,0.0,1.8006823062896729,-1.6685945987701416,0.0,0.0,0.0,0.04442794562443072,0.9990125937073769,3.475830533232681,-4.6714599384976125,0.719205269497435,0.0,0.0,0.0,1.0
1718122355.508486,map,True,False,4,3,0.0,0.0,1.9334815740585327,-1.6998463869094849,0.0,0.0,0.0,0.046322338274465025,0.9989265402361106,3.5122303967548634,-4.497670306567399,0.7346436169336682,0.0,0.0,0.0,1.0
1718122355.5579627,map,True,False,4,3,0.0,0.0,1.9334815740585327,-1.6998463869094849,0.0,0.0,0.0,0.046322338274465025,0.9989265402361106,3.587546669127957,-4.38164883345736,0.7202172344287038,0.0,0.0,0.0,1.0
1718122355.6581135,map,True,False,4,3,0.0,0.0,1.9334815740585327,-1.6998463869094849,0.0,0.0,0.0,0.046322338274465025,0.9989265402361106,3.587546669127957,-4.38164883345736,0.7202172344287038,0.0,0.0,0.0,1.0
1718122355.7578046,map,True,False,4,3,0.0,0.0,1.9334815740585327,-1.6998463869094849,0.0,0.0,0.0,0.046322338274465025,0.9989265402361106,3.587546669127957,-4.38164883345736,0.7202172344287038,0.0,0.0,0.0,1.0
1718122355.8582141,map,True,False,4,3,0.0,0.0,1.9334815740585327,-1.6998463869094849,0.0,0.0,0.0,0.046322338274465025,0.9989265402361106,3.6352297561168463,-4.122185945315659,0.7365633662782693,0.0,0.0,0.0,1.0
1718122355.9076347,map,True,False,4,3,0.0,0.0,1.9334815740585327,-1.6998463869094849,0.0,0.0,0.0,0.046322338274465025,0.9989265402361106,3.6377398191087993,-4.067929720853991,0.7237765010822645,0.0,0.0,0.0,1.0
1718122355.9598832,map,True,False,4,3,0.0,0.0,1.9334815740585327,-1.6998463869094849,0.0,0.0,0.0,0.046322338274465025,0.9989265402361106,3.6377398191087993,-4.067929720853991,0.7237765010822645,0.0,0.0,0.0,1.0
1718122356.008961,map,True,True,3,3,0.6616527499769684,0.6616527499769684,2.015817642211914,-1.7158764600753784,0.0,0.0,0.0,0.04732696259803417,0.9988794456070802,3.6377398191087993,-4.067929720853991,0.7237765010822645,0.0,0.0,0.0,1.0
1718122356.1081607,map,True,False,3,3,0.6616527499769684,0.6616527499769684,2.015817642211914,-1.7158764600753784,0.0,0.0,0.0,0.04732696259803417,0.9988794456070802,3.6377398191087993,-4.067929720853991,0.7237765010822645,0.0,0.0,0.0,1.0
1718122356.1589773,map,True,False,3,3,0.6616527499769684,0.6616527499769684,2.015817642211914,-1.7158764600753784,0.0,0.0,0.0,0.04732696259803417,0.9988794456070802,3.6377398191087993,-4.067929720853991,0.7237765010822645,0.0,0.0,0.0,1.0
1718122356.5090017,map,True,False,3,2,0.0,0.0,2.015817642211914,-1.7158764600753784,0.0,0.0,0.0,0.04732696259803417,0.9988794456070802,3.7634343372281296,-3.4937237513291866,0.6830599736402297,0.0,0.0,0.0,1.0
1718122356.559537,map,True,False,3,2,0.0,0.0,2.015817642211914,-1.7158764600753784,0.0,0.0,0.0,0.04732696259803417,0.9988794456070802,3.7725773272987158,-3.3329711373070827,0.6826169110530956,0.0,0.0,0.0,1.0
1718122356.6092002,map,True,False,3,2,0.0,0.0,2.1022965908050537,-1.7402561902999878,0.0,0.0,0.0,0.04815535159214477,0.9988398527755543,3.7725773272987158,-3.3329711373070827,0.6826169110530956,0.0,0.0,0.0,1.0
1718122356.6589568,map,True,False,3,2,0.0,0.0,2.1022965908050537,-1.7402561902999878,0.0,0.0,0.0,0.04815535159214477,0.9988398527755543,3.7725773272987158,-3.3329711373070827,0.6826169110530956,0.0,0.0,0.0,1.0
1718122356.7590418,map,True,False,3,2,0.0,0.0,2.1022965908050537,-1.7402561902999878,0.0,0.0,0.0,0.04815535159214477,0.9988398527755543,3.7725773272987158,-3.3329711373070827,0.6826169110530956,0.0,0.0,0.0,1.0
1718122356.8087456,map,True,False,3,2,0.0,0.0,2.1022965908050537,-1.7402561902999878,0.0,0.0,0.0,0.04815535159214477,0.9988398527755543,3.7725773272987158,-3.3329711373070827,0.6826169110530956,0.0,0.0,0.0,1.0
1718122356.8612924,map,True,False,3,2,0.0,0.0,2.1022965908050537,-1.7402561902999878,0.0,0.0,0.0,0.04815535159214477,0.9988398527755543,3.748401913320886,-3.114778624737067,0.6848214747725249,0.0,0.0,0.0,1.0
1718122356.9127948,map,True,False,3,2,0.0,0.0,2.1022965908050537,-1.7402561902999878,0.0,0.0,0.0,0.04815535159214477,0.9988398527755543,3.7813322215578538,-3.050009664495861,0.6845281259902899,0.0,0.0,0.0,1.0
1718122356.960679,map,True,False,3,2,0.0,0.0,2.1022965908050537,-1.7402561902999878,0.0,0.0,0.0,0.04815535159214477,0.9988398527755543,3.7813322215578538,-3.050009664495861,0.6845281259902899,0.0,0.0,0.0,1.0
1718122357.010939,map,True,False,3,2,0.0,0.0,2.1022965908050537,-1.7402561902999878,0.0,0.0,0.0,0.04815535159214477,0.9988398527755543,3.7813322215578538,-3.050009664495861,0.6845281259902899,0.0,0.0,0.0,1.0
1718122357.1129935,map,True,False,3,2,0.0,0.0,2.1022965908050537,-1.7402561902999878,0.0,0.0,0.0,0.04815535159214477,0.9988398527755543,3.7813322215578538,-3.050009664495861,0.6845281259902899,0.0,0.0,0.0,1.0
1718122357.1615677,map,True,False,3,2,0.0,0.0,2.1022965908050537,-1.7402561902999878,0.0,0.0,0.0,0.04815535159214477,0.9988398527755543,3.7813322215578538,-3.050009664495861,0.6845281259902899,0.0,0.0,0.0,1.0
1718122357.212335,map,True,False,3,2,0.0,0.0,2.1022965908050537,-1.7402561902999878,0.0,0.0,0.0,0.04815535159214477,0.9988398527755543,3.8638067316381566,-2.7153207682446148,0.681029955510256,0.0,0.0,0.0,1.0
1718122357.5662885,map,True,False,3,1,0.0,0.0,2.18768310546875,-1.758533000946045,0.0,0.0,0.0,0.04878725132269009,0.9988091948516414,3.8877668592123693,-2.4547850770735105,0.6821987642861064,0.0,0.0,0.0,1.0
1718122357.6129587,map,True,False,3,1,0.0,0.0,2.18768310546875,-1.758533000946045,0.0,0.0,0.0,0.04878725132269009,0.9988091948516414,3.9636843127064587,-2.321665498879526,0.681564959286163,0.0,0.0,0.0,1.0
1718122357.6632485,map,True,False,3,1,0.0,0.0,2.18768310546875,-1.758533000946045,0.0,0.0,0.0,0.04878725132269009,0.9988091948516414,3.9636843127064587,-2.321665498879526,0.681564959286163,0.0,0.0,0.0,1.0
1718122357.7134004,map,True,False,3,1,0.0,0.0,2.18768310546875,-1.758533000946045,0.0,0.0,0.0,0.04878725132269009,0.9988091948516414,3.9636843127064587,-2.321665498879526,0.681564959286163,0.0,0.0,0.0,1.0
1718122357.8129508,map,True,False,3,1,0.0,0.0,2.18768310546875,-1.758533000946045,0.0,0.0,0.0,0.04878725132269009,0.9988091948516414,3.9636843127064587,-2.321665498879526,0.681564959286163,0.0,0.0,0.0,1.0
1718122357.8634462,map,True,False,3,1,0.0,0.0,2.18768310546875,-1.758533000946045,0.0,0.0,0.0,0.04878725132269009,0.9988091948516414,3.9636843127064587,-2.321665498879526,0.681564959286163,0.0,0.0,0.0,1.0
1718122357.9144301,map,True,False,3,1,0.0,0.0,2.18768310546875,-1.758533000946045,0.0,0.0,0.0,0.04878725132269009,0.9988091948516414,4.0059474696912805,-2.1637433943995985,0.6603357988857853,0.0,0.0,0.0,1.0
1718122357.9659555,map,True,False,3,1,0.0,0.0,2.332709312438965,-1.7709519863128662,0.0,0.0,0.0,0.048674909791257596,0.9988146700827439,4.0059474696912805,-2.1637433943995985,0.6603357988857853,0.0,0.0,0.0,1.0
1718122358.0161393,map,True,False,3,1,0.0,0.0,2.332709312438965,-1.7709519863128662,0.0,0.0,0.0,0.048674909791257596,0.9988146700827439,4.0059474696912805,-2.1637433943995985,0.6603357988857853,0.0,0.0,0.0,1.0
1718122358.1171854,map,True,False,3,1,0.0,0.0,2.332709312438965,-1.7709519863128662,0.0,0.0,0.0,0.048674909791257596,0.9988146700827439,4.0059474696912805,-2.1637433943995985,0.6603357988857853,0.0,0.0,0.0,1.0
1718122358.168756,map,True,False,3,1,0.0,0.0,2.332709312438965,-1.7709519863128662,0.0,0.0,0.0,0.048674909791257596,0.9988146700827439,4.0059474696912805,-2.1637433943995985,0.6603357988857853,0.0,0.0,0.0,1.0
