car_pos_meter , car_pos_cell, car_speed, ped_pos_meter, ped_pos_cell, ped_speed
-5.125, 5, 1, 3.995587, 5, 1
-5.114625, 5, 2, 3.986241, 5, 1
-5.0938, 5, 1, 3.966009, 5, 1
-5.083425, 5, 1, 3.944388, 5, 1
-5.07305, 5, 2, 3.922514, 5, 1
-5.052225, 5, 1, 3.900476, 5, 1
-5.04185, 5, 2, 3.879486, 5, 1
-5.021025, 5, 1, 3.869699, 5, 1
-5.01065, 5, 1, 3.851183, 5, 1
-5.000275, 5, 2, 3.833827, 4, 1
-4.97945, 4, 2, 3.816554, 4, 1
-4.958625, 4, 2, 3.799029, 4, 1
-4.9378, 4, 1, 3.789984, 4, 1
-4.927425, 4, 1, 3.77211, 4, 1
-4.91705, 4, 2, 3.754349, 4, 1
-4.896225, 4, 1, 3.737064, 4, 1
-4.88585, 4, 1, 3.720365, 4, 1
-4.875475, 4, 1, 3.712027, 4, 1
-4.8651, 4, 1, 3.695188, 4, 1
-4.854725, 4, 1, 3.678264, 4, 1
-4.84435, 4, 1, 3.661072, 4, 1
-4.833975, 4, 2, 3.643646, 4, 1
-4.81315, 4, 1, 3.634778, 4, 1
-4.802775, 4, 1, 3.616714, 4, 1
-4.7924, 4, 2, 3.598, 4, 1
-4.771575, 4, 2, 3.578703, 4, 1
-4.750751, 4, 2, 3.559259, 4, 1
-4.729926, 4, 1, 3.54918, 4, 1
-4.719551, 4, 1, 3.528593, 4, 1
-4.709176, 4, 2, 3.507457, 4, 1
-4.688351, 4, 2, 3.486045, 4, 1
-4.667526, 4, 1, 3.475099, 4, 1
-4.657151, 4, 1, 3.452805, 4, 1
-4.646776, 4, 2, 3.429369, 4, 1
-4.625951, 4, 1, 3.405385, 4, 1
-4.615576, 4, 1, 3.381206, 4, 1
-4.605201, 4, 1, 3.3562, 4, 1
-4.594826, 4, 1, 3.343234, 4, 1
-4.584451, 4, 1, 3.317015, 4, 1
-4.574076, 4, 2, 3.290068, 4, 1
-4.553251, 4, 2, 3.263244, 4, 1
-4.532426, 4, 1, 3.23651, 4, 1
-4.522051, 4, 1, 3.223237, 4, 1
-4.511676, 4, 2, 3.195911, 4, 1
-4.490851, 4, 1, 3.167953, 4, 1
-4.480476, 4, 1, 3.139818, 4, 1
-4.470101, 4, 1, 3.111314, 4, 1
-4.459726, 4, 1, 3.097429, 4, 1
-4.449351, 4, 2, 3.069451, 3, 1
-4.428526, 4, 2, 3.042259, 3, 1
-4.407701, 4, 2, 3.015635, 3, 1
-4.386876, 4, 2, 2.989397, 3, 1
-4.366051, 4, 2, 2.976426, 3, 1
-4.345226, 4, 2, 2.951213, 3, 1
-4.324401, 4, 2, 2.925694, 3, 1
-4.303576, 4, 2, 2.900688, 3, 1
-4.282752, 4, 2, 2.876318, 3, 1
-4.261927, 4, 2, 2.8643, 3, 1
-4.241102, 4, 2, 2.840462, 3, 1
-4.220277, 4, 2, 2.8161, 3, 1
-4.199452, 4, 2, 2.791986, 3, 1
-4.178627, 4, 2, 2.766966, 3, 1
-4.157802, 4, 2, 2.754243, 3, 1
-4.136977, 4, 2, 2.728018, 3, 1
-4.116152, 4, 2, 2.702233, 3, 1
-4.095327, 4, 2, 2.677597, 3, 1
-4.074502, 4, 2, 2.652732, 3, 1
-4.053678, 4, 2, 2.640427, 3, 1
-4.032853, 4, 2, 2.616128, 3, 1
-4.012028, 4, 2, 2.593148, 3, 1
-3.991203, 3, 1, 2.571778, 3, 1
-3.980828, 3, 1, 2.550644, 3, 1
-3.970453, 3, 1, 2.540073, 3, 1
-3.960078, 3, 1, 2.519559, 3, 1
-3.949703, 3, 1, 2.500018, 3, 1
-3.939328, 3, 1, 2.480084, 3, 1
-3.928953, 3, 1, 2.459249, 3, 1
-3.918578, 3, 2, 2.448709, 3, 1
-3.897753, 3, 2, 2.427594, 3, 1
-3.876928, 3, 1, 2.404528, 3, 1
-3.866553, 3, 1, 2.380022, 3, 1
-3.856178, 3, 1, 2.354058, 3, 1
-3.845803, 3, 2, 2.341224, 3, 1
-3.824978, 3, 1, 2.314908, 3, 1
-3.814603, 3, 2, 2.288379, 2, 1
-3.793778, 3, 2, 2.261348, 2, 1
-3.772953, 3, 2, 2.233695, 2, 1
-3.752128, 3, 2, 2.206843, 2, 1
-3.731303, 3, 2, 2.193284, 2, 1
-3.710478, 3, 2, 2.166422, 2, 1
-3.689653, 3, 2, 2.14001, 2, 1
-3.668828, 3, 2, 2.113064, 2, 1
-3.648004, 3, 2, 2.10029, 2, 1
-3.627179, 3, 2, 2.074454, 2, 1
-3.606354, 3, 2, 2.047524, 2, 1
-3.585529, 3, 2, 2.021007, 2, 1
-3.564704, 3, 2, 1.995013, 2, 1
-3.543879, 3, 2, 1.982505, 2, 1
-3.523054, 3, 2, 1.957958, 2, 1
-3.502229, 3, 2, 1.934055, 2, 1
-3.481404, 3, 2, 1.911209, 2, 1
-3.460579, 3, 2, 1.887955, 2, 1
-3.439754, 3, 2, 1.86504, 2, 1
-3.41893, 3, 2, 1.853581, 2, 1
-3.398105, 3, 2, 1.830266, 2, 1
-3.37728, 3, 2, 1.807222, 2, 1
-3.356455, 3, 2, 1.783536, 2, 1
-3.33563, 3, 2, 1.772328, 2, 1
-3.314805, 3, 2, 1.748236, 2, 1
-3.29398, 3, 2, 1.724778, 2, 1
-3.273155, 3, 2, 1.700366, 2, 1
-3.25233, 3, 2, 1.675408, 2, 1
-3.231505, 3, 2, 1.663417, 2, 1
-3.21068, 3, 2, 1.638592, 2, 1
-3.189856, 3, 2, 1.614185, 2, 1
-3.169031, 3, 2, 1.589138, 2, 1
-3.148206, 3, 2, 1.564121, 2, 1
-3.127381, 3, 2, 1.54007, 2, 1
-3.106556, 3, 2, 1.527463, 1, 1
-3.085731, 3, 2, 1.503502, 1, 1
-3.064906, 3, 2, 1.479731, 1, 1
-3.044081, 3, 2, 1.456567, 1, 1
-3.023256, 3, 2, 1.432208, 1, 1
-3.002431, 3, 2, 1.419147, 1, 1
-2.981606, 2, 2, 1.394677, 1, 1
-2.960782, 2, 2, 1.371987, 1, 1
-2.939957, 2, 2, 1.349338, 1, 1
-2.919132, 2, 2, 1.327524, 1, 1
-2.898307, 2, 2, 1.31654, 1, 1
-2.877482, 2, 2, 1.294606, 1, 1
-2.856657, 2, 2, 1.271801, 1, 1
-2.835832, 2, 2, 1.248303, 1, 1
-2.815007, 2, 2, 1.225172, 1, 1
-2.794182, 2, 2, 1.213686, 1, 1
-2.773357, 2, 2, 1.191493, 1, 1
-2.752532, 2, 2, 1.169142, 1, 1
-2.731708, 2, 2, 1.147107, 1, 1
-2.710883, 2, 2, 1.12459, 1, 1
-2.690058, 2, 2, 1.113175, 1, 1
-2.669233, 2, 2, 1.089717, 1, 1
-2.648408, 2, 2, 1.06516, 1, 1
-2.627583, 2, 2, 1.040499, 1, 1
-2.606758, 2, 2, 1.014912, 1, 1
-2.585933, 2, 2, 1.001909, 1, 1
-2.565108, 2, 2, 0.9753878, 1, 1
-2.544283, 2, 2, 0.9481041, 1, 1
-2.523458, 2, 2, 0.9212575, 1, 1
-2.502634, 2, 2, 0.9072683, 1, 1
-2.481809, 2, 2, 0.880233, 1, 1
-2.460984, 2, 2, 0.8531995, 1, 1
-2.440159, 2, 2, 0.8267117, 1, 1
-2.419334, 2, 2, 0.8012633, 1, 1
-2.398509, 2, 2, 0.7882872, 1, 1
-2.377684, 2, 2, 0.7629759, 0, 1
-2.356859, 2, 2, 0.7378812, 0, 1
-2.336034, 2, 2, 0.7141972, 0, 1
-2.315209, 2, 2, 0.6908972, 0, 1
-2.294384, 2, 2, 0.6788199, 0, 1
-2.27356, 2, 2, 0.6556625, 0, 1
-2.252735, 2, 2, 0.6335237, 0, 1
-2.23191, 2, 2, 0.6122251, 0, 1
-2.211085, 2, 2, 0.5912023, 0, 1
-2.19026, 2, 2, 0.5808685, 0, 1
-2.169435, 2, 2, 0.5598922, 0, 1
-2.14861, 2, 2, 0.5390756, 0, 1
-2.127785, 2, 2, 0.5182364, 0, 1
-2.10696, 2, 2, 0.4966111, 0, 1
-2.086135, 2, 2, 0.4749835, 0, 1
-2.06531, 2, 2, 0.4637835, 0, 1
-2.044486, 2, 2, 0.441222, 0, 1
-2.023661, 2, 2, 0.4183483, 0, 1
-2.002836, 2, 2, 0.3947062, 0, 1
-1.982011, 1, 2, 0.3712392, 0, 1
-1.961186, 1, 2, 0.358618, 0, 1
-1.940361, 1, 2, 0.3329077, 0, 1
-1.919536, 1, 2, 0.3049569, 0, 1
-1.898711, 1, 2, 0.2766364, 0, 1
-1.877886, 1, 2, 0.2481918, 0, 1
-1.857061, 1, 2, 0.233861, 0, 1
-1.836236, 1, 2, 0.2055457, 0, 1
-1.81541, 1, 2, 0.1780255, 0, 1
-1.794585, 1, 2, 0.1499662, 0, 1
-1.77376, 1, 2, 0.1353986, 0, 1
-1.752935, 1, 2, 0.105227, 0, 1
-1.73211, 1, 2, 0.07554221, 0, 1
-1.711285, 1, 2, 0.04803729, 0, 1
-1.69046, 1, 2, 0.02261448, 0, 1
-1.669635, 1, 2, 0.01057982, 0, 1
-1.64881, 1, 2, -0.01332808, 0, 1
-1.627985, 1, 2, -0.03599501, 0, 1
-1.60716, 1, 2, -0.05711555, 0, 1
-1.586335, 1, 2, -0.07866907, 0, 1
-1.56551, 1, 2, -0.09978724, 0, 1
-1.544685, 1, 2, -0.1103745, 0, 1
-1.52386, 1, 2, -0.1321797, 0, 1
-1.503035, 1, 2, -0.1541185, 0, 1
-1.48221, 1, 2, -0.1763477, 0, 1
-1.461385, 1, 2, -0.1988182, 0, 1
-1.44056, 1, 2, -0.2098365, 0, 1
-1.419735, 1, 2, -0.2321572, 0, 1
-1.39891, 1, 2, -0.254302, 0, 1
-1.378085, 1, 2, -0.2761321, 0, 1
-1.35726, 1, 2, -0.2979302, 0, 1
-1.336435, 1, 2, -0.3089404, 0, 1
-1.31561, 1, 2, -0.3315763, 0, 1
-1.294785, 1, 2, -0.3542242, 0, 1
-1.27396, 1, 2, -0.3769264, 0, 1
-1.253135, 1, 2, -0.3996425, 0, 1
-1.23231, 1, 2, -0.4111714, 0, 1
-1.211485, 1, 2, -0.4339027, 0, 1
-1.19066, 1, 2, -0.4569383, 0, 1
-1.169835, 1, 2, -0.4800839, 0, 1
-1.14901, 1, 2, -0.5024748, 0, 1
-1.128185, 1, 2, -0.5131154, 0, 1
-1.10736, 1, 2, -0.5341988, 0, 1
-1.086535, 1, 2, -0.5551724, 0, 1
-1.065709, 1, 2, -0.5763669, 0, 1
-1.044884, 1, 2, -0.5970411, 0, 1
-1.024059, 1, 2, -0.6068349, 0, 1
-1.003234, 1, 2, -0.6253061, 0, 1
-0.9824094, 0, 2, -0.6431274, 0, 1
-0.9615843, 0, 2, -0.6603761, 0, 1
-0.9407593, 0, 2, -0.6778231, 0, 1
-0.9199343, 0, 2, -0.6863251, 0, 1
-0.8991092, 0, 2, -0.7035074, 0, 1
-0.8782842, 0, 2, -0.72015, 0, 1
-0.8574592, 0, 2, -0.7367315, 0, 1
-0.8366342, 0, 2, -0.752861, 0, 1
-0.8158091, 0, 2, -0.7606769, 0, 1
-0.7949841, 0, 2, -0.7760057, -1, 1
-0.7741591, 0, 2, -0.7910132, -1, 1
-0.753334, 0, 2, -0.8054619, -1, 1
-0.732509, 0, 2, -0.8193851, -1, 1
-0.711684, 0, 2, -0.8259864, -1, 1
-0.690859, 0, 2, -0.8388357, -1, 1
-0.6700339, 0, 2, -0.8510256, -1, 1
-0.6492089, 0, 2, -0.8629131, -1, 1
-0.6283839, 0, 2, -0.8747125, -1, 1
-0.6075588, 0, 2, -0.8804989, -1, 1
-0.5867338, 0, 2, -0.891819, -1, 1
-0.5659088, 0, 2, -0.9025745, -1, 1
-0.5450838, 0, 2, -0.9119258, -1, 1
-0.5242587, 0, 2, -0.9218707, -1, 1
-0.5034337, 0, 2, -0.9271116, -1, 1
-0.4826087, 0, 2, -0.938158, -1, 1
-0.4617837, 0, 2, -0.9496217, -1, 1
-0.4409587, 0, 2, -0.9600501, -1, 1
-0.4201337, 0, 2, -0.9701834, -1, 1
-0.3993087, 0, 2, -0.9749532, -1, 1
-0.3784837, 0, 2, -0.9843826, -1, 1
-0.3576587, 0, 2, -0.9931841, -1, 1
-0.3368337, 0, 2, -1.001639, -1, 1
-0.3160087, 0, 2, -1.010079, -1, 1
-0.2951837, 0, 2, -1.014345, -1, 1
-0.2743587, 0, 2, -1.02269, -1, 1
-0.2535337, 0, 2, -1.030869, -1, 1
-0.2327087, 0, 2, -1.038483, -1, 1
-0.2118837, 0, 2, -1.046243, -1, 1
-0.1910587, 0, 2, -1.050341, -1, 1
-0.1702337, 0, 2, -1.059131, -1, 1
-0.1494087, 0, 2, -1.068316, -1, 1
-0.1285837, 0, 2, -1.077733, -1, 1
-0.1077587, 0, 2, -1.087397, -1, 1
-0.08693373, 0, 2, -1.092259, -1, 1
-0.06610873, 0, 2, -1.102408, -1, 1
-0.04528373, 0, 2, -1.113058, -1, 1
-0.02445874, 0, 2, -1.124333, -1, 1
-0.003633738, 0, 2, -1.136059, -1, 1
0.01719126, 0, 2, -1.142074, -1, 1
0.03801626, 0, 2, -1.153865, -1, 1
0.05884126, 0, 2, -1.165435, -1, 1
0.07966626, 0, 2, -1.176603, -1, 1
0.1004913, 0, 2, -1.187715, -1, 1
0.1213163, 0, 2, -1.193146, -1, 1
0.1421413, 0, 2, -1.203588, -1, 1
0.1629663, 0, 2, -1.213537, -1, 1
0.1837912, 0, 2, -1.221239, -1, 1
0.2046162, 0, 2, -1.228817, -1, 1
0.2254412, 0, 2, -1.232598, -1, 1
0.2462662, 0, 2, -1.238981, -1, 1
0.2670912, 0, 2, -1.245196, -1, 1
0.2879162, 0, 2, -1.250644, -1, 1
0.3087412, 0, 2, -1.255477, -1, 1
0.3295662, 0, 2, -1.258208, -1, 1
0.3503912, 0, 2, -1.262719, -1, 1
0.3712162, 0, 2, -1.267789, -1, 1
0.3920412, 0, 2, -1.272133, -1, 1
0.4128662, 0, 2, -1.276498, -1, 1
0.4336912, 0, 2, -1.27872, -1, 1
0.4545162, 0, 2, -1.282949, -1, 1
0.4753412, 0, 2, -1.287185, -1, 1
0.4961662, 0, 2, -1.291202, -1, 1
0.5169913, 0, 2, -1.295544, -1, 1
0.5378163, 0, 2, -1.29774, -1, 1
0.5586413, 0, 2, -1.30199, -1, 1
0.5794663, 0, 2, -1.306407, -1, 1
0.6002914, 0, 2, -1.310424, -1, 1
0.6211164, 0, 2, -1.314682, -1, 1
0.6419414, 0, 2, -1.316738, -1, 1
0.6627665, 0, 2, -1.32065, -1, 1
0.6835915, 0, 2, -1.32445, -1, 1
0.7044165, 0, 2, -1.328056, -1, 1
0.7252415, 0, 2, -1.331555, -1, 1
0.7460666, 0, 2, -1.333516, -1, 1
0.7668916, 0, 2, -1.337699, -1, 1
0.7877166, 0, 2, -1.342101, -1, 1
0.8085417, 0, 2, -1.346062, -1, 1
0.8293667, 0, 2, -1.349931, -1, 1
0.8501917, 0, 2, -1.352151, -1, 1
0.8710167, 0, 2, -1.356105, -1, 1
0.8918418, 0, 2, -1.360216, -1, 1
0.9126668, 0, 2, -1.363961, -1, 1
0.9334918, 0, 2, -1.367596, -1, 1
0.9543169, 0, 2, -1.369452, -1, 1
0.9751419, 0, 2, -1.372722, -1, 1
0.9959669, 0, 2, -1.376043, -1, 1
1.016792, -1, 2, -1.378978, -1, 1
1.037617, -1, 2, -1.382015, -1, 1
1.058442, -1, 2, -1.383566, -1, 1
1.079267, -1, 2, -1.386244, -1, 1
1.100092, -1, 2, -1.389006, -1, 1
1.120917, -1, 2, -1.39149, -1, 1
1.141742, -1, 2, -1.393942, -1, 1
1.162567, -1, 2, -1.395246, -1, 1
1.183392, -1, 2, -1.397716, -1, 1
1.204217, -1, 2, -1.400177, -1, 1
1.225042, -1, 2, -1.402332, -1, 1
1.245867, -1, 2, -1.40408, -1, 1
1.266692, -1, 2, -1.405126, -1, 1
1.287517, -1, 2, -1.406924, -1, 1
1.308342, -1, 2, -1.408826, -1, 1
1.329167, -1, 2, -1.410244, -1, 1
1.349992, -1, 2, -1.411116, -1, 1
1.370817, -1, 2, -1.411646, -1, 1
1.391642, -1, 2, -1.412427, -1, 1
1.412467, -1, 2, -1.413424, -1, 1
1.433293, -1, 2, -1.414096, -1, 1
1.454118, -1, 2, -1.414941, -1, 1
1.474943, -1, 2, -1.415403, -1, 1
1.495768, -1, 2, -1.415977, -1, 1
1.516593, -1, 2, -1.416904, -1, 1
1.537418, -1, 2, -1.417411, -1, 1
1.558243, -1, 2, -1.417674, -1, 1
1.579068, -1, 2, -1.417782, -1, 1
1.599893, -1, 2, -1.417558, -1, 1
1.620718, -1, 2, -1.417258, -1, 1
1.641543, -1, 2, -1.416837, -1, 1
1.662368, -1, 2, -1.416366, -1, 1
1.683193, -1, 2, -1.415911, -1, 1
1.704018, -1, 2, -1.415305, -1, 1
1.724843, -1, 2, -1.414636, -1, 1
1.745668, -1, 2, -1.413209, -1, 1
1.766493, -1, 2, -1.411708, -1, 1
1.787318, -1, 2, -1.411035, -1, 1
1.808143, -1, 2, -1.409427, -1, 1
1.828968, -1, 2, -1.407622, -1, 1
1.849793, -1, 2, -1.405802, -1, 1
1.870618, -1, 2, -1.403594, -1, 1
1.891443, -1, 2, -1.402415, -1, 1
1.912268, -1, 2, -1.399566, -1, 1
1.933093, -1, 2, -1.396412, -1, 1
