car_pos_meter , car_pos_cell, car_speed, ped_pos_meter, ped_pos_cell, ped_speed
-41, 41, 2, 4.09721, 40, 1
-40.8334, 40, 2, 4.083541, 40, 1
-40.6668, 40, 2, 4.076653, 40, 1
-40.5002, 40, 2, 4.062049, 40, 1
-40.3336, 40, 2, 4.04728, 40, 1
-40.167, 40, 2, 4.031649, 40, 1
-40.0004, 40, 2, 4.016116, 40, 1
-39.83381, 39, 2, 4.000448, 40, 1
-39.66721, 39, 2, 3.983881, 39, 1
-39.50061, 39, 2, 3.975436, 39, 1
-39.33401, 39, 2, 3.958124, 39, 1
-39.16741, 39, 2, 3.940804, 39, 1
-39.00081, 39, 2, 3.923356, 39, 1
-38.83421, 38, 2, 3.90586, 39, 1
-38.66761, 38, 2, 3.897302, 38, 1
-38.50101, 38, 2, 3.880273, 38, 1
-38.33441, 38, 2, 3.863943, 38, 1
-38.16781, 38, 2, 3.847883, 38, 1
-38.00121, 38, 2, 3.831241, 38, 1
-37.83461, 37, 2, 3.822764, 38, 1
-37.66801, 37, 2, 3.804914, 38, 1
-37.50142, 37, 2, 3.796216, 37, 1
-37.33482, 37, 2, 3.769906, 37, 1
-37.16822, 37, 2, 3.751704, 37, 1
-37.00162, 37, 2, 3.742465, 37, 1
-36.83502, 36, 2, 3.723676, 37, 1
-36.66842, 36, 2, 3.705063, 37, 1
-36.50182, 36, 2, 3.685853, 36, 1
-36.33522, 36, 2, 3.676512, 36, 1
-36.16862, 36, 2, 3.65688, 36, 1
-36.00202, 36, 2, 3.637219, 36, 1
-35.83542, 35, 2, 3.607174, 36, 1
-35.66882, 35, 2, 3.597319, 35, 1
-35.50222, 35, 2, 3.587559, 35, 1
-35.33562, 35, 2, 3.567631, 35, 1
-35.16903, 35, 2, 3.547941, 35, 1
-35.00243, 35, 2, 3.528252, 35, 1
-34.83583, 34, 2, 3.509097, 35, 1
-34.66923, 34, 2, 3.489548, 34, 1
-34.50263, 34, 2, 3.479356, 34, 1
-34.33603, 34, 2, 3.460796, 34, 1
-34.16943, 34, 2, 3.442071, 34, 1
-34.00283, 34, 2, 3.422466, 34, 1
-33.83623, 33, 2, 3.404163, 34, 1
-33.66963, 33, 2, 3.395182, 33, 1
-33.50303, 33, 2, 3.377075, 33, 1
-33.33643, 33, 2, 3.358609, 33, 1
-33.16983, 33, 2, 3.3412, 33, 1
-33.00323, 33, 2, 3.324601, 33, 1
-32.83664, 32, 2, 3.316104, 33, 1
-32.67004, 32, 2, 3.299458, 32, 1
-32.50344, 32, 2, 3.282715, 32, 1
-32.33684, 32, 2, 3.266047, 32, 1
-32.17024, 32, 2, 3.257775, 32, 1
-32.00364, 32, 2, 3.241027, 32, 1
-31.83704, 31, 2, 3.223695, 32, 1
-31.67044, 31, 2, 3.205578, 32, 1
-31.50384, 31, 2, 3.187075, 31, 1
-31.33724, 31, 2, 3.177657, 31, 1
-31.17064, 31, 2, 3.158277, 31, 1
-31.00404, 31, 2, 3.138799, 31, 1
-30.83744, 30, 2, 3.118563, 31, 1
-30.67085, 30, 2, 3.098033, 30, 1
-30.50425, 30, 2, 3.087491, 30, 1
-30.33765, 30, 2, 3.066088, 30, 1
-30.17105, 30, 2, 3.044459, 30, 1
-30.00445, 30, 2, 3.02174, 30, 1
-29.83785, 29, 2, 2.999221, 29, 1
-29.67125, 29, 2, 2.976521, 29, 1
-29.50465, 29, 2, 2.964352, 29, 1
-29.33805, 29, 2, 2.940518, 29, 1
-29.17145, 29, 2, 2.916563, 29, 1
-29.00485, 29, 2, 2.893521, 28, 1
-28.83825, 28, 2, 2.870437, 28, 1
-28.67165, 28, 2, 2.858629, 28, 1
-28.50505, 28, 2, 2.836962, 28, 1
-28.33846, 28, 2, 2.8151, 28, 1
-28.17186, 28, 2, 2.792518, 27, 1
-28.00526, 28, 2, 2.769587, 27, 1
-27.83866, 27, 2, 2.757565, 27, 1
-27.67206, 27, 2, 2.73419, 27, 1
-27.50546, 27, 2, 2.710399, 27, 1
-27.33886, 27, 2, 2.685918, 26, 1
-27.17226, 27, 2, 2.662427, 26, 1
-27.00566, 27, 2, 2.64994, 26, 1
-26.83906, 26, 2, 2.625149, 26, 1
-26.67246, 26, 2, 2.599866, 25, 1
-26.50586, 26, 2, 2.57463, 25, 1
-26.33926, 26, 2, 2.549705, 25, 1
-26.17266, 26, 2, 2.536692, 25, 1
-26.00607, 26, 2, 2.511522, 25, 1
-25.83947, 25, 2, 2.485771, 24, 1
-25.67287, 25, 2, 2.460548, 24, 1
-25.50627, 25, 2, 2.448228, 24, 1
-25.33967, 25, 2, 2.42445, 24, 1
-25.17307, 25, 2, 2.402075, 24, 1
-25.00647, 25, 2, 2.377096, 23, 1
-24.83987, 24, 2, 2.353373, 23, 1
-24.67327, 24, 2, 2.342653, 23, 1
-24.50667, 24, 2, 2.3196, 23, 1
-24.34007, 24, 2, 2.296774, 22, 1
-24.17347, 24, 2, 2.27443, 22, 1
-24.00687, 24, 2, 2.251829, 22, 1
-23.84027, 23, 2, 2.229698, 22, 1
-23.67368, 23, 2, 2.218389, 22, 1
-23.50708, 23, 2, 2.197034, 21, 1
-23.34048, 23, 2, 2.175668, 21, 1
-23.17388, 23, 2, 2.154877, 21, 1
-23.00728, 23, 2, 2.134836, 21, 1
-22.84068, 22, 2, 2.12435, 21, 1
-22.67408, 22, 2, 2.104202, 21, 1
-22.50748, 22, 2, 2.083813, 20, 1
-22.34088, 22, 2, 2.062769, 20, 1
-22.17428, 22, 2, 2.042014, 20, 1
-22.00768, 22, 2, 2.031442, 20, 1
-21.84108, 21, 2, 2.010025, 20, 1
-21.67448, 21, 2, 1.987898, 19, 1
-21.50788, 21, 2, 1.965187, 19, 1
-21.34129, 21, 2, 1.94226, 19, 1
-21.17469, 21, 2, 1.930173, 19, 1
-21.00809, 21, 2, 1.906443, 19, 1
-20.84149, 20, 2, 1.881612, 18, 1
-20.67489, 20, 2, 1.856194, 18, 1
-20.50829, 20, 2, 1.831249, 18, 1
-20.34169, 20, 2, 1.818601, 18, 1
-20.17509, 20, 2, 1.792696, 17, 1
-20.00849, 20, 2, 1.766984, 17, 1
-19.84189, 19, 2, 1.743073, 17, 1
-19.67529, 19, 2, 1.719505, 17, 1
-19.50869, 19, 2, 1.707948, 17, 1
-19.34209, 19, 2, 1.685737, 16, 1
-19.1755, 19, 2, 1.663467, 16, 1
-19.0089, 19, 2, 1.641496, 16, 1
-18.8423, 18, 2, 1.619859, 16, 1
-18.6757, 18, 2, 1.608915, 16, 1
-18.5091, 18, 2, 1.587301, 15, 1
-18.3425, 18, 2, 1.565342, 15, 1
-18.1759, 18, 2, 1.542458, 15, 1
-18.0093, 18, 2, 1.520031, 15, 1
-17.8427, 17, 2, 1.508486, 15, 1
-17.6761, 17, 2, 1.485388, 14, 1
-17.5095, 17, 2, 1.462354, 14, 1
-17.3429, 17, 2, 1.438259, 14, 1
-17.1763, 17, 2, 1.414071, 14, 1
-17.0097, 17, 2, 1.402045, 14, 1
-16.84311, 16, 2, 1.377774, 13, 1
-16.67651, 16, 2, 1.353993, 13, 1
-16.50991, 16, 2, 1.341566, 13, 1
-16.34331, 16, 2, 1.304742, 13, 1
-16.17671, 16, 2, 1.292808, 12, 1
-16.01011, 16, 2, 1.268621, 12, 1
-15.84351, 15, 2, 1.244221, 12, 1
-15.67691, 15, 2, 1.21943, 12, 1
-15.51031, 15, 2, 1.195527, 11, 1
-15.34371, 15, 2, 1.183753, 11, 1
-15.17711, 15, 2, 1.159544, 11, 1
-15.01051, 15, 2, 1.136592, 11, 1
-14.84391, 14, 2, 1.114904, 11, 1
-14.67731, 14, 2, 1.093688, 10, 1
-14.51071, 14, 2, 1.083188, 10, 1
-14.34411, 14, 2, 1.062421, 10, 1
-14.17751, 14, 2, 1.042748, 10, 1
-14.01091, 14, 2, 1.022872, 10, 1
-13.84431, 13, 2, 1.013185, 10, 1
-13.6777, 13, 2, 0.9932652, 9, 1
-13.5111, 13, 2, 0.9734995, 9, 1
-13.3445, 13, 2, 0.9536276, 9, 1
-13.1779, 13, 2, 0.9331856, 9, 1
-13.0113, 13, 2, 0.9125323, 9, 1
-12.8447, 12, 2, 0.9020808, 9, 1
-12.6781, 12, 2, 0.8807981, 8, 1
-12.5115, 12, 2, 0.8592775, 8, 1
-12.3449, 12, 2, 0.8374012, 8, 1
-12.1783, 12, 2, 0.8145447, 8, 1
-12.0117, 12, 2, 0.8036146, 8, 1
-11.8451, 11, 2, 0.7810712, 7, 1
-11.6785, 11, 2, 0.7583485, 7, 1
-11.5119, 11, 2, 0.7348886, 7, 1
-11.3453, 11, 2, 0.7122357, 7, 1
-11.1787, 11, 2, 0.7006845, 7, 1
-11.0121, 11, 2, 0.6776357, 6, 1
-10.8455, 10, 2, 0.6537859, 6, 1
-10.6789, 10, 2, 0.6302969, 6, 1
-10.5123, 10, 2, 0.6072524, 6, 1
-10.3457, 10, 2, 0.5961742, 5, 1
-10.1791, 10, 2, 0.5745692, 5, 1
-10.0125, 10, 2, 0.5533147, 5, 1
-9.8459, 9, 2, 0.532377, 5, 1
-9.679299, 9, 2, 0.5106699, 5, 1
-9.512699, 9, 2, 0.4883788, 4, 1
-9.346099, 9, 2, 0.477695, 4, 1
-9.179499, 9, 2, 0.4558983, 4, 1
-9.012898, 9, 2, 0.4334702, 4, 1
-8.846298, 8, 2, 0.4107361, 4, 1
-8.679698, 8, 2, 0.3994849, 3, 1
-8.513098, 8, 2, 0.3768835, 3, 1
-8.346498, 8, 2, 0.3538637, 3, 1
-8.179897, 8, 2, 0.3305819, 3, 1
-8.013297, 8, 2, 0.3072681, 3, 1
-7.846697, 7, 2, 0.2843766, 2, 1
-7.680097, 7, 2, 0.2724311, 2, 1
-7.513496, 7, 2, 0.2499058, 2, 1
-7.346896, 7, 2, 0.2274685, 2, 1
-7.180296, 7, 2, 0.205718, 2, 1
-7.013696, 7, 2, 0.1951618, 1, 1
-6.847095, 6, 2, 0.1731596, 1, 1
-6.680495, 6, 2, 0.1510682, 1, 1
-6.513895, 6, 2, 0.1271124, 1, 1
-6.347295, 6, 2, 0.1035998, 1, 1
-6.180695, 6, 2, 0.08064508, 0, 1
-6.014094, 6, 2, 0.0688014, 0, 1
-5.847494, 5, 2, 0.04464197, 0, 1
-5.680894, 5, 2, 0.01982737, 0, 1
-5.514294, 5, 2, -0.005238056, 0, 1
-5.347693, 5, 2, -0.02993679, 0, 1
-5.181093, 5, 2, -0.04260063, 0, 1
-5.014493, 5, 2, -0.06740093, 0, 1
-4.847893, 4, 2, -0.0912199, 0, 1
-4.681293, 4, 2, -0.1143179, -1, 1
-4.514692, 4, 2, -0.1363797, -1, 1
-4.348092, 4, 2, -0.147119, -1, 1
-4.181492, 4, 2, -0.1671944, -1, 1
-4.014892, 4, 2, -0.1871138, -1, 1
-3.848292, 3, 2, -0.2078724, -2, 1
-3.681692, 3, 2, -0.2287955, -2, 1
-3.515092, 3, 2, -0.2398603, -2, 1
-3.348492, 3, 2, -0.2631435, -2, 1
-3.181892, 3, 2, -0.2872491, -2, 1
-3.015292, 3, 2, -0.3125534, -3, 1
-2.848692, 2, 2, -0.3252454, -3, 1
-2.682092, 2, 2, -0.3516238, -3, 1
-2.515492, 2, 2, -0.3775172, -3, 1
-2.348892, 2, 2, -0.4033768, -4, 1
-2.182292, 2, 2, -0.4287648, -4, 1
-2.015692, 2, 2, -0.4410872, -4, 1
-1.849092, 1, 2, -0.4641509, -4, 1
-1.682492, 1, 2, -0.4845963, -4, 1
-1.515892, 1, 2, -0.5066733, -5, 1
-1.349292, 1, 2, -0.5280032, -5, 1
-1.182692, 1, 2, -0.5387073, -5, 1
-1.016092, 1, 2, -0.5598092, -5, 1
-0.8494921, 0, 2, -0.5796685, -5, 1
-0.6828921, 0, 2, -0.5991235, -5, 1
-0.5162921, 0, 2, -0.6084487, -6, 1
-0.3496921, 0, 2, -0.627079, -6, 1
-0.1830921, 0, 2, -0.6465721, -6, 1
-0.01649214, 0, 2, -0.6658292, -6, 1
0.1501078, 0, 2, -0.6842031, -6, 1
0.3167078, 0, 2, -0.6935616, -6, 1
0.4833078, 0, 2, -0.7118907, -7, 1
0.6499078, 0, 2, -0.7295742, -7, 1
0.8165078, 0, 2, -0.7469754, -7, 1
0.9831078, 0, 2, -0.7641578, -7, 1
1.149708, -1, 2, -0.781481, -7, 1
1.316308, -1, 2, -0.7902675, -7, 1
1.482908, -1, 2, -0.8083992, -8, 1
1.649508, -1, 2, -0.8269386, -8, 1
1.816108, -1, 2, -0.8455708, -8, 1
1.982708, -1, 2, -0.8646612, -8, 1
2.149308, -2, 2, -0.8741241, -8, 1
2.315908, -2, 2, -0.8930931, -8, 1
2.482508, -2, 2, -0.9126916, -9, 1
2.649108, -2, 2, -0.93152, -9, 1
2.815708, -2, 2, -0.9493556, -9, 1
2.982308, -2, 2, -0.9587502, -9, 1
3.148908, -3, 2, -0.9793792, -9, 1
3.315508, -3, 2, -0.9986639, -9, 1
3.482108, -3, 2, -1.018746, -10, 1
3.648708, -3, 2, -1.038555, -10, 1
3.815308, -3, 2, -1.047673, -10, 1
3.981908, -3, 2, -1.064859, -10, 1
4.148508, -4, 2, -1.080912, -10, 1
4.315108, -4, 2, -1.09617, -10, 1
4.481709, -4, 2, -1.111044, -11, 1
4.648309, -4, 2, -1.125746, -11, 1
4.814909, -4, 2, -1.132817, -11, 1
4.981509, -4, 2, -1.146437, -11, 1
5.148109, -5, 2, -1.159663, -11, 1
5.31471, -5, 2, -1.172265, -11, 1
5.48131, -5, 2, -1.178457, -11, 1
5.64791, -5, 2, -1.190939, -11, 1
5.81451, -5, 2, -1.202657, -12, 1
5.981111, -5, 2, -1.214074, -12, 1
6.147711, -6, 2, -1.225269, -12, 1
6.314311, -6, 2, -1.230462, -12, 1
6.480911, -6, 2, -1.239954, -12, 1
6.647511, -6, 2, -1.246955, -12, 1
6.814112, -6, 2, -1.253643, -12, 1
6.980712, -6, 2, -1.259913, -12, 1
7.147312, -7, 2, -1.262726, -12, 1
7.313912, -7, 2, -1.269734, -12, 1
7.480513, -7, 2, -1.278495, -12, 1
7.647113, -7, 2, -1.287919, -12, 1
7.813713, -7, 2, -1.296368, -12, 1
7.980313, -7, 2, -1.304645, -13, 1
8.146914, -8, 2, -1.308961, -13, 1
8.313514, -8, 2, -1.31715, -13, 1
8.480114, -8, 2, -1.32531, -13, 1
8.646714, -8, 2, -1.333031, -13, 1
8.813314, -8, 2, -1.336685, -13, 1
8.979915, -8, 2, -1.343866, -13, 1
9.146515, -9, 2, -1.351243, -13, 1
9.313115, -9, 2, -1.358379, -13, 1
9.479715, -9, 2, -1.364694, -13, 1
9.646316, -9, 2, -1.369757, -13, 1
9.812916, -9, 2, -1.372365, -13, 1
9.979516, -9, 2, -1.377018, -13, 1
10.14612, -10, 2, -1.381919, -13, 1
10.31272, -10, 2, -1.386447, -13, 1
10.47932, -10, 2, -1.388492, -13, 1
10.64592, -10, 2, -1.391881, -13, 1
10.81252, -10, 2, -1.394245, -13, 1
10.97912, -10, 2, -1.396139, -13, 1
11.14572, -11, 2, -1.397048, -13, 1
11.31232, -11, 2, -1.397022, -13, 1
11.47892, -11, 2, -1.397144, -13, 1
11.64552, -11, 2, -1.396641, -13, 1
11.81212, -11, 2, -1.396382, -13, 1
11.97872, -11, 2, -1.395971, -13, 1
12.14532, -12, 2, -1.395207, -13, 1
12.31192, -12, 2, -1.39506, -13, 1
12.47852, -12, 2, -1.394821, -13, 1
12.64512, -12, 2, -1.395367, -13, 1
12.81172, -12, 2, -1.39594, -13, 1
12.97832, -12, 2, -1.396767, -13, 1
13.14492, -13, 2, -1.397154, -13, 1
13.31152, -13, 2, -1.397945, -13, 1
13.47812, -13, 2, -1.399626, -13, 1
13.64472, -13, 2, -1.401022, -14, 1
13.81132, -13, 2, -1.401538, -14, 1
13.97792, -13, 2, -1.402346, -14, 1
14.14452, -14, 2, -1.403493, -14, 1
14.31112, -14, 2, -1.404265, -14, 1
14.47772, -14, 2, -1.404749, -14, 1
14.64432, -14, 2, -1.404555, -14, 1
14.81092, -14, 2, -1.403891, -14, 1
14.97752, -14, 2, -1.402238, -14, 1
15.14412, -15, 2, -1.400041, -14, 1
15.31072, -15, 2, -1.395767, -13, 1
15.47732, -15, 2, -1.390979, -13, 1
15.64392, -15, 2, -1.388003, -13, 1
15.81052, -15, 2, -1.380708, -13, 1
15.97712, -15, 2, -1.373106, -13, 1
16.14372, -16, 2, -1.36408, -13, 1
16.31032, -16, 2, -1.354332, -13, 1
16.47692, -16, 2, -1.349314, -13, 1
16.64352, -16, 2, -1.338158, -13, 1
16.81012, -16, 2, -1.326111, -13, 1
16.97672, -16, 2, -1.313874, -13, 1
17.14332, -17, 2, -1.300977, -13, 1
17.30992, -17, 2, -1.295079, -12, 1
17.47652, -17, 2, -1.282271, -12, 1
17.64312, -17, 2, -1.269598, -12, 1
17.80972, -17, 2, -1.256291, -12, 1
17.97631, -17, 2, -1.249294, -12, 1
18.14291, -18, 2, -1.235208, -12, 1
18.30951, -18, 2, -1.22107, -12, 1
18.47611, -18, 2, -1.206115, -12, 1
18.64271, -18, 2, -1.191068, -11, 1
18.80931, -18, 2, -1.176645, -11, 1
18.97591, -18, 2, -1.168334, -11, 1
19.14251, -19, 2, -1.153385, -11, 1
19.30911, -19, 2, -1.129889, -11, 1
19.47571, -19, 2, -1.122334, -11, 1
19.64231, -19, 2, -1.106877, -11, 1
19.80891, -19, 2, -1.099776, -10, 1
19.97551, -19, 2, -1.084958, -10, 1
20.14211, -20, 2, -1.070412, -10, 1
20.3087, -20, 2, -1.057357, -10, 1
20.4753, -20, 2, -1.044018, -10, 1
20.6419, -20, 2, -1.030636, -10, 1
20.8085, -20, 2, -1.024198, -10, 1
20.9751, -20, 2, -1.010411, -10, 1
21.1417, -21, 2, -0.9969196, -9, 1
21.3083, -21, 2, -0.9907117, -9, 1
21.4749, -21, 2, -0.9774542, -9, 1
21.6415, -21, 2, -0.9649425, -9, 1
21.8081, -21, 2, -0.9523158, -9, 1
21.9747, -21, 2, -0.9460874, -9, 1
