car_pos_meter , car_pos_cell, car_speed, ped_pos_meter, ped_pos_cell, ped_speed
-5.125, 5, 1, 4.097819, 5, 1
-5.122125, 5, 1, 4.092257, 5, 1
-5.11925, 5, 1, 4.080938, 5, 1
-5.116375, 5, 2, 4.069346, 5, 1
-4.741527, 4, 2, 3.866284, 5, 1
-4.220904, 4, 1, 3.60037, 4, 1
-4.149033, 4, 2, 3.337647, 4, 1
-3.62841, 3, 2, 3.158064, 4, 1
-3.107788, 3, 1, 3.029597, 3, 1
-3.03591, 3, 2, 2.975063, 3, 1
-2.515288, 2, 2, 2.954668, 3, 1
-1.994665, 1, 2, 2.943453, 3, 1
-1.474039, 1, 2, 2.94566, 3, 1
-0.9534134, 0, 2, 2.940187, 3, 1
-0.4327878, 0, 2, 2.902895, 3, 1
0.06701219, 0, 2, 2.797997, 3, 1
0.5876373, 0, 2, 2.767629, 3, 1
1.108263, -1, 2, 2.622078, 3, 1
1.628889, -1, 2, 2.291492, 2, 1
2.149513, -2, 2, 1.958753, 2, 1
2.670136, -2, 2, 1.561494, 2, 1
3.190759, -3, 2, 1.143337, 1, 1
3.711382, -3, 2, 0.8227351, 1, 1
4.232005, -4, 2, 0.4504688, 0, 1
4.752627, -4, 2, 0.03095555, 0, 1
5.27325, -5, 2, -0.2961869, 0, 1
5.793873, -5, 2, -0.6347599, 0, 1
6.314496, -6, 2, -0.8315654, -1, 1
6.835118, -6, 2, -0.8995385, -1, 1
7.355741, -7, 2, -0.9970107, -1, 1
7.876364, -7, 2, -1.06912, -1, 1
8.396996, -8, 2, -0.952137, -1, 1
8.91763, -8, 2, -0.6216955, 0, 1
9.438265, -9, 2, -0.2529597, 0, 1
