car_pos_meter , car_pos_cell, car_speed, ped_pos_meter, ped_pos_cell, ped_speed
-5.125, 5, 2, 3.997866, 5, 1
-5.104175, 5, 1, 3.982265, 5, 1
-5.0938, 5, 1, 3.967221, 5, 1
-5.083425, 5, 2, 3.952095, 5, 1
-5.0626, 5, 1, 3.944786, 5, 1
-5.052225, 5, 2, 3.930486, 5, 1
-5.0314, 5, 1, 3.916332, 5, 1
-5.021025, 5, 1, 3.902678, 5, 1
-5.01065, 5, 1, 3.88912, 5, 1
-5.000275, 5, 2, 3.882465, 5, 1
-4.97945, 4, 2, 3.86868, 5, 1
-4.958625, 4, 2, 3.854926, 5, 1
-4.9378, 4, 2, 3.840963, 4, 1
-4.916975, 4, 2, 3.826332, 4, 1
-4.896151, 4, 2, 3.819118, 4, 1
-4.875326, 4, 1, 3.803351, 4, 1
-4.864951, 4, 1, 3.787221, 4, 1
-4.854576, 4, 1, 3.770838, 4, 1
-4.844201, 4, 2, 3.753602, 4, 1
-4.823376, 4, 2, 3.745002, 4, 1
-4.802551, 4, 1, 3.726926, 4, 1
-4.792176, 4, 1, 3.707984, 4, 1
-4.781801, 4, 2, 3.688776, 4, 1
-4.760976, 4, 2, 3.668947, 4, 1
-4.740151, 4, 2, 3.659041, 4, 1
-4.719326, 4, 1, 3.638671, 4, 1
-4.708951, 4, 1, 3.618554, 4, 1
-4.698576, 4, 2, 3.598313, 4, 1
-4.677751, 4, 2, 3.577556, 4, 1
-4.656926, 4, 2, 3.567292, 4, 1
-4.636101, 4, 1, 3.546672, 4, 1
-4.625726, 4, 1, 3.525594, 4, 1
-4.615351, 4, 2, 3.504825, 4, 1
-4.594526, 4, 1, 3.484085, 4, 1
-4.584151, 4, 2, 3.474136, 4, 1
-4.563326, 4, 1, 3.453919, 4, 1
-4.552951, 4, 1, 3.433651, 4, 1
-4.542576, 4, 2, 3.413806, 4, 1
-4.521751, 4, 1, 3.393572, 4, 1
-4.511376, 4, 1, 3.383724, 4, 1
-4.501001, 4, 1, 3.363474, 4, 1
-4.490626, 4, 1, 3.343174, 4, 1
-4.480251, 4, 2, 3.323166, 4, 1
-4.459426, 4, 1, 3.303115, 4, 1
-4.449051, 4, 2, 3.293357, 4, 1
-4.428226, 4, 1, 3.273601, 4, 1
-4.417851, 4, 1, 3.253459, 4, 1
-4.407476, 4, 2, 3.233299, 4, 1
-4.386652, 4, 1, 3.212746, 4, 1
-4.376276, 4, 1, 3.202714, 4, 1
-4.365901, 4, 1, 3.182281, 4, 1
-4.355526, 4, 2, 3.161983, 4, 1
-4.334702, 4, 2, 3.141861, 4, 1
-4.313877, 4, 1, 3.120993, 4, 1
-4.303502, 4, 1, 3.110498, 4, 1
-4.293127, 4, 1, 3.089455, 4, 1
-4.282752, 4, 2, 3.06843, 3, 1
-4.261927, 4, 2, 3.047327, 3, 1
-4.241102, 4, 2, 3.025266, 3, 1
-4.220277, 4, 2, 3.014787, 3, 1
-4.199452, 4, 2, 2.993662, 3, 1
-4.178627, 4, 2, 2.972976, 3, 1
-4.157802, 4, 2, 2.953144, 3, 1
-4.136977, 4, 2, 2.933585, 3, 1
-4.116152, 4, 2, 2.92419, 3, 1
-4.095327, 4, 2, 2.905828, 3, 1
-4.074502, 4, 2, 2.887272, 3, 1
-4.053678, 4, 2, 2.869656, 3, 1
-4.032853, 4, 2, 2.852166, 3, 1
-4.012028, 4, 2, 2.843535, 3, 1
-3.991203, 3, 1, 2.826601, 3, 1
-3.980828, 3, 2, 2.809616, 3, 1
-3.960003, 3, 1, 2.792977, 3, 1
-3.949628, 3, 1, 2.775744, 3, 1
-3.939253, 3, 1, 2.767345, 3, 1
-3.928878, 3, 1, 2.750086, 3, 1
-3.918503, 3, 2, 2.733206, 3, 1
-3.897678, 3, 1, 2.716493, 3, 1
-3.887303, 3, 1, 2.699289, 3, 1
-3.876928, 3, 1, 2.690692, 3, 1
-3.866553, 3, 1, 2.672783, 3, 1
-3.856178, 3, 2, 2.654672, 3, 1
-3.835353, 3, 1, 2.636516, 3, 1
-3.824978, 3, 2, 2.61815, 3, 1
-3.804153, 3, 2, 2.599528, 3, 1
-3.783328, 3, 2, 2.589962, 3, 1
-3.762503, 3, 2, 2.570224, 3, 1
-3.741678, 3, 1, 2.550452, 3, 1
-3.731303, 3, 1, 2.530349, 3, 1
-3.720928, 3, 1, 2.520254, 3, 1
-3.710553, 3, 1, 2.500119, 3, 1
-3.700178, 3, 1, 2.479152, 3, 1
-3.689803, 3, 1, 2.457961, 3, 1
-3.679428, 3, 1, 2.436301, 3, 1
-3.669053, 3, 2, 2.414857, 3, 1
-3.648228, 3, 2, 2.40444, 3, 1
-3.627403, 3, 2, 2.38406, 3, 1
-3.606578, 3, 1, 2.364062, 3, 1
-3.596203, 3, 1, 2.344644, 3, 1
-3.585828, 3, 2, 2.325124, 3, 1
-3.565003, 3, 2, 2.315432, 3, 1
-3.544178, 3, 2, 2.29652, 2, 1
-3.523354, 3, 2, 2.27765, 2, 1
-3.502529, 3, 2, 2.258687, 2, 1
-3.481704, 3, 2, 2.240206, 2, 1
-3.460879, 3, 2, 2.2311, 2, 1
-3.440054, 3, 2, 2.212849, 2, 1
-3.419229, 3, 2, 2.19452, 2, 1
-3.398404, 3, 2, 2.176049, 2, 1
-3.377579, 3, 2, 2.166439, 2, 1
-3.356754, 3, 2, 2.148044, 2, 1
-3.335929, 3, 2, 2.129269, 2, 1
-3.315104, 3, 2, 2.109951, 2, 1
-3.29428, 3, 2, 2.090354, 2, 1
-3.273455, 3, 2, 2.070508, 2, 1
-3.25263, 3, 2, 2.060788, 2, 1
-3.231805, 3, 2, 2.041028, 2, 1
-3.21098, 3, 2, 2.021368, 2, 1
-3.190155, 3, 2, 2.001252, 2, 1
-3.16933, 3, 2, 1.980898, 2, 1
-3.148505, 3, 2, 1.970914, 2, 1
-3.12768, 3, 2, 1.950938, 2, 1
-3.106855, 3, 2, 1.931206, 2, 1
-3.08603, 3, 2, 1.912287, 2, 1
-3.065206, 3, 2, 1.893424, 2, 1
-3.044381, 3, 2, 1.88425, 2, 1
-3.023556, 3, 2, 1.865919, 2, 1
-3.002731, 3, 2, 1.847864, 2, 1
-2.981906, 2, 2, 1.829849, 2, 1
-2.961081, 2, 2, 1.812532, 2, 1
-2.940256, 2, 1, 1.804167, 2, 1
-2.929881, 2, 1, 1.787986, 2, 1
-2.919506, 2, 2, 1.771759, 2, 1
-2.898681, 2, 1, 1.755334, 2, 1
-2.888306, 2, 1, 1.739229, 2, 1
-2.877931, 2, 1, 1.731161, 2, 1
-2.867556, 2, 1, 1.714802, 2, 1
-2.857181, 2, 2, 1.698036, 2, 1
-2.836356, 2, 2, 1.68096, 2, 1
-2.815531, 2, 2, 1.663292, 2, 1
-2.794706, 2, 1, 1.654171, 2, 1
-2.784331, 2, 1, 1.636096, 2, 1
-2.773956, 2, 2, 1.6172, 2, 1
-2.753131, 2, 2, 1.597985, 2, 1
-2.732306, 2, 1, 1.578271, 2, 1
-2.721931, 2, 1, 1.568362, 2, 1
-2.711556, 2, 1, 1.5483, 2, 1
-2.701181, 2, 2, 1.528531, 1, 1
-2.680357, 2, 2, 1.508182, 1, 1
-2.659532, 2, 2, 1.488074, 1, 1
-2.638707, 2, 2, 1.478199, 1, 1
-2.617882, 2, 2, 1.458737, 1, 1
-2.597057, 2, 2, 1.438746, 1, 1
-2.576232, 2, 2, 1.419417, 1, 1
-2.555407, 2, 2, 1.399875, 1, 1
-2.534582, 2, 2, 1.390386, 1, 1
-2.513757, 2, 2, 1.371445, 1, 1
-2.492932, 2, 2, 1.352388, 1, 1
-2.472107, 2, 2, 1.33357, 1, 1
-2.451283, 2, 2, 1.314683, 1, 1
-2.430458, 2, 2, 1.30509, 1, 1
-2.409633, 2, 2, 1.286489, 1, 1
-2.388808, 2, 2, 1.268052, 1, 1
-2.367983, 2, 2, 1.249258, 1, 1
-2.347158, 2, 2, 1.230573, 1, 1
-2.326333, 2, 2, 1.22103, 1, 1
-2.305508, 2, 2, 1.202265, 1, 1
-2.284683, 2, 2, 1.18391, 1, 1
-2.263858, 2, 2, 1.165959, 1, 1
-2.243033, 2, 2, 1.148377, 1, 1
-2.222208, 2, 2, 1.139402, 1, 1
-2.201384, 2, 2, 1.121346, 1, 1
-2.180559, 2, 2, 1.102979, 1, 1
-2.159734, 2, 2, 1.085175, 1, 1
-2.138909, 2, 2, 1.067249, 1, 1
-2.118084, 2, 2, 1.058079, 1, 1
-2.097259, 2, 2, 1.040252, 1, 1
-2.076434, 2, 2, 1.021613, 1, 1
-2.055609, 2, 2, 1.00322, 1, 1
-2.034784, 2, 2, 0.9850914, 1, 1
-2.013959, 2, 2, 0.9760692, 1, 1
-1.993134, 1, 2, 0.9580133, 1, 1
-1.972309, 1, 2, 0.9392571, 1, 1
-1.951484, 1, 2, 0.9211557, 1, 1
-1.930659, 1, 2, 0.9024887, 1, 1
-1.909834, 1, 2, 0.8929396, 1, 1
-1.889009, 1, 2, 0.8741717, 1, 1
-1.868184, 1, 2, 0.8550816, 1, 1
-1.847359, 1, 2, 0.8360031, 1, 1
-1.826534, 1, 2, 0.8169384, 1, 1
-1.805709, 1, 2, 0.8071725, 1, 1
-1.784884, 1, 2, 0.7885282, 1, 1
-1.764059, 1, 2, 0.7699647, 1, 1
-1.743234, 1, 2, 0.7514889, 0, 1
-1.722409, 1, 2, 0.7332132, 0, 1
-1.701584, 1, 2, 0.7240639, 0, 1
-1.680759, 1, 2, 0.7065609, 0, 1
-1.659934, 1, 2, 0.6891434, 0, 1
-1.639109, 1, 2, 0.6717935, 0, 1
-1.618284, 1, 2, 0.6546052, 0, 1
-1.597459, 1, 2, 0.6458931, 0, 1
-1.576634, 1, 2, 0.6285951, 0, 1
-1.555809, 1, 2, 0.6108024, 0, 1
-1.534984, 1, 2, 0.5927374, 0, 1
-1.514159, 1, 2, 0.5746818, 0, 1
-1.493334, 1, 2, 0.5652695, 0, 1
-1.472509, 1, 2, 0.5467343, 0, 1
-1.451684, 1, 2, 0.5276072, 0, 1
-1.430859, 1, 2, 0.5080578, 0, 1
-1.410034, 1, 2, 0.4878135, 0, 1
-1.389209, 1, 2, 0.4772222, 0, 1
-1.368384, 1, 2, 0.4561281, 0, 1
-1.347558, 1, 2, 0.4339778, 0, 1
-1.326733, 1, 2, 0.411274, 0, 1
-1.305908, 1, 2, 0.388252, 0, 1
-1.285083, 1, 2, 0.3763649, 0, 1
-1.264258, 1, 2, 0.3537455, 0, 1
-1.243433, 1, 2, 0.3309894, 0, 1
-1.222608, 1, 2, 0.308166, 0, 1
-1.201783, 1, 2, 0.2872958, 0, 1
-1.180958, 1, 2, 0.2774563, 0, 1
-1.160133, 1, 2, 0.2592225, 0, 1
-1.139308, 1, 2, 0.2419729, 0, 1
-1.118483, 1, 2, 0.2250605, 0, 1
-1.097658, 1, 2, 0.208447, 0, 1
-1.076833, 1, 2, 0.2006488, 0, 1
-1.056008, 1, 2, 0.1855342, 0, 1
-1.035183, 1, 2, 0.1718302, 0, 1
-1.014358, 1, 2, 0.1586678, 0, 1
-0.993533, 0, 2, 0.1458409, 0, 1
-0.972708, 0, 2, 0.1397858, 0, 1
-0.951883, 0, 2, 0.1273947, 0, 1
-0.9310579, 0, 2, 0.1162446, 0, 1
-0.9102329, 0, 2, 0.1047239, 0, 1
-0.8894079, 0, 2, 0.092803, 0, 1
-0.8685828, 0, 2, 0.08652663, 0, 1
-0.8477578, 0, 2, 0.07393956, 0, 1
-0.8269328, 0, 2, 0.06130767, 0, 1
-0.8061078, 0, 2, 0.04835916, 0, 1
-0.7852827, 0, 2, 0.03540397, 0, 1
-0.7644577, 0, 2, 0.028543, 0, 1
-0.7436327, 0, 2, 0.01534677, 0, 1
-0.7228076, 0, 2, 0.002044678, 0, 1
-0.7019826, 0, 2, -0.01116514, 0, 1
-0.6811576, 0, 2, -0.02464676, 0, 1
-0.6603326, 0, 2, -0.03170109, 0, 1
-0.6395075, 0, 2, -0.04604053, 0, 1
-0.6186825, 0, 2, -0.05998039, 0, 1
-0.5978575, 0, 2, -0.07436371, 0, 1
-0.5770324, 0, 2, -0.08872175, 0, 1
-0.5562074, 0, 2, -0.09601784, 0, 1
-0.5353824, 0, 2, -0.1105285, 0, 1
-0.5145574, 0, 2, -0.1255503, 0, 1
-0.4937324, 0, 2, -0.1405716, 0, 1
-0.4729074, 0, 2, -0.1553707, 0, 1
-0.4520824, 0, 2, -0.1625977, 0, 1
-0.4312574, 0, 2, -0.1768827, 0, 1
-0.4104324, 0, 2, -0.1908655, 0, 1
-0.3896074, 0, 2, -0.2047153, 0, 1
-0.3687824, 0, 2, -0.2189107, 0, 1
-0.3479574, 0, 2, -0.2260551, 0, 1
-0.3271324, 0, 2, -0.2398858, 0, 1
-0.3063074, 0, 2, -0.2534809, 0, 1
-0.2854824, 0, 2, -0.2665348, 0, 1
-0.2646574, 0, 2, -0.2798877, 0, 1
-0.2438324, 0, 2, -0.28651, 0, 1
-0.2230074, 0, 2, -0.2998147, 0, 1
-0.2021824, 0, 2, -0.3121104, 0, 1
-0.1813574, 0, 2, -0.324255, 0, 1
-0.1605324, 0, 2, -0.3367977, 0, 1
-0.1397074, 0, 2, -0.343267, 0, 1
-0.1188824, 0, 2, -0.3567524, 0, 1
-0.09805739, 0, 2, -0.3703561, 0, 1
-0.07723239, 0, 2, -0.3841019, 0, 1
-0.05640739, 0, 2, -0.3980198, 0, 1
-0.03558239, 0, 2, -0.4046912, 0, 1
-0.01475739, 0, 2, -0.4181643, 0, 1
0.006067604, 0, 2, -0.4316964, 0, 1
0.0268926, 0, 2, -0.4451551, 0, 1
0.0477176, 0, 2, -0.4590726, 0, 1
0.0685426, 0, 2, -0.4660373, 0, 1
0.0893676, 0, 2, -0.4802952, 0, 1
0.1101926, 0, 2, -0.4939976, 0, 1
0.1310176, 0, 2, -0.5070324, 0, 1
0.1518426, 0, 2, -0.5206132, 0, 1
0.1726676, 0, 2, -0.5271745, 0, 1
0.1934926, 0, 2, -0.54, 0, 1
0.2143176, 0, 2, -0.5525804, 0, 1
0.2351426, 0, 2, -0.5651512, 0, 1
0.2559676, 0, 2, -0.5778046, 0, 1
0.2767926, 0, 2, -0.5839071, 0, 1
0.2976176, 0, 2, -0.5949421, 0, 1
0.3184426, 0, 2, -0.6062794, 0, 1
0.3392676, 0, 2, -0.6175537, 0, 1
0.3600926, 0, 2, -0.6293249, 0, 1
0.3809176, 0, 2, -0.6350536, 0, 1
0.4017426, 0, 2, -0.6464968, 0, 1
0.4225676, 0, 2, -0.657433, 0, 1
0.4433926, 0, 2, -0.6685429, 0, 1
0.4642176, 0, 2, -0.6794519, 0, 1
0.4850426, 0, 2, -0.6849604, 0, 1
0.5058676, 0, 2, -0.6956129, 0, 1
0.5266926, 0, 2, -0.7060356, 0, 1
0.5475177, 0, 2, -0.7156153, 0, 1
0.5683427, 0, 2, -0.7243972, 0, 1
0.5891677, 0, 2, -0.7284794, 0, 1
0.6099927, 0, 2, -0.7371125, 0, 1
0.6308178, 0, 2, -0.7468882, 0, 1
0.6516428, 0, 2, -0.756217, 0, 1
0.6724678, 0, 2, -0.7653723, 0, 1
0.6932929, 0, 2, -0.76969, -1, 1
0.7141179, 0, 2, -0.7780886, -1, 1
0.7349429, 0, 2, -0.7861958, -1, 1
0.7557679, 0, 2, -0.7941365, -1, 1
0.776593, 0, 2, -0.8022389, -1, 1
0.797418, 0, 2, -0.8102226, -1, 1
0.818243, 0, 2, -0.8140163, -1, 1
0.8390681, 0, 2, -0.8217578, -1, 1
0.8598931, 0, 2, -0.8292174, -1, 1
0.8807181, 0, 2, -0.8360834, -1, 1
0.9015431, 0, 2, -0.8391833, -1, 1
0.9223682, 0, 2, -0.8449655, -1, 1
0.9431932, 0, 2, -0.8497925, -1, 1
0.9640182, 0, 2, -0.8542271, -1, 1
0.9848433, 0, 2, -0.858696, -1, 1
1.005668, -1, 2, -0.8627491, -1, 1
1.026493, -1, 2, -0.8647842, -1, 1
1.047318, -1, 2, -0.8688211, -1, 1
1.068143, -1, 2, -0.8727007, -1, 1
1.088968, -1, 2, -0.876421, -1, 1
1.109793, -1, 2, -0.8801365, -1, 1
1.130618, -1, 2, -0.8819394, -1, 1
1.151443, -1, 2, -0.8849874, -1, 1
1.172269, -1, 2, -0.8879414, -1, 1
1.193094, -1, 2, -0.8908143, -1, 1
1.213919, -1, 2, -0.8931751, -1, 1
1.234744, -1, 2, -0.8943076, -1, 1
1.255569, -1, 2, -0.8964777, -1, 1
1.276394, -1, 2, -0.898241, -1, 1
1.297219, -1, 2, -0.9000397, -1, 1
1.318044, -1, 2, -0.9012284, -1, 1
1.338869, -1, 2, -0.9016275, -1, 1
1.359694, -1, 2, -0.9015608, -1, 1
1.380519, -1, 2, -0.9016709, -1, 1
1.401344, -1, 2, -0.9015656, -1, 1
1.422169, -1, 2, -0.901473, -1, 1
1.442994, -1, 2, -0.9018164, -1, 1
1.463819, -1, 2, -0.901742, -1, 1
1.484644, -1, 2, -0.9012022, -1, 1
1.505469, -1, 2, -0.9007378, -1, 1
1.526294, -1, 2, -0.900785, -1, 1
1.547119, -1, 2, -0.9006548, -1, 1
1.567944, -1, 2, -0.901042, -1, 1
1.588769, -1, 2, -0.9010644, -1, 1
1.609594, -1, 2, -0.901083, -1, 1
1.630419, -1, 2, -0.9011397, -1, 1
1.651244, -1, 2, -0.9012403, -1, 1
1.672069, -1, 2, -0.9010954, -1, 1
1.692894, -1, 2, -0.900578, -1, 1
1.713719, -1, 2, -0.8996029, -1, 1
1.734544, -1, 2, -0.8989372, -1, 1
