timestamp_sec,frame_id,game_played,yielding,player1discrete,player2discrete,player1yieldprob,player2yieldprob,player1_pose_x,player1_pose_y,player1_pose_z,player1_pose_orient_x,player1_pose_orient_y,player1_pose_orient_z,player1_pose_orient_w,player2_pose_x,player2_pose_y,player2_pose_z,player2_pose_orient_x,player2_pose_orient_y,player2_pose_orient_z,player2_pose_orient_w
1717767302.2927308,map,True,False,5,8,0.0,0.0,2.359334707260132,-2.5913467407226562,0.0,0.0,0.0,0.022265518945827352,0.9997520884534729,3.982375208986543,-9.885335924469878,0.7068502115113424,0.0,0.0,0.0,1.0
1717767302.3437524,map,True,False,5,8,0.0,0.0,2.359334707260132,-2.5913467407226562,0.0,0.0,0.0,0.022265518945827352,0.9997520884534729,3.9802192033097854,-10.043547379348949,0.696559085680367,0.0,0.0,0.0,1.0
1717767302.44199,map,True,False,5,8,0.0,0.0,2.359334707260132,-2.5913467407226562,0.0,0.0,0.0,0.022265518945827352,0.9997520884534729,3.9802192033097854,-10.043547379348949,0.696559085680367,0.0,0.0,0.0,1.0
1717767302.4932516,map,True,False,5,8,0.0,0.0,2.359334707260132,-2.5913467407226562,0.0,0.0,0.0,0.022265518945827352,0.9997520884534729,3.9802192033097854,-10.043547379348949,0.696559085680367,0.0,0.0,0.0,1.0
1717767302.4976702,map,True,False,5,8,0.0,0.0,2.359334707260132,-2.5913467407226562,0.0,0.0,0.0,0.022265518945827352,0.9997520884534729,3.9802192033097854,-10.043547379348949,0.696559085680367,0.0,0.0,0.0,1.0
1717767302.5501363,map,True,False,5,8,0.0,0.0,2.359334707260132,-2.5913467407226562,0.0,0.0,0.0,0.022265518945827352,0.9997520884534729,3.9802192033097854,-10.043547379348949,0.696559085680367,0.0,0.0,0.0,1.0
1717767302.5985205,map,True,False,5,8,0.0,0.0,2.359334707260132,-2.5913467407226562,0.0,0.0,0.0,0.022265518945827352,0.9997520884534729,3.9802192033097854,-10.043547379348949,0.696559085680367,0.0,0.0,0.0,1.0
1717767302.6509168,map,True,False,5,8,0.0,0.0,2.359334707260132,-2.5913467407226562,0.0,0.0,0.0,0.022265518945827352,0.9997520884534729,4.00342871789324,-9.877816126642829,0.6960858039515593,0.0,0.0,0.0,1.0
1717767302.6804616,map,True,False,5,7,0.0,0.0,2.359334707260132,-2.5913467407226562,0.0,0.0,0.0,0.022265518945827352,0.9997520884534729,3.991817733467229,-9.775696134107545,0.6853304294834942,0.0,0.0,0.0,1.0
1717767302.6837654,map,True,False,5,7,0.0,0.0,2.359334707260132,-2.5913467407226562,0.0,0.0,0.0,0.022265518945827352,0.9997520884534729,3.991817733467229,-9.775696134107545,0.6853304294834942,0.0,0.0,0.0,1.0
1717767302.727384,map,True,False,5,7,0.0,0.0,2.359334707260132,-2.5913467407226562,0.0,0.0,0.0,0.022265518945827352,0.9997520884534729,3.991817733467229,-9.775696134107545,0.6853304294834942,0.0,0.0,0.0,1.0
1717767302.7354014,map,True,False,5,7,0.0,0.0,2.359334707260132,-2.5913467407226562,0.0,0.0,0.0,0.022265518945827352,0.9997520884534729,3.991817733467229,-9.775696134107545,0.6853304294834942,0.0,0.0,0.0,1.0
1717767302.7382967,map,True,False,5,7,0.0,0.0,2.359334707260132,-2.5913467407226562,0.0,0.0,0.0,0.022265518945827352,0.9997520884534729,3.991817733467229,-9.775696134107545,0.6853304294834942,0.0,0.0,0.0,1.0
1717767302.7467904,map,True,False,5,7,0.0,0.0,2.359334707260132,-2.5913467407226562,0.0,0.0,0.0,0.022265518945827352,0.9997520884534729,3.991817733467229,-9.775696134107545,0.6853304294834942,0.0,0.0,0.0,1.0
1717767302.7494476,map,True,False,5,7,0.0,0.0,2.359334707260132,-2.5913467407226562,0.0,0.0,0.0,0.022265518945827352,0.9997520884534729,3.991817733467229,-9.775696134107545,0.6853304294834942,0.0,0.0,0.0,1.0
1717767302.7579434,map,True,False,5,7,0.0,0.0,2.359334707260132,-2.5913467407226562,0.0,0.0,0.0,0.022265518945827352,0.9997520884534729,3.991817733467229,-9.775696134107545,0.6853304294834942,0.0,0.0,0.0,1.0
1717767302.7618282,map,True,False,5,7,0.0,0.0,2.359334707260132,-2.5913467407226562,0.0,0.0,0.0,0.022265518945827352,0.9997520884534729,3.991817733467229,-9.775696134107545,0.6853304294834942,0.0,0.0,0.0,1.0
1717767302.7664075,map,True,False,5,7,0.0,0.0,2.359334707260132,-2.5913467407226562,0.0,0.0,0.0,0.022265518945827352,0.9997520884534729,3.991817733467229,-9.775696134107545,0.6853304294834942,0.0,0.0,0.0,1.0
1717767302.7698758,map,True,False,5,7,0.0,0.0,2.359334707260132,-2.5913467407226562,0.0,0.0,0.0,0.022265518945827352,0.9997520884534729,3.991817733467229,-9.775696134107545,0.6853304294834942,0.0,0.0,0.0,1.0
1717767302.7777188,map,True,False,5,7,0.0,0.0,2.359334707260132,-2.5913467407226562,0.0,0.0,0.0,0.022265518945827352,0.9997520884534729,3.991817733467229,-9.775696134107545,0.6853304294834942,0.0,0.0,0.0,1.0
1717767302.781764,map,True,False,5,7,0.0,0.0,2.359334707260132,-2.5913467407226562,0.0,0.0,0.0,0.022265518945827352,0.9997520884534729,3.991817733467229,-9.775696134107545,0.6853304294834942,0.0,0.0,0.0,1.0
1717767302.7856958,map,True,False,5,7,0.0,0.0,2.359334707260132,-2.5913467407226562,0.0,0.0,0.0,0.022265518945827352,0.9997520884534729,3.991817733467229,-9.775696134107545,0.6853304294834942,0.0,0.0,0.0,1.0
1717767302.7908514,map,True,False,5,7,0.0,0.0,2.359334707260132,-2.5913467407226562,0.0,0.0,0.0,0.022265518945827352,0.9997520884534729,3.991817733467229,-9.775696134107545,0.6853304294834942,0.0,0.0,0.0,1.0
1717767302.7992742,map,True,False,5,7,0.0,0.0,2.360609292984009,-2.5858166217803955,0.0,0.0,0.0,0.021939590781644085,0.9997593023778856,3.991817733467229,-9.775696134107545,0.6853304294834942,0.0,0.0,0.0,1.0
1717767302.8021817,map,True,False,5,7,0.0,0.0,2.360609292984009,-2.5858166217803955,0.0,0.0,0.0,0.021939590781644085,0.9997593023778856,3.991817733467229,-9.775696134107545,0.6853304294834942,0.0,0.0,0.0,1.0
1717767302.8049662,map,True,False,5,7,0.0,0.0,2.360609292984009,-2.5858166217803955,0.0,0.0,0.0,0.021939590781644085,0.9997593023778856,3.991817733467229,-9.775696134107545,0.6853304294834942,0.0,0.0,0.0,1.0
1717767302.8094556,map,True,False,5,7,0.0,0.0,2.360609292984009,-2.5858166217803955,0.0,0.0,0.0,0.021939590781644085,0.9997593023778856,3.991817733467229,-9.775696134107545,0.6853304294834942,0.0,0.0,0.0,1.0
1717767302.8135266,map,True,False,5,7,0.0,0.0,2.360609292984009,-2.5858166217803955,0.0,0.0,0.0,0.021939590781644085,0.9997593023778856,3.991817733467229,-9.775696134107545,0.6853304294834942,0.0,0.0,0.0,1.0
1717767302.8180318,map,True,False,5,7,0.0,0.0,2.360609292984009,-2.5858166217803955,0.0,0.0,0.0,0.021939590781644085,0.9997593023778856,3.991817733467229,-9.775696134107545,0.6853304294834942,0.0,0.0,0.0,1.0
1717767302.8314052,map,True,False,5,7,0.0,0.0,2.360609292984009,-2.5858166217803955,0.0,0.0,0.0,0.021939590781644085,0.9997593023778856,3.991817733467229,-9.775696134107545,0.6853304294834942,0.0,0.0,0.0,1.0
1717767302.834086,map,True,False,5,7,0.0,0.0,2.360609292984009,-2.5858166217803955,0.0,0.0,0.0,0.021939590781644085,0.9997593023778856,3.991817733467229,-9.775696134107545,0.6853304294834942,0.0,0.0,0.0,1.0
1717767302.8457189,map,True,False,5,7,0.0,0.0,2.360609292984009,-2.5858166217803955,0.0,0.0,0.0,0.021939590781644085,0.9997593023778856,3.991817733467229,-9.775696134107545,0.6853304294834942,0.0,0.0,0.0,1.0
1717767302.8498213,map,True,False,5,7,0.0,0.0,2.360609292984009,-2.5858166217803955,0.0,0.0,0.0,0.021939590781644085,0.9997593023778856,3.991817733467229,-9.775696134107545,0.6853304294834942,0.0,0.0,0.0,1.0
1717767302.8534098,map,True,False,5,7,0.0,0.0,2.360609292984009,-2.5858166217803955,0.0,0.0,0.0,0.021939590781644085,0.9997593023778856,3.991817733467229,-9.775696134107545,0.6853304294834942,0.0,0.0,0.0,1.0
1717767302.8577807,map,True,False,5,7,0.0,0.0,2.360609292984009,-2.5858166217803955,0.0,0.0,0.0,0.021939590781644085,0.9997593023778856,3.991817733467229,-9.775696134107545,0.6853304294834942,0.0,0.0,0.0,1.0
1717767302.8627954,map,True,False,5,7,0.0,0.0,2.360609292984009,-2.5858166217803955,0.0,0.0,0.0,0.021939590781644085,0.9997593023778856,3.991817733467229,-9.775696134107545,0.6853304294834942,0.0,0.0,0.0,1.0
1717767302.9759088,map,True,False,5,7,0.0,0.0,2.360609292984009,-2.5858166217803955,0.0,0.0,0.0,0.021939590781644085,0.9997593023778856,3.969762690316495,-9.56956917721445,0.6851920333678977,0.0,0.0,0.0,1.0
1717767303.0108106,map,True,False,5,7,0.0,0.0,2.360609292984009,-2.5858166217803955,0.0,0.0,0.0,0.021939590781644085,0.9997593023778856,3.969762690316495,-9.56956917721445,0.6851920333678977,0.0,0.0,0.0,1.0
1717767303.0137691,map,True,False,5,7,0.0,0.0,2.360609292984009,-2.5858166217803955,0.0,0.0,0.0,0.021939590781644085,0.9997593023778856,3.969762690316495,-9.56956917721445,0.6851920333678977,0.0,0.0,0.0,1.0
1717767303.029663,map,True,False,5,7,0.0,0.0,2.360609292984009,-2.5858166217803955,0.0,0.0,0.0,0.021939590781644085,0.9997593023778856,3.969762690316495,-9.56956917721445,0.6851920333678977,0.0,0.0,0.0,1.0
1717767303.0351985,map,True,False,5,7,0.0,0.0,2.360609292984009,-2.5858166217803955,0.0,0.0,0.0,0.021939590781644085,0.9997593023778856,3.969762690316495,-9.56956917721445,0.6851920333678977,0.0,0.0,0.0,1.0
1717767303.0943122,map,True,False,5,7,0.0,0.0,2.360609292984009,-2.5858166217803955,0.0,0.0,0.0,0.021939590781644085,0.9997593023778856,3.969762690316495,-9.56956917721445,0.6851920333678977,0.0,0.0,0.0,1.0
1717767303.1383169,map,True,False,5,7,0.0,0.0,2.360609292984009,-2.5858166217803955,0.0,0.0,0.0,0.021939590781644085,0.9997593023778856,3.969762690316495,-9.56956917721445,0.6851920333678977,0.0,0.0,0.0,1.0
1717767303.1884286,map,True,False,5,7,0.0,0.0,2.360609292984009,-2.5858166217803955,0.0,0.0,0.0,0.021939590781644085,0.9997593023778856,3.969762690316495,-9.56956917721445,0.6851920333678977,0.0,0.0,0.0,1.0
1717767303.297586,map,True,False,5,7,0.0,0.0,2.360609292984009,-2.5858166217803955,0.0,0.0,0.0,0.021939590781644085,0.9997593023778856,3.9582228805939956,-9.257262585881357,0.6363408695819875,0.0,0.0,0.0,1.0
1717767303.343795,map,True,False,5,7,0.0,0.0,2.360609292984009,-2.5858166217803955,0.0,0.0,0.0,0.021939590781644085,0.9997593023778856,3.9346289873104516,-9.119011890132365,0.5991736556420816,0.0,0.0,0.0,1.0
1717767303.4422073,map,True,False,5,7,0.0,0.0,2.360609292984009,-2.5858166217803955,0.0,0.0,0.0,0.021939590781644085,0.9997593023778856,3.9346289873104516,-9.119011890132365,0.5991736556420816,0.0,0.0,0.0,1.0
1717767303.5421329,map,True,False,5,7,0.0,0.0,2.360609292984009,-2.5858166217803955,0.0,0.0,0.0,0.021939590781644085,0.9997593023778856,3.9346289873104516,-9.119011890132365,0.5991736556420816,0.0,0.0,0.0,1.0
1717767303.5923715,map,True,False,5,7,0.0,0.0,2.3595213890075684,-2.5909478664398193,0.0,0.0,0.0,0.022144552858949566,0.9997547862288196,3.9346289873104516,-9.119011890132365,0.5991736556420816,0.0,0.0,0.0,1.0
1717767303.6424425,map,True,False,5,7,0.0,0.0,2.3595213890075684,-2.5909478664398193,0.0,0.0,0.0,0.022144552858949566,0.9997547862288196,3.975047277044903,-9.073342266735354,0.5431409228088937,0.0,0.0,0.0,1.0
1717767303.6926684,map,True,False,5,7,0.0,0.0,2.3595213890075684,-2.5909478664398193,0.0,0.0,0.0,0.022144552858949566,0.9997547862288196,3.975047277044903,-9.073342266735354,0.5431409228088937,0.0,0.0,0.0,1.0
1717767303.7936275,map,True,False,5,7,0.0,0.0,2.3595213890075684,-2.5909478664398193,0.0,0.0,0.0,0.022144552858949566,0.9997547862288196,3.975047277044903,-9.073342266735354,0.5431409228088937,0.0,0.0,0.0,1.0
1717767303.8440857,map,True,False,5,7,0.0,0.0,2.3595213890075684,-2.5909478664398193,0.0,0.0,0.0,0.022144552858949566,0.9997547862288196,3.975047277044903,-9.073342266735354,0.5431409228088937,0.0,0.0,0.0,1.0
1717767303.9930522,map,True,False,5,7,0.0,0.0,2.3595213890075684,-2.5909478664398193,0.0,0.0,0.0,0.022144552858949566,0.9997547862288196,4.048888862877197,-8.958282668973219,0.6661947606318956,0.0,0.0,0.0,1.0
1717767304.0433602,map,True,False,5,7,0.0,0.0,2.3595213890075684,-2.5909478664398193,0.0,0.0,0.0,0.022144552858949566,0.9997547862288196,4.048888862877197,-8.958282668973219,0.6661947606318956,0.0,0.0,0.0,1.0
1717767304.1433427,map,True,False,5,7,0.0,0.0,2.3595213890075684,-2.5909478664398193,0.0,0.0,0.0,0.022144552858949566,0.9997547862288196,4.048888862877197,-8.958282668973219,0.6661947606318956,0.0,0.0,0.0,1.0
1717767304.1939547,map,True,False,5,7,0.0,0.0,2.3595213890075684,-2.5909478664398193,0.0,0.0,0.0,0.022144552858949566,0.9997547862288196,4.048888862877197,-8.958282668973219,0.6661947606318956,0.0,0.0,0.0,1.0
1717767304.2949407,map,True,False,5,7,0.0,0.0,2.480295419692993,-2.606398582458496,0.0,0.0,0.0,0.021437389441308345,0.99977019768984,4.090053685781543,-8.909557449836072,0.6847116282214221,0.0,0.0,0.0,1.0
1717767304.344773,map,True,False,5,7,0.0,0.0,2.480295419692993,-2.606398582458496,0.0,0.0,0.0,0.021437389441308345,0.99977019768984,4.119304511022042,-8.966062449675693,0.666160492670548,0.0,0.0,0.0,1.0
1717767304.3952308,map,True,False,5,7,0.0,0.0,2.480295419692993,-2.606398582458496,0.0,0.0,0.0,0.021437389441308345,0.99977019768984,4.119304511022042,-8.966062449675693,0.666160492670548,0.0,0.0,0.0,1.0
1717767304.4943552,map,True,False,5,7,0.0,0.0,2.480295419692993,-2.606398582458496,0.0,0.0,0.0,0.021437389441308345,0.99977019768984,4.119304511022042,-8.966062449675693,0.666160492670548,0.0,0.0,0.0,1.0
1717767304.5447583,map,True,False,5,7,0.0,0.0,2.480295419692993,-2.606398582458496,0.0,0.0,0.0,0.021437389441308345,0.99977019768984,4.119304511022042,-8.966062449675693,0.666160492670548,0.0,0.0,0.0,1.0
1717767304.5946836,map,True,False,5,7,0.0,0.0,2.480295419692993,-2.606398582458496,0.0,0.0,0.0,0.021437389441308345,0.99977019768984,4.119304511022042,-8.966062449675693,0.666160492670548,0.0,0.0,0.0,1.0
1717767304.695956,map,True,False,5,6,0.0,0.0,2.480295419692993,-2.606398582458496,0.0,0.0,0.0,0.021437389441308345,0.99977019768984,4.11084964273212,-8.372726681593207,0.768468976007895,0.0,0.0,0.0,1.0
1717767304.795012,map,True,False,5,6,0.0,0.0,2.480295419692993,-2.606398582458496,0.0,0.0,0.0,0.021437389441308345,0.99977019768984,4.11084964273212,-8.372726681593207,0.768468976007895,0.0,0.0,0.0,1.0
1717767304.8458316,map,True,False,5,6,0.0,0.0,2.480295419692993,-2.606398582458496,0.0,0.0,0.0,0.021437389441308345,0.99977019768984,4.11084964273212,-8.372726681593207,0.768468976007895,0.0,0.0,0.0,1.0
1717767304.9455512,map,True,False,4,6,0.0,0.0,2.595521926879883,-2.629085063934326,0.0,0.0,0.0,0.02163822573375686,0.999765860445818,4.135724140224297,-8.254989093653478,0.6511394274730828,0.0,0.0,0.0,1.0
1717767304.9958956,map,True,False,4,6,0.0,0.0,2.595521926879883,-2.629085063934326,0.0,0.0,0.0,0.02163822573375686,0.999765860445818,4.131744304275069,-8.350550988092067,0.650754063198788,0.0,0.0,0.0,1.0
1717767305.0463383,map,True,False,4,6,0.0,0.0,2.595521926879883,-2.629085063934326,0.0,0.0,0.0,0.02163822573375686,0.999765860445818,4.131744304275069,-8.350550988092067,0.650754063198788,0.0,0.0,0.0,1.0
1717767305.0969067,map,True,False,4,6,0.0,0.0,2.595521926879883,-2.629085063934326,0.0,0.0,0.0,0.02163822573375686,0.999765860445818,4.131744304275069,-8.350550988092067,0.650754063198788,0.0,0.0,0.0,1.0
1717767305.1472492,map,True,False,4,6,0.0,0.0,2.595521926879883,-2.629085063934326,0.0,0.0,0.0,0.02163822573375686,0.999765860445818,4.131744304275069,-8.350550988092067,0.650754063198788,0.0,0.0,0.0,1.0
1717767305.1985772,map,True,False,4,6,0.0,0.0,2.595521926879883,-2.629085063934326,0.0,0.0,0.0,0.02163822573375686,0.999765860445818,4.131744304275069,-8.350550988092067,0.650754063198788,0.0,0.0,0.0,1.0
1717767305.2499125,map,True,False,4,6,0.0,0.0,2.595521926879883,-2.629085063934326,0.0,0.0,0.0,0.02163822573375686,0.999765860445818,4.131744304275069,-8.350550988092067,0.650754063198788,0.0,0.0,0.0,1.0
1717767305.3015833,map,True,False,4,6,0.0,0.0,2.595521926879883,-2.629085063934326,0.0,0.0,0.0,0.02163822573375686,0.999765860445818,4.263454656393352,-8.071950637740548,0.6517572031201608,0.0,0.0,0.0,1.0
1717767305.3994904,map,True,False,4,6,0.0,0.0,2.595521926879883,-2.629085063934326,0.0,0.0,0.0,0.02163822573375686,0.999765860445818,4.236153387355187,-7.805746090022238,0.6607365891668711,0.0,0.0,0.0,1.0
1717767305.499706,map,True,False,4,6,0.0,0.0,2.595521926879883,-2.629085063934326,0.0,0.0,0.0,0.02163822573375686,0.999765860445818,4.236153387355187,-7.805746090022238,0.6607365891668711,0.0,0.0,0.0,1.0
1717767305.6032197,map,True,False,4,6,0.0,0.0,2.595521926879883,-2.629085063934326,0.0,0.0,0.0,0.02163822573375686,0.999765860445818,4.236153387355187,-7.805746090022238,0.6607365891668711,0.0,0.0,0.0,1.0
1717767305.701174,map,True,False,4,5,0.0,0.0,2.706524133682251,-2.6555118560791016,0.0,0.0,0.0,0.022274143859056707,0.9997518946903224,4.234233285789661,-7.137023148500454,0.6366602072720433,0.0,0.0,0.0,1.0
1717767305.799904,map,True,False,4,5,0.0,0.0,2.706524133682251,-2.6555118560791016,0.0,0.0,0.0,0.022274143859056707,0.9997518946903224,4.234233285789661,-7.137023148500454,0.6366602072720433,0.0,0.0,0.0,1.0
1717767305.8536637,map,True,False,4,5,0.0,0.0,2.706524133682251,-2.6555118560791016,0.0,0.0,0.0,0.022274143859056707,0.9997518946903224,4.234233285789661,-7.137023148500454,0.6366602072720433,0.0,0.0,0.0,1.0
1717767305.9993558,map,True,False,4,5,0.0,0.0,2.706524133682251,-2.6555118560791016,0.0,0.0,0.0,0.022274143859056707,0.9997518946903224,4.284056848328621,-6.880024973784018,0.651455815530221,0.0,0.0,0.0,1.0
1717767306.0515335,map,True,False,4,5,0.0,0.0,2.706524133682251,-2.6555118560791016,0.0,0.0,0.0,0.022274143859056707,0.9997518946903224,4.284056848328621,-6.880024973784018,0.651455815530221,0.0,0.0,0.0,1.0
1717767306.1017509,map,True,False,4,5,0.0,0.0,2.706524133682251,-2.6555118560791016,0.0,0.0,0.0,0.022274143859056707,0.9997518946903224,4.284056848328621,-6.880024973784018,0.651455815530221,0.0,0.0,0.0,1.0
1717767306.152289,map,True,False,4,5,0.0,0.0,2.706524133682251,-2.6555118560791016,0.0,0.0,0.0,0.022274143859056707,0.9997518946903224,4.284056848328621,-6.880024973784018,0.651455815530221,0.0,0.0,0.0,1.0
1717767306.2514153,map,True,False,4,5,0.0,0.0,2.845684289932251,-2.6861660480499268,0.0,0.0,0.0,0.023185661497468982,0.9997311767214078,4.284056848328621,-6.880024973784018,0.651455815530221,0.0,0.0,0.0,1.0
1717767306.3520873,map,True,False,4,5,0.0,0.0,2.845684289932251,-2.6861660480499268,0.0,0.0,0.0,0.023185661497468982,0.9997311767214078,4.470552049793429,-7.084782533731367,0.6363566633961037,0.0,0.0,0.0,1.0
1717767306.404157,map,True,False,4,5,0.0,0.0,2.845684289932251,-2.6861660480499268,0.0,0.0,0.0,0.023185661497468982,0.9997311767214078,4.470552049793429,-7.084782533731367,0.6363566633961037,0.0,0.0,0.0,1.0
1717767306.4543016,map,True,False,4,5,0.0,0.0,2.845684289932251,-2.6861660480499268,0.0,0.0,0.0,0.023185661497468982,0.9997311767214078,4.470552049793429,-7.084782533731367,0.6363566633961037,0.0,0.0,0.0,1.0
1717767306.5055761,map,True,False,4,5,0.0,0.0,2.845684289932251,-2.6861660480499268,0.0,0.0,0.0,0.023185661497468982,0.9997311767214078,4.470552049793429,-7.084782533731367,0.6363566633961037,0.0,0.0,0.0,1.0
1717767306.6079583,map,True,False,4,5,0.0,0.0,2.845684289932251,-2.6861660480499268,0.0,0.0,0.0,0.023185661497468982,0.9997311767214078,4.470552049793429,-7.084782533731367,0.6363566633961037,0.0,0.0,0.0,1.0
1717767306.706659,map,True,False,4,4,0.5922520728754596,0.5922520728754596,2.845684289932251,-2.6861660480499268,0.0,0.0,0.0,0.023185661497468982,0.9997311767214078,4.370199709735969,-6.321749496120505,0.6546724027204733,0.0,0.0,0.0,1.0
1717767306.8060677,map,True,True,4,4,0.5922520728754596,0.5922520728754596,2.928107261657715,-2.721256971359253,0.0,0.0,0.0,0.025295275098963656,0.9996800208758482,4.370199709735969,-6.321749496120505,0.6546724027204733,0.0,0.0,0.0,1.0
1717767307.058305,map,True,False,4,4,0.5922520728754596,0.5922520728754596,2.928107261657715,-2.721256971359253,0.0,0.0,0.0,0.025295275098963656,0.9996800208758482,4.419816599881447,-5.99077652959677,0.6023960240486904,0.0,0.0,0.0,1.0
1717767307.1579492,map,True,True,4,4,0.5922520728754596,0.5922520728754596,2.928107261657715,-2.721256971359253,0.0,0.0,0.0,0.025295275098963656,0.9996800208758482,4.419816599881447,-5.99077652959677,0.6023960240486904,0.0,0.0,0.0,1.0
1717767307.1947412,map,True,False,4,4,0.5922520728754596,0.5922520728754596,2.928107261657715,-2.721256971359253,0.0,0.0,0.0,0.025295275098963656,0.9996800208758482,4.419816599881447,-5.99077652959677,0.6023960240486904,0.0,0.0,0.0,1.0
1717767307.1982317,map,True,True,4,4,0.5922520728754596,0.5922520728754596,2.928107261657715,-2.721256971359253,0.0,0.0,0.0,0.025295275098963656,0.9996800208758482,4.419816599881447,-5.99077652959677,0.6023960240486904,0.0,0.0,0.0,1.0
1717767307.2486918,map,True,False,4,4,0.5922520728754596,0.5922520728754596,2.948089838027954,-2.7179861068725586,0.0,0.0,0.0,0.024895113692071043,0.9996900674227115,4.419816599881447,-5.99077652959677,0.6023960240486904,0.0,0.0,0.0,1.0
1717767307.3369834,map,True,False,4,3,0.0,0.0,2.948089838027954,-2.7179861068725586,0.0,0.0,0.0,0.024895113692071043,0.9996900674227115,4.4514368090065695,-5.741581699909466,0.6314565749329595,0.0,0.0,0.0,1.0
1717767307.4370215,map,True,False,4,3,0.0,0.0,2.948089838027954,-2.7179861068725586,0.0,0.0,0.0,0.024895113692071043,0.9996900674227115,4.4514368090065695,-5.741581699909466,0.6314565749329595,0.0,0.0,0.0,1.0
1717767307.4867034,map,True,False,4,3,0.0,0.0,2.948089838027954,-2.7179861068725586,0.0,0.0,0.0,0.024895113692071043,0.9996900674227115,4.4514368090065695,-5.741581699909466,0.6314565749329595,0.0,0.0,0.0,1.0
1717767307.5870633,map,True,False,4,3,0.0,0.0,2.948089838027954,-2.7179861068725586,0.0,0.0,0.0,0.024895113692071043,0.9996900674227115,4.4514368090065695,-5.741581699909466,0.6314565749329595,0.0,0.0,0.0,1.0
1717767307.6869955,map,True,False,4,3,0.0,0.0,2.948089838027954,-2.7179861068725586,0.0,0.0,0.0,0.024895113692071043,0.9996900674227115,4.5076920588673435,-5.557689930814349,0.5865554942419049,0.0,0.0,0.0,1.0
1717767307.7863219,map,True,False,4,3,0.0,0.0,2.948089838027954,-2.7179861068725586,0.0,0.0,0.0,0.024895113692071043,0.9996900674227115,4.5076920588673435,-5.557689930814349,0.5865554942419049,0.0,0.0,0.0,1.0
1717767307.8375683,map,True,False,4,3,0.0,0.0,2.948089838027954,-2.7179861068725586,0.0,0.0,0.0,0.024895113692071043,0.9996900674227115,4.5076920588673435,-5.557689930814349,0.5865554942419049,0.0,0.0,0.0,1.0
1717767308.0420818,map,True,True,3,3,0.6616527499769684,0.6616527499769684,3.091355323791504,-2.7586874961853027,0.0,0.0,0.0,0.026364624634817056,0.9996523998045279,4.544165585913031,-5.163358505404491,0.6176123147660366,0.0,0.0,0.0,1.0
1717767308.0945413,map,True,True,3,3,0.6616527499769684,0.6616527499769684,3.091355323791504,-2.7586874961853027,0.0,0.0,0.0,0.026364624634817056,0.9996523998045279,4.544165585913031,-5.163358505404491,0.6176123147660366,0.0,0.0,0.0,1.0
1717767308.1418478,map,True,True,3,3,0.6616527499769684,0.6616527499769684,3.091355323791504,-2.7586874961853027,0.0,0.0,0.0,0.026364624634817056,0.9996523998045279,4.544165585913031,-5.163358505404491,0.6176123147660366,0.0,0.0,0.0,1.0
1717767308.2418816,map,True,True,3,3,0.6616527499769684,0.6616527499769684,3.091355323791504,-2.7586874961853027,0.0,0.0,0.0,0.026364624634817056,0.9996523998045279,4.544165585913031,-5.163358505404491,0.6176123147660366,0.0,0.0,0.0,1.0
1717767308.2921526,map,True,True,3,3,0.6616527499769684,0.6616527499769684,3.211193799972534,-2.783451557159424,0.0,0.0,0.0,0.026840148820902902,0.9996397442395158,4.544165585913031,-5.163358505404491,0.6176123147660366,0.0,0.0,0.0,1.0
1717767308.341786,map,True,False,3,3,0.6616527499769684,0.6616527499769684,3.211193799972534,-2.783451557159424,0.0,0.0,0.0,0.026840148820902902,0.9996397442395158,4.557725101433973,-4.906975131283122,0.661153322733333,0.0,0.0,0.0,1.0
1717767308.4417205,map,True,True,3,3,0.6616527499769684,0.6616527499769684,3.211193799972534,-2.783451557159424,0.0,0.0,0.0,0.026840148820902902,0.9996397442395158,4.557725101433973,-4.906975131283122,0.661153322733333,0.0,0.0,0.0,1.0
1717767308.541704,map,True,False,3,3,0.6616527499769684,0.6616527499769684,3.211193799972534,-2.783451557159424,0.0,0.0,0.0,0.026840148820902902,0.9996397442395158,4.557725101433973,-4.906975131283122,0.661153322733333,0.0,0.0,0.0,1.0
1717767308.6130733,map,True,True,3,3,0.6616527499769684,0.6616527499769684,3.211193799972534,-2.783451557159424,0.0,0.0,0.0,0.026840148820902902,0.9996397442395158,4.557725101433973,-4.906975131283122,0.661153322733333,0.0,0.0,0.0,1.0
1717767308.7128448,map,True,False,3,2,0.0,0.0,3.2815327644348145,-2.8037710189819336,0.0,0.0,0.0,0.027556236664766302,0.9996202612131688,4.5958215323868785,-4.72903886356175,0.6870465528519691,0.0,0.0,0.0,1.0
1717767308.812386,map,True,False,3,2,0.0,0.0,3.2815327644348145,-2.8037710189819336,0.0,0.0,0.0,0.027556236664766302,0.9996202612131688,4.5958215323868785,-4.72903886356175,0.6870465528519691,0.0,0.0,0.0,1.0
1717767308.8633106,map,True,False,3,2,0.0,0.0,3.2815327644348145,-2.8037710189819336,0.0,0.0,0.0,0.027556236664766302,0.9996202612131688,4.5958215323868785,-4.72903886356175,0.6870465528519691,0.0,0.0,0.0,1.0
1717767309.063831,map,True,False,3,2,0.0,0.0,3.2815327644348145,-2.8037710189819336,0.0,0.0,0.0,0.027556236664766302,0.9996202612131688,4.636644627104075,-4.42896736541756,0.6805127276997589,0.0,0.0,0.0,1.0
1717767309.1133964,map,True,False,3,2,0.0,0.0,3.2815327644348145,-2.8037710189819336,0.0,0.0,0.0,0.027556236664766302,0.9996202612131688,4.636644627104075,-4.42896736541756,0.6805127276997589,0.0,0.0,0.0,1.0
1717767309.164423,map,True,False,3,2,0.0,0.0,3.321181535720825,-2.8105123043060303,0.0,0.0,0.0,0.028390921885760586,0.9995969019503324,4.636644627104075,-4.42896736541756,0.6805127276997589,0.0,0.0,0.0,1.0
1717767309.2143214,map,True,False,3,2,0.0,0.0,3.321181535720825,-2.8105123043060303,0.0,0.0,0.0,0.028390921885760586,0.9995969019503324,4.636644627104075,-4.42896736541756,0.6805127276997589,0.0,0.0,0.0,1.0
1717767309.2644768,map,True,False,3,2,0.0,0.0,3.321181535720825,-2.8105123043060303,0.0,0.0,0.0,0.028390921885760586,0.9995969019503324,4.636644627104075,-4.42896736541756,0.6805127276997589,0.0,0.0,0.0,1.0
1717767309.3236895,map,True,False,3,2,0.0,0.0,3.321181535720825,-2.8105123043060303,0.0,0.0,0.0,0.028390921885760586,0.9995969019503324,4.66342774933289,-4.205093815217194,0.6850041309772763,0.0,0.0,0.0,1.0
1717767309.3754184,map,True,False,3,2,0.0,0.0,3.321181535720825,-2.8105123043060303,0.0,0.0,0.0,0.028390921885760586,0.9995969019503324,4.675108170247268,-4.176213622695638,0.684871447069437,0.0,0.0,0.0,1.0
1717767309.4753907,map,True,False,3,2,0.0,0.0,3.321181535720825,-2.8105123043060303,0.0,0.0,0.0,0.028390921885760586,0.9995969019503324,4.675108170247268,-4.176213622695638,0.684871447069437,0.0,0.0,0.0,1.0
1717767309.5250063,map,True,False,3,2,0.0,0.0,3.321181535720825,-2.8105123043060303,0.0,0.0,0.0,0.028390921885760586,0.9995969019503324,4.675108170247268,-4.176213622695638,0.684871447069437,0.0,0.0,0.0,1.0
1717767309.6243315,map,True,True,2,2,0.49874686716791977,0.49874686716791977,3.3723669052124023,-2.824883222579956,0.0,0.0,0.0,0.028737576849404284,0.9995869886329627,4.675108170247268,-4.176213622695638,0.684871447069437,0.0,0.0,0.0,1.0
1717767309.7244473,map,True,False,2,2,0.49874686716791977,0.49874686716791977,3.3723669052124023,-2.824883222579956,0.0,0.0,0.0,0.028737576849404284,0.9995869886329627,4.6836874797630985,-3.8234134633882393,0.6835649764504301,0.0,0.0,0.0,1.0
1717767309.8242192,map,True,False,2,2,0.49874686716791977,0.49874686716791977,3.3723669052124023,-2.824883222579956,0.0,0.0,0.0,0.028737576849404284,0.9995869886329627,4.6836874797630985,-3.8234134633882393,0.6835649764504301,0.0,0.0,0.0,1.0
1717767310.0243735,map,True,False,2,1,0.0,0.0,3.424874782562256,-2.8346009254455566,0.0,0.0,0.0,0.029537454585313084,0.9995636733155623,4.796962066852739,-3.543283239396466,0.6824689479767333,0.0,0.0,0.0,1.0
1717767310.0740204,map,True,False,2,1,0.0,0.0,3.424874782562256,-2.8346009254455566,0.0,0.0,0.0,0.029537454585313084,0.9995636733155623,4.796962066852739,-3.543283239396466,0.6824689479767333,0.0,0.0,0.0,1.0
1717767310.125487,map,True,False,2,1,0.0,0.0,3.424874782562256,-2.8346009254455566,0.0,0.0,0.0,0.029537454585313084,0.9995636733155623,4.796962066852739,-3.543283239396466,0.6824689479767333,0.0,0.0,0.0,1.0
1717767310.2261922,map,True,False,2,1,0.0,0.0,3.424874782562256,-2.8346009254455566,0.0,0.0,0.0,0.029537454585313084,0.9995636733155623,4.796962066852739,-3.543283239396466,0.6824689479767333,0.0,0.0,0.0,1.0
1717767310.2785532,map,True,False,2,1,0.0,0.0,3.424874782562256,-2.8346009254455566,0.0,0.0,0.0,0.029537454585313084,0.9995636733155623,4.796962066852739,-3.543283239396466,0.6824689479767333,0.0,0.0,0.0,1.0
1717767310.3757415,map,True,False,2,1,0.0,0.0,3.424874782562256,-2.8346009254455566,0.0,0.0,0.0,0.029537454585313084,0.9995636733155623,4.871167264768566,-3.272949937907356,0.681322449993819,0.0,0.0,0.0,1.0
1717767310.4258995,map,True,False,2,1,0.0,0.0,3.522900104522705,-2.8250768184661865,0.0,0.0,0.0,0.028582488251425803,0.9995914310038807,4.871167264768566,-3.272949937907356,0.681322449993819,0.0,0.0,0.0,1.0
1717767310.5255547,map,True,False,2,1,0.0,0.0,3.522900104522705,-2.8250768184661865,0.0,0.0,0.0,0.028582488251425803,0.9995914310038807,4.871167264768566,-3.272949937907356,0.681322449993819,0.0,0.0,0.0,1.0
1717767310.5777345,map,True,False,2,1,0.0,0.0,3.522900104522705,-2.8250768184661865,0.0,0.0,0.0,0.028582488251425803,0.9995914310038807,4.871167264768566,-3.272949937907356,0.681322449993819,0.0,0.0,0.0,1.0
1717767310.6272109,map,True,False,2,1,0.0,0.0,3.522900104522705,-2.8250768184661865,0.0,0.0,0.0,0.028582488251425803,0.9995914310038807,4.860805774015008,-3.1651095633714066,0.6809367574709979,0.0,0.0,0.0,1.0
1717767310.728237,map,True,False,2,1,0.0,0.0,3.522900104522705,-2.8250768184661865,0.0,0.0,0.0,0.028582488251425803,0.9995914310038807,4.872283435012758,-3.1520097100678375,0.6808650633855581,0.0,0.0,0.0,1.0
1717767310.8273666,map,True,False,2,1,0.0,0.0,3.522900104522705,-2.8250768184661865,0.0,0.0,0.0,0.028582488251425803,0.9995914310038807,4.872283435012758,-3.1520097100678375,0.6808650633855581,0.0,0.0,0.0,1.0
