timestamp_sec,frame_id,game_played,yielding,player1discrete,player2discrete,player1yieldprob,player2yieldprob,player1_pose_x,player1_pose_y,player1_pose_z,player1_pose_orient_x,player1_pose_orient_y,player1_pose_orient_z,player1_pose_orient_w,player2_pose_x,player2_pose_y,player2_pose_z,player2_pose_orient_x,player2_pose_orient_y,player2_pose_orient_z,player2_pose_orient_w
1718109246.5883386,map,True,True,3,3,0.6616527499769684,0.6616527499769684,2.0205981731414795,-1.7249277830123901,0.0,0.0,0.0,0.05740559640427901,0.9983509444088189,3.5716329289679876,-4.6427718095365975,0.7441464890091625,0.0,0.0,0.0,1.0
1718109246.687537,map,True,False,3,3,0.6616527499769684,0.6616527499769684,2.0205981731414795,-1.7249277830123901,0.0,0.0,0.0,0.05740559640427901,0.9983509444088189,3.5716329289679876,-4.6427718095365975,0.7441464890091625,0.0,0.0,0.0,1.0
1718109246.7876232,map,True,True,3,3,0.6616527499769684,0.6616527499769684,2.0205981731414795,-1.7249277830123901,0.0,0.0,0.0,0.05740559640427901,0.9983509444088189,3.5716329289679876,-4.6427718095365975,0.7441464890091625,0.0,0.0,0.0,1.0
1718109246.8884857,map,True,False,3,3,0.6616527499769684,0.6616527499769684,2.0205981731414795,-1.7249277830123901,0.0,0.0,0.0,0.05740559640427901,0.9983509444088189,3.5997543203367384,-4.397426436280726,0.7023874310776879,0.0,0.0,0.0,1.0
1718109246.9890902,map,True,False,3,3,0.6616527499769684,0.6616527499769684,2.178401231765747,-1.761298418045044,0.0,0.0,0.0,0.05857329071577153,0.9982831044582136,3.5997543203367384,-4.397426436280726,0.7023874310776879,0.0,0.0,0.0,1.0
1718109247.0887759,map,True,False,3,3,0.6616527499769684,0.6616527499769684,2.178401231765747,-1.761298418045044,0.0,0.0,0.0,0.05857329071577153,0.9982831044582136,3.5997543203367384,-4.397426436280726,0.7023874310776879,0.0,0.0,0.0,1.0
1718109247.1460629,map,True,True,3,3,0.6616527499769684,0.6616527499769684,2.178401231765747,-1.761298418045044,0.0,0.0,0.0,0.05857329071577153,0.9982831044582136,3.5997543203367384,-4.397426436280726,0.7023874310776879,0.0,0.0,0.0,1.0
1718109247.238399,map,True,True,3,3,0.6616527499769684,0.6616527499769684,2.178401231765747,-1.761298418045044,0.0,0.0,0.0,0.05857329071577153,0.9982831044582136,3.7297121363623265,-4.469442345365488,0.6196288765795889,0.0,0.0,0.0,1.0
1718109247.3397398,map,True,False,3,3,0.6616527499769684,0.6616527499769684,2.178401231765747,-1.761298418045044,0.0,0.0,0.0,0.05857329071577153,0.9982831044582136,3.7297121363623265,-4.469442345365488,0.6196288765795889,0.0,0.0,0.0,1.0
1718109247.4379015,map,True,True,3,3,0.6616527499769684,0.6616527499769684,2.178401231765747,-1.761298418045044,0.0,0.0,0.0,0.05857329071577153,0.9982831044582136,3.7297121363623265,-4.469442345365488,0.6196288765795889,0.0,0.0,0.0,1.0
1718109247.4903023,map,True,False,3,3,0.6616527499769684,0.6616527499769684,2.3034987449645996,-1.7875018119812012,0.0,0.0,0.0,0.06020516126752438,0.9981860308300459,3.7297121363623265,-4.469442345365488,0.6196288765795889,0.0,0.0,0.0,1.0
1718109247.539184,map,True,False,3,2,0.0,0.0,2.3034987449645996,-1.7875018119812012,0.0,0.0,0.0,0.06020516126752438,0.9981860308300459,3.6657952102863542,-3.6979371592319445,0.6814115514248849,0.0,0.0,0.0,1.0
1718109247.589506,map,True,False,3,2,0.0,0.0,2.3034987449645996,-1.7875018119812012,0.0,0.0,0.0,0.06020516126752438,0.9981860308300459,3.6645926810390503,-3.669866408214407,0.6813769652989679,0.0,0.0,0.0,1.0
1718109247.6407626,map,True,False,3,2,0.0,0.0,2.3034987449645996,-1.7875018119812012,0.0,0.0,0.0,0.06020516126752438,0.9981860308300459,3.6645926810390503,-3.669866408214407,0.6813769652989679,0.0,0.0,0.0,1.0
1718109247.6945233,map,True,False,3,2,0.0,0.0,2.3034987449645996,-1.7875018119812012,0.0,0.0,0.0,0.06020516126752438,0.9981860308300459,3.6645926810390503,-3.669866408214407,0.6813769652989679,0.0,0.0,0.0,1.0
1718109247.7409804,map,True,False,3,2,0.0,0.0,2.3034987449645996,-1.7875018119812012,0.0,0.0,0.0,0.06020516126752438,0.9981860308300459,3.6645926810390503,-3.669866408214407,0.6813769652989679,0.0,0.0,0.0,1.0
1718109247.7916403,map,True,False,3,2,0.0,0.0,2.3034987449645996,-1.7875018119812012,0.0,0.0,0.0,0.06020516126752438,0.9981860308300459,3.6645926810390503,-3.669866408214407,0.6813769652989679,0.0,0.0,0.0,1.0
1718109247.8943963,map,True,False,3,2,0.0,0.0,2.3034987449645996,-1.7875018119812012,0.0,0.0,0.0,0.06020516126752438,0.9981860308300459,3.6688166088702303,-3.4398470273319712,0.6838013234499023,0.0,0.0,0.0,1.0
1718109247.9434645,map,True,False,3,2,0.0,0.0,2.3034987449645996,-1.7875018119812012,0.0,0.0,0.0,0.06020516126752438,0.9981860308300459,3.6688166088702303,-3.4398470273319712,0.6838013234499023,0.0,0.0,0.0,1.0
1718109247.9932761,map,True,False,3,2,0.0,0.0,2.3846476078033447,-1.8094580173492432,0.0,0.0,0.0,0.06149526161054468,0.998107370831205,3.6688166088702303,-3.4398470273319712,0.6838013234499023,0.0,0.0,0.0,1.0
1718109248.044105,map,True,False,3,2,0.0,0.0,2.3846476078033447,-1.8094580173492432,0.0,0.0,0.0,0.06149526161054468,0.998107370831205,3.6688166088702303,-3.4398470273319712,0.6838013234499023,0.0,0.0,0.0,1.0
1718109248.1451414,map,True,False,3,2,0.0,0.0,2.3846476078033447,-1.8094580173492432,0.0,0.0,0.0,0.06149526161054468,0.998107370831205,3.6688166088702303,-3.4398470273319712,0.6838013234499023,0.0,0.0,0.0,1.0
1718109248.1955476,map,True,False,3,2,0.0,0.0,2.3846476078033447,-1.8094580173492432,0.0,0.0,0.0,0.06149526161054468,0.998107370831205,3.6688166088702303,-3.4398470273319712,0.6838013234499023,0.0,0.0,0.0,1.0
1718109248.2448752,map,True,False,3,2,0.0,0.0,2.3846476078033447,-1.8094580173492432,0.0,0.0,0.0,0.06149526161054468,0.998107370831205,3.748117642533276,-3.219639994932442,0.6855854430636585,0.0,0.0,0.0,1.0
1718109248.3437896,map,True,False,3,2,0.0,0.0,2.3846476078033447,-1.8094580173492432,0.0,0.0,0.0,0.06149526161054468,0.998107370831205,3.7600419197121666,-3.1755851173282545,0.6853884099130859,0.0,0.0,0.0,1.0
1718109248.4467492,map,True,False,3,2,0.0,0.0,2.3846476078033447,-1.8094580173492432,0.0,0.0,0.0,0.06149526161054468,0.998107370831205,3.7600419197121666,-3.1755851173282545,0.6853884099130859,0.0,0.0,0.0,1.0
1718109248.4997294,map,True,False,3,2,0.0,0.0,2.3846476078033447,-1.8094580173492432,0.0,0.0,0.0,0.06149526161054468,0.998107370831205,3.7600419197121666,-3.1755851173282545,0.6853884099130859,0.0,0.0,0.0,1.0
1718109248.5464094,map,True,False,3,2,0.0,0.0,2.3846476078033447,-1.8094580173492432,0.0,0.0,0.0,0.06149526161054468,0.998107370831205,3.7600419197121666,-3.1755851173282545,0.6853884099130859,0.0,0.0,0.0,1.0
1718109248.6486113,map,True,True,2,2,0.49874686716791977,0.49874686716791977,2.455792188644409,-1.8361072540283203,0.0,0.0,0.0,0.06276574923534883,0.9980282865760334,3.7187353872805256,-2.9205457495533462,0.6844709589613946,0.0,0.0,0.0,1.0
1718109248.6980996,map,True,True,2,2,0.49874686716791977,0.49874686716791977,2.455792188644409,-1.8361072540283203,0.0,0.0,0.0,0.06276574923534883,0.9980282865760334,3.7187353872805256,-2.9205457495533462,0.6844709589613946,0.0,0.0,0.0,1.0
1718109248.7484748,map,True,True,2,2,0.49874686716791977,0.49874686716791977,2.455792188644409,-1.8361072540283203,0.0,0.0,0.0,0.06276574923534883,0.9980282865760334,3.7187353872805256,-2.9205457495533462,0.6844709589613946,0.0,0.0,0.0,1.0
1718109248.8997135,map,True,True,2,2,0.49874686716791977,0.49874686716791977,2.455792188644409,-1.8361072540283203,0.0,0.0,0.0,0.06276574923534883,0.9980282865760334,3.757410224839356,-2.8252309819763344,0.6858962714947996,0.0,0.0,0.0,1.0
1718109248.9977248,map,True,False,2,1,0.0,0.0,2.4707014560699463,-1.8255865573883057,0.0,0.0,0.0,0.062105245716221655,0.9980696136213456,3.7577370570531263,-2.7774510185426955,0.6839666101012529,0.0,0.0,0.0,1.0
1718109249.0481126,map,True,False,2,1,0.0,0.0,2.4707014560699463,-1.8255865573883057,0.0,0.0,0.0,0.062105245716221655,0.9980696136213456,3.7577370570531263,-2.7774510185426955,0.6839666101012529,0.0,0.0,0.0,1.0
1718109249.1485605,map,True,False,2,1,0.0,0.0,2.4707014560699463,-1.8255865573883057,0.0,0.0,0.0,0.062105245716221655,0.9980696136213456,3.7577370570531263,-2.7774510185426955,0.6839666101012529,0.0,0.0,0.0,1.0
1718109249.2000437,map,True,False,2,1,0.0,0.0,2.4707014560699463,-1.8255865573883057,0.0,0.0,0.0,0.062105245716221655,0.9980696136213456,3.7577370570531263,-2.7774510185426955,0.6839666101012529,0.0,0.0,0.0,1.0
1718109249.2501438,map,True,False,2,1,0.0,0.0,2.4707014560699463,-1.8255865573883057,0.0,0.0,0.0,0.062105245716221655,0.9980696136213456,3.768757451988223,-2.723544924542958,0.6837808736462074,0.0,0.0,0.0,1.0
1718109249.347745,map,True,False,2,1,0.0,0.0,2.4707014560699463,-1.8255865573883057,0.0,0.0,0.0,0.062105245716221655,0.9980696136213456,3.76557116179675,-2.713996560415106,0.6837481350477438,0.0,0.0,0.0,1.0
1718109249.3984036,map,True,False,2,1,0.0,0.0,2.4707014560699463,-1.8255865573883057,0.0,0.0,0.0,0.062105245716221655,0.9980696136213456,3.76557116179675,-2.713996560415106,0.6837481350477438,0.0,0.0,0.0,1.0
1718109249.4492345,map,True,False,2,1,0.0,0.0,2.4707014560699463,-1.8255865573883057,0.0,0.0,0.0,0.062105245716221655,0.9980696136213456,3.76557116179675,-2.713996560415106,0.6837481350477438,0.0,0.0,0.0,1.0
1718109249.499452,map,True,False,2,1,0.0,0.0,2.6229233741760254,-1.8610502481460571,0.0,0.0,0.0,0.06441516753250964,0.9979231845480924,3.76557116179675,-2.713996560415106,0.6837481350477438,0.0,0.0,0.0,1.0
1718109249.5507002,map,True,False,2,1,0.0,0.0,2.6229233741760254,-1.8610502481460571,0.0,0.0,0.0,0.06441516753250964,0.9979231845480924,3.76557116179675,-2.713996560415106,0.6837481350477438,0.0,0.0,0.0,1.0
1718109249.6493878,map,True,False,2,1,0.0,0.0,2.6229233741760254,-1.8610502481460571,0.0,0.0,0.0,0.06441516753250964,0.9979231845480924,3.792668349632139,-2.702795554752446,0.6836878271032061,0.0,0.0,0.0,1.0
1718109249.7499533,map,True,False,2,1,0.0,0.0,2.6229233741760254,-1.8610502481460571,0.0,0.0,0.0,0.06441516753250964,0.9979231845480924,3.792668349632139,-2.702795554752446,0.6836878271032061,0.0,0.0,0.0,1.0
1718109249.8000107,map,True,False,2,1,0.0,0.0,2.6229233741760254,-1.8610502481460571,0.0,0.0,0.0,0.06441516753250964,0.9979231845480924,3.792668349632139,-2.702795554752446,0.6836878271032061,0.0,0.0,0.0,1.0
1718109249.9018984,map,True,True,2,2,0.49874686716791977,0.49874686716791977,2.6229233741760254,-1.8610502481460571,0.0,0.0,0.0,0.06441516753250964,0.9979231845480924,3.8346167575477503,-2.724016944252312,0.6821825070066274,0.0,0.0,0.0,1.0
1718109250.0010135,map,True,False,2,1,0.0,0.0,2.6919097900390625,-1.8744844198226929,0.0,0.0,0.0,0.06481488028080283,0.9978973067575181,3.825300738802458,-2.7185968881389724,0.6837197053734643,0.0,0.0,0.0,1.0
1718109250.056188,map,True,False,2,1,0.0,0.0,2.6919097900390625,-1.8744844198226929,0.0,0.0,0.0,0.06481488028080283,0.9978973067575181,3.825300738802458,-2.7185968881389724,0.6837197053734643,0.0,0.0,0.0,1.0
1718109250.104957,map,True,False,2,1,0.0,0.0,2.6919097900390625,-1.8744844198226929,0.0,0.0,0.0,0.06481488028080283,0.9978973067575181,3.825300738802458,-2.7185968881389724,0.6837197053734643,0.0,0.0,0.0,1.0
1718109250.202112,map,True,False,2,1,0.0,0.0,2.6919097900390625,-1.8744844198226929,0.0,0.0,0.0,0.06481488028080283,0.9978973067575181,3.825300738802458,-2.7185968881389724,0.6837197053734643,0.0,0.0,0.0,1.0
1718109250.2535107,map,True,True,2,2,0.49874686716791977,0.49874686716791977,2.6919097900390625,-1.8744844198226929,0.0,0.0,0.0,0.06481488028080283,0.9978973067575181,3.874672363296866,-2.7019510442302868,0.6836542479340166,0.0,0.0,0.0,1.0
1718109250.353114,map,True,False,2,2,0.49874686716791977,0.49874686716791977,2.6919097900390625,-1.8744844198226929,0.0,0.0,0.0,0.06481488028080283,0.9978973067575181,3.868273390051269,-2.704414597867082,0.6851412128364647,0.0,0.0,0.0,1.0
1718109250.402424,map,True,False,2,2,0.49874686716791977,0.49874686716791977,2.6919097900390625,-1.8744844198226929,0.0,0.0,0.0,0.06481488028080283,0.9978973067575181,3.868273390051269,-2.704414597867082,0.6851412128364647,0.0,0.0,0.0,1.0
1718109250.4536157,map,True,True,2,2,0.49874686716791977,0.49874686716791977,2.7219512462615967,-1.877800703048706,0.0,0.0,0.0,0.0655551428182403,0.9978489539574699,3.868273390051269,-2.704414597867082,0.6851412128364647,0.0,0.0,0.0,1.0
1718109250.5543056,map,True,True,2,2,0.49874686716791977,0.49874686716791977,2.7219512462615967,-1.877800703048706,0.0,0.0,0.0,0.0655551428182403,0.9978489539574699,3.868273390051269,-2.704414597867082,0.6851412128364647,0.0,0.0,0.0,1.0
1718109250.6038039,map,True,False,2,2,0.49874686716791977,0.49874686716791977,2.7219512462615967,-1.877800703048706,0.0,0.0,0.0,0.0655551428182403,0.9978489539574699,3.8966618175212875,-2.785662815315211,0.6870592164171829,0.0,0.0,0.0,1.0
1718109250.6537673,map,True,True,2,2,0.49874686716791977,0.49874686716791977,2.7219512462615967,-1.877800703048706,0.0,0.0,0.0,0.0655551428182403,0.9978489539574699,3.9194296460976035,-2.807498488655223,0.685564644987655,0.0,0.0,0.0,1.0
1718109250.755049,map,True,False,2,2,0.49874686716791977,0.49874686716791977,2.7219512462615967,-1.877800703048706,0.0,0.0,0.0,0.0655551428182403,0.9978489539574699,3.9194296460976035,-2.807498488655223,0.685564644987655,0.0,0.0,0.0,1.0
1718109250.8039947,map,True,False,1,2,0.0,0.0,2.7837162017822266,-1.8861169815063477,0.0,0.0,0.0,0.06629023437645754,0.997800389738154,3.9194296460976035,-2.807498488655223,0.685564644987655,0.0,0.0,0.0,1.0
1718109250.9568975,map,True,False,1,2,0.0,0.0,2.7837162017822266,-1.8861169815063477,0.0,0.0,0.0,0.06629023437645754,0.997800389738154,3.942867789187253,-2.785563997846089,0.689947390499493,0.0,0.0,0.0,1.0
1718109251.0545897,map,True,False,1,2,0.0,0.0,2.7837162017822266,-1.8861169815063477,0.0,0.0,0.0,0.06629023437645754,0.997800389738154,3.9501266083774884,-2.8435269452890832,0.7158290361553006,0.0,0.0,0.0,1.0
1718109251.1049407,map,True,False,1,2,0.0,0.0,2.7837162017822266,-1.8861169815063477,0.0,0.0,0.0,0.06629023437645754,0.997800389738154,3.9501266083774884,-2.8435269452890832,0.7158290361553006,0.0,0.0,0.0,1.0
1718109251.1567025,map,True,False,1,2,0.0,0.0,2.7837162017822266,-1.8861169815063477,0.0,0.0,0.0,0.06629023437645754,0.997800389738154,3.9501266083774884,-2.8435269452890832,0.7158290361553006,0.0,0.0,0.0,1.0
1718109251.2056837,map,True,False,1,2,0.0,0.0,2.7837162017822266,-1.8861169815063477,0.0,0.0,0.0,0.06629023437645754,0.997800389738154,3.9501266083774884,-2.8435269452890832,0.7158290361553006,0.0,0.0,0.0,1.0
1718109251.2572234,map,True,False,1,2,0.0,0.0,2.7837162017822266,-1.8861169815063477,0.0,0.0,0.0,0.06629023437645754,0.997800389738154,3.9501266083774884,-2.8435269452890832,0.7158290361553006,0.0,0.0,0.0,1.0
1718109251.3570743,map,True,False,1,2,0.0,0.0,2.8938307762145996,-1.9180318117141724,0.0,0.0,0.0,0.0694921409213578,0.9975824936717254,3.979474199069065,-2.8476025613044644,0.7378309148494588,0.0,0.0,0.0,1.0
1718109251.4074824,map,True,False,1,2,0.0,0.0,2.8938307762145996,-1.9180318117141724,0.0,0.0,0.0,0.0694921409213578,0.9975824936717254,3.979474199069065,-2.8476025613044644,0.7378309148494588,0.0,0.0,0.0,1.0
1718109251.4577405,map,True,False,1,2,0.0,0.0,2.8938307762145996,-1.9180318117141724,0.0,0.0,0.0,0.0694921409213578,0.9975824936717254,3.979474199069065,-2.8476025613044644,0.7378309148494588,0.0,0.0,0.0,1.0
1718109251.556025,map,True,False,1,2,0.0,0.0,2.8938307762145996,-1.9180318117141724,0.0,0.0,0.0,0.0694921409213578,0.9975824936717254,3.979474199069065,-2.8476025613044644,0.7378309148494588,0.0,0.0,0.0,1.0
1718109251.5599313,map,True,False,1,2,0.0,0.0,2.8938307762145996,-1.9180318117141724,0.0,0.0,0.0,0.0694921409213578,0.9975824936717254,3.979474199069065,-2.8476025613044644,0.7378309148494588,0.0,0.0,0.0,1.0
1718109251.5635936,map,True,False,1,2,0.0,0.0,2.8938307762145996,-1.9180318117141724,0.0,0.0,0.0,0.0694921409213578,0.9975824936717254,3.979474199069065,-2.8476025613044644,0.7378309148494588,0.0,0.0,0.0,1.0
1718109251.5671842,map,True,False,1,2,0.0,0.0,2.8938307762145996,-1.9180318117141724,0.0,0.0,0.0,0.0694921409213578,0.9975824936717254,3.979474199069065,-2.8476025613044644,0.7378309148494588,0.0,0.0,0.0,1.0
1718109251.570164,map,True,False,1,2,0.0,0.0,2.8938307762145996,-1.9180318117141724,0.0,0.0,0.0,0.0694921409213578,0.9975824936717254,3.979474199069065,-2.8476025613044644,0.7378309148494588,0.0,0.0,0.0,1.0
1718109251.576608,map,True,False,1,2,0.0,0.0,2.8938307762145996,-1.9180318117141724,0.0,0.0,0.0,0.0694921409213578,0.9975824936717254,3.979474199069065,-2.8476025613044644,0.7378309148494588,0.0,0.0,0.0,1.0
1718109251.5794604,map,True,False,1,2,0.0,0.0,2.8938307762145996,-1.9180318117141724,0.0,0.0,0.0,0.0694921409213578,0.9975824936717254,3.979474199069065,-2.8476025613044644,0.7378309148494588,0.0,0.0,0.0,1.0
1718109251.5826461,map,True,False,1,2,0.0,0.0,2.8938307762145996,-1.9180318117141724,0.0,0.0,0.0,0.0694921409213578,0.9975824936717254,3.979474199069065,-2.8476025613044644,0.7378309148494588,0.0,0.0,0.0,1.0
1718109251.5864189,map,True,False,1,2,0.0,0.0,2.8938307762145996,-1.9180318117141724,0.0,0.0,0.0,0.0694921409213578,0.9975824936717254,3.979474199069065,-2.8476025613044644,0.7378309148494588,0.0,0.0,0.0,1.0
1718109251.5895796,map,True,False,1,2,0.0,0.0,2.8938307762145996,-1.9180318117141724,0.0,0.0,0.0,0.0694921409213578,0.9975824936717254,3.979474199069065,-2.8476025613044644,0.7378309148494588,0.0,0.0,0.0,1.0
1718109251.5966897,map,True,False,1,2,0.0,0.0,2.8938307762145996,-1.9180318117141724,0.0,0.0,0.0,0.0694921409213578,0.9975824936717254,3.979474199069065,-2.8476025613044644,0.7378309148494588,0.0,0.0,0.0,1.0
1718109251.599361,map,True,False,1,2,0.0,0.0,2.8938307762145996,-1.9180318117141724,0.0,0.0,0.0,0.0694921409213578,0.9975824936717254,3.979474199069065,-2.8476025613044644,0.7378309148494588,0.0,0.0,0.0,1.0
1718109251.6141837,map,True,False,1,2,0.0,0.0,2.8938307762145996,-1.9180318117141724,0.0,0.0,0.0,0.0694921409213578,0.9975824936717254,3.979474199069065,-2.8476025613044644,0.7378309148494588,0.0,0.0,0.0,1.0
1718109251.6334748,map,True,False,1,2,0.0,0.0,2.8938307762145996,-1.9180318117141724,0.0,0.0,0.0,0.0694921409213578,0.9975824936717254,3.979474199069065,-2.8476025613044644,0.7378309148494588,0.0,0.0,0.0,1.0
1718109251.6418834,map,True,False,1,2,0.0,0.0,2.8938307762145996,-1.9180318117141724,0.0,0.0,0.0,0.0694921409213578,0.9975824936717254,3.979474199069065,-2.8476025613044644,0.7378309148494588,0.0,0.0,0.0,1.0
1718109251.6461725,map,True,False,1,2,0.0,0.0,2.8938307762145996,-1.9180318117141724,0.0,0.0,0.0,0.0694921409213578,0.9975824936717254,3.979474199069065,-2.8476025613044644,0.7378309148494588,0.0,0.0,0.0,1.0
1718109251.6495233,map,True,False,1,2,0.0,0.0,2.8938307762145996,-1.9180318117141724,0.0,0.0,0.0,0.0694921409213578,0.9975824936717254,3.979474199069065,-2.8476025613044644,0.7378309148494588,0.0,0.0,0.0,1.0
1718109251.6540048,map,True,False,1,2,0.0,0.0,2.8938307762145996,-1.9180318117141724,0.0,0.0,0.0,0.0694921409213578,0.9975824936717254,3.979474199069065,-2.8476025613044644,0.7378309148494588,0.0,0.0,0.0,1.0
1718109251.6585984,map,True,False,1,2,0.0,0.0,2.8938307762145996,-1.9180318117141724,0.0,0.0,0.0,0.0694921409213578,0.9975824936717254,3.979474199069065,-2.8476025613044644,0.7378309148494588,0.0,0.0,0.0,1.0
1718109251.6622877,map,True,False,1,2,0.0,0.0,2.8938307762145996,-1.9180318117141724,0.0,0.0,0.0,0.0694921409213578,0.9975824936717254,3.979474199069065,-2.8476025613044644,0.7378309148494588,0.0,0.0,0.0,1.0
1718109251.6657667,map,True,False,1,2,0.0,0.0,2.8938307762145996,-1.9180318117141724,0.0,0.0,0.0,0.0694921409213578,0.9975824936717254,3.979474199069065,-2.8476025613044644,0.7378309148494588,0.0,0.0,0.0,1.0
1718109251.6702912,map,True,False,1,2,0.0,0.0,2.8938307762145996,-1.9180318117141724,0.0,0.0,0.0,0.0694921409213578,0.9975824936717254,3.979474199069065,-2.8476025613044644,0.7378309148494588,0.0,0.0,0.0,1.0
1718109251.673841,map,True,False,1,2,0.0,0.0,2.8938307762145996,-1.9180318117141724,0.0,0.0,0.0,0.0694921409213578,0.9975824936717254,3.979474199069065,-2.8476025613044644,0.7378309148494588,0.0,0.0,0.0,1.0
1718109251.6785011,map,True,False,1,2,0.0,0.0,2.8938307762145996,-1.9180318117141724,0.0,0.0,0.0,0.0694921409213578,0.9975824936717254,3.979474199069065,-2.8476025613044644,0.7378309148494588,0.0,0.0,0.0,1.0
1718109251.6817946,map,True,False,1,2,0.0,0.0,2.8938307762145996,-1.9180318117141724,0.0,0.0,0.0,0.0694921409213578,0.9975824936717254,3.979474199069065,-2.8476025613044644,0.7378309148494588,0.0,0.0,0.0,1.0
1718109251.686553,map,True,False,1,2,0.0,0.0,2.8938307762145996,-1.9180318117141724,0.0,0.0,0.0,0.0694921409213578,0.9975824936717254,3.979474199069065,-2.8476025613044644,0.7378309148494588,0.0,0.0,0.0,1.0
1718109251.690276,map,True,False,1,2,0.0,0.0,2.8938307762145996,-1.9180318117141724,0.0,0.0,0.0,0.0694921409213578,0.9975824936717254,3.979474199069065,-2.8476025613044644,0.7378309148494588,0.0,0.0,0.0,1.0
1718109251.6964557,map,True,False,1,2,0.0,0.0,2.8938307762145996,-1.9180318117141724,0.0,0.0,0.0,0.0694921409213578,0.9975824936717254,3.979474199069065,-2.8476025613044644,0.7378309148494588,0.0,0.0,0.0,1.0
1718109251.6983426,map,True,False,1,2,0.0,0.0,2.8938307762145996,-1.9180318117141724,0.0,0.0,0.0,0.0694921409213578,0.9975824936717254,3.979474199069065,-2.8476025613044644,0.7378309148494588,0.0,0.0,0.0,1.0
1718109251.7063515,map,True,False,1,2,0.0,0.0,2.8938307762145996,-1.9180318117141724,0.0,0.0,0.0,0.0694921409213578,0.9975824936717254,3.979474199069065,-2.8476025613044644,0.7378309148494588,0.0,0.0,0.0,1.0
1718109251.7091808,map,True,False,1,2,0.0,0.0,2.8938307762145996,-1.9180318117141724,0.0,0.0,0.0,0.0694921409213578,0.9975824936717254,3.979474199069065,-2.8476025613044644,0.7378309148494588,0.0,0.0,0.0,1.0
1718109251.713787,map,True,False,1,2,0.0,0.0,2.8938307762145996,-1.9180318117141724,0.0,0.0,0.0,0.0694921409213578,0.9975824936717254,3.979474199069065,-2.8476025613044644,0.7378309148494588,0.0,0.0,0.0,1.0
1718109251.7224085,map,True,False,1,2,0.0,0.0,2.8938307762145996,-1.9180318117141724,0.0,0.0,0.0,0.0694921409213578,0.9975824936717254,3.979474199069065,-2.8476025613044644,0.7378309148494588,0.0,0.0,0.0,1.0
1718109251.7294137,map,True,False,1,2,0.0,0.0,2.8938307762145996,-1.9180318117141724,0.0,0.0,0.0,0.0694921409213578,0.9975824936717254,3.979474199069065,-2.8476025613044644,0.7378309148494588,0.0,0.0,0.0,1.0
1718109251.7339425,map,True,False,1,2,0.0,0.0,2.8938307762145996,-1.9180318117141724,0.0,0.0,0.0,0.0694921409213578,0.9975824936717254,3.979474199069065,-2.8476025613044644,0.7378309148494588,0.0,0.0,0.0,1.0
1718109251.737333,map,True,False,1,2,0.0,0.0,2.8938307762145996,-1.9180318117141724,0.0,0.0,0.0,0.0694921409213578,0.9975824936717254,3.979474199069065,-2.8476025613044644,0.7378309148494588,0.0,0.0,0.0,1.0
1718109251.749592,map,True,False,1,2,0.0,0.0,2.8938307762145996,-1.9180318117141724,0.0,0.0,0.0,0.0694921409213578,0.9975824936717254,3.979474199069065,-2.8476025613044644,0.7378309148494588,0.0,0.0,0.0,1.0
1718109251.7539244,map,True,False,1,2,0.0,0.0,2.8938307762145996,-1.9180318117141724,0.0,0.0,0.0,0.0694921409213578,0.9975824936717254,3.979474199069065,-2.8476025613044644,0.7378309148494588,0.0,0.0,0.0,1.0
1718109251.7580566,map,True,False,1,2,0.0,0.0,2.8938307762145996,-1.9180318117141724,0.0,0.0,0.0,0.0694921409213578,0.9975824936717254,3.979474199069065,-2.8476025613044644,0.7378309148494588,0.0,0.0,0.0,1.0
1718109251.7659814,map,True,False,1,2,0.0,0.0,2.8938307762145996,-1.9180318117141724,0.0,0.0,0.0,0.0694921409213578,0.9975824936717254,3.979474199069065,-2.8476025613044644,0.7378309148494588,0.0,0.0,0.0,1.0
1718109251.7696333,map,True,False,1,2,0.0,0.0,2.8938307762145996,-1.9180318117141724,0.0,0.0,0.0,0.0694921409213578,0.9975824936717254,3.979474199069065,-2.8476025613044644,0.7378309148494588,0.0,0.0,0.0,1.0
1718109251.7781103,map,True,False,1,2,0.0,0.0,2.8938307762145996,-1.9180318117141724,0.0,0.0,0.0,0.0694921409213578,0.9975824936717254,3.979474199069065,-2.8476025613044644,0.7378309148494588,0.0,0.0,0.0,1.0
1718109251.7866108,map,True,False,1,2,0.0,0.0,2.8938307762145996,-1.9180318117141724,0.0,0.0,0.0,0.0694921409213578,0.9975824936717254,3.979474199069065,-2.8476025613044644,0.7378309148494588,0.0,0.0,0.0,1.0
