timestamp_sec,frame_id,game_played,yielding,player1discrete,player2discrete,player1yieldprob,player2yieldprob,player1_pose_x,player1_pose_y,player1_pose_z,player1_pose_orient_x,player1_pose_orient_y,player1_pose_orient_z,player1_pose_orient_w,player2_pose_x,player2_pose_y,player2_pose_z,player2_pose_orient_x,player2_pose_orient_y,player2_pose_orient_z,player2_pose_orient_w
1717777421.4393997,map,True,False,6,8,0.0,0.0,1.9173038005828857,-2.3834469318389893,0.0,0.0,0.0,0.0372341527984097,0.9993065724615479,3.906805668941628,-10.061693251011736,0.956671361618063,0.0,0.0,0.0,1.0
1717777421.490186,map,True,False,6,8,0.0,0.0,1.9173038005828857,-2.3834469318389893,0.0,0.0,0.0,0.0372341527984097,0.9993065724615479,3.906805668941628,-10.061693251011736,0.956671361618063,0.0,0.0,0.0,1.0
1717777421.5403016,map,True,False,6,8,0.0,0.0,1.9173038005828857,-2.3834469318389893,0.0,0.0,0.0,0.0372341527984097,0.9993065724615479,3.906805668941628,-10.061693251011736,0.956671361618063,0.0,0.0,0.0,1.0
1717777421.59094,map,True,False,6,8,0.0,0.0,1.9173038005828857,-2.3834469318389893,0.0,0.0,0.0,0.0372341527984097,0.9993065724615479,3.906805668941628,-10.061693251011736,0.956671361618063,0.0,0.0,0.0,1.0
1717777421.6407688,map,True,False,6,8,0.0,0.0,1.9257988929748535,-2.3846435546875,0.0,0.0,0.0,0.03713826241856724,0.9993101363039892,3.906805668941628,-10.061693251011736,0.956671361618063,0.0,0.0,0.0,1.0
1717777421.7388809,map,True,False,6,7,0.0,0.0,1.9257988929748535,-2.3846435546875,0.0,0.0,0.0,0.03713826241856724,0.9993101363039892,3.9324201925619824,-9.656487285094178,1.0274184412845,0.0,0.0,0.0,1.0
1717777421.7904944,map,True,False,6,7,0.0,0.0,1.9257988929748535,-2.3846435546875,0.0,0.0,0.0,0.03713826241856724,0.9993101363039892,3.9324201925619824,-9.656487285094178,1.0274184412845,0.0,0.0,0.0,1.0
1717777421.84012,map,True,False,6,7,0.0,0.0,1.9257988929748535,-2.3846435546875,0.0,0.0,0.0,0.03713826241856724,0.9993101363039892,3.9324201925619824,-9.656487285094178,1.0274184412845,0.0,0.0,0.0,1.0
1717777421.8912525,map,True,False,6,7,0.0,0.0,1.9257988929748535,-2.3846435546875,0.0,0.0,0.0,0.03713826241856724,0.9993101363039892,3.9324201925619824,-9.656487285094178,1.0274184412845,0.0,0.0,0.0,1.0
1717777421.9908903,map,True,False,6,7,0.0,0.0,1.9257988929748535,-2.3846435546875,0.0,0.0,0.0,0.03713826241856724,0.9993101363039892,3.9324201925619824,-9.656487285094178,1.0274184412845,0.0,0.0,0.0,1.0
1717777422.0918124,map,True,False,6,8,0.0,0.0,1.9257988929748535,-2.3846435546875,0.0,0.0,0.0,0.03713826241856724,0.9993101363039892,4.054559827668109,-9.95970620949235,0.9191506490055849,0.0,0.0,0.0,1.0
1717777422.1415381,map,True,False,6,8,0.0,0.0,1.9257988929748535,-2.3846435546875,0.0,0.0,0.0,0.03713826241856724,0.9993101363039892,4.054559827668109,-9.95970620949235,0.9191506490055849,0.0,0.0,0.0,1.0
1717777422.3448455,map,True,False,6,7,0.0,0.0,1.9904530048370361,-2.3995022773742676,0.0,0.0,0.0,0.03726459215401164,0.999305439186811,4.062629159321176,-9.676535010722926,0.9098767570343453,0.0,0.0,0.0,1.0
1717777422.3947258,map,True,False,6,7,0.0,0.0,1.9904530048370361,-2.3995022773742676,0.0,0.0,0.0,0.03726459215401164,0.999305439186811,4.023633192546903,-9.309325482426763,0.999743929768281,0.0,0.0,0.0,1.0
1717777422.4947722,map,True,False,6,7,0.0,0.0,1.9904530048370361,-2.3995022773742676,0.0,0.0,0.0,0.03726459215401164,0.999305439186811,4.023633192546903,-9.309325482426763,0.999743929768281,0.0,0.0,0.0,1.0
1717777422.5447905,map,True,False,6,7,0.0,0.0,1.9904530048370361,-2.3995022773742676,0.0,0.0,0.0,0.03726459215401164,0.999305439186811,4.023633192546903,-9.309325482426763,0.999743929768281,0.0,0.0,0.0,1.0
1717777422.6446788,map,True,False,6,7,0.0,0.0,1.9904530048370361,-2.3995022773742676,0.0,0.0,0.0,0.03726459215401164,0.999305439186811,4.023633192546903,-9.309325482426763,0.999743929768281,0.0,0.0,0.0,1.0
1717777422.742854,map,True,False,6,7,0.0,0.0,2.0824222564697266,-2.408022165298462,0.0,0.0,0.0,0.03743718882556002,0.9992989824785931,4.069543647521275,-8.92275898935919,0.8578962350550816,0.0,0.0,0.0,1.0
1717777422.7954297,map,True,False,6,7,0.0,0.0,2.0824222564697266,-2.408022165298462,0.0,0.0,0.0,0.03743718882556002,0.9992989824785931,4.069543647521275,-8.92275898935919,0.8578962350550816,0.0,0.0,0.0,1.0
1717777422.8457448,map,True,False,6,7,0.0,0.0,2.0824222564697266,-2.408022165298462,0.0,0.0,0.0,0.03743718882556002,0.9992989824785931,4.069543647521275,-8.92275898935919,0.8578962350550816,0.0,0.0,0.0,1.0
1717777422.9450274,map,True,False,6,7,0.0,0.0,2.0824222564697266,-2.408022165298462,0.0,0.0,0.0,0.03743718882556002,0.9992989824785931,4.069543647521275,-8.92275898935919,0.8578962350550816,0.0,0.0,0.0,1.0
1717777422.9952202,map,True,False,6,7,0.0,0.0,2.0824222564697266,-2.408022165298462,0.0,0.0,0.0,0.03743718882556002,0.9992989824785931,4.069543647521275,-8.92275898935919,0.8578962350550816,0.0,0.0,0.0,1.0
1717777423.0459213,map,True,False,6,6,0.5957621508060097,0.5957621508060098,2.0824222564697266,-2.408022165298462,0.0,0.0,0.0,0.03743718882556002,0.9992989824785931,4.112233145061168,-8.582145896631118,0.8757014818867757,0.0,0.0,0.0,1.0
1717777423.0986056,map,True,False,6,6,0.5957621508060097,0.5957621508060098,2.0824222564697266,-2.408022165298462,0.0,0.0,0.0,0.03743718882556002,0.9992989824785931,4.112233145061168,-8.582145896631118,0.8757014818867757,0.0,0.0,0.0,1.0
1717777423.1471286,map,True,False,6,6,0.5957621508060097,0.5957621508060098,2.0824222564697266,-2.408022165298462,0.0,0.0,0.0,0.03743718882556002,0.9992989824785931,4.112233145061168,-8.582145896631118,0.8757014818867757,0.0,0.0,0.0,1.0
1717777423.400641,map,True,False,5,7,0.0,0.0,2.1904842853546143,-2.4302303791046143,0.0,0.0,0.0,0.03852782706432476,0.9992575273304243,4.255583994028328,-9.142016600356683,0.8633986901699012,0.0,0.0,0.0,1.0
1717777423.4469478,map,True,False,5,7,0.0,0.0,2.1904842853546143,-2.4302303791046143,0.0,0.0,0.0,0.03852782706432476,0.9992575273304243,4.255583994028328,-9.142016600356683,0.8633986901699012,0.0,0.0,0.0,1.0
1717777423.4973655,map,True,False,5,7,0.0,0.0,2.1904842853546143,-2.4302303791046143,0.0,0.0,0.0,0.03852782706432476,0.9992575273304243,4.255583994028328,-9.142016600356683,0.8633986901699012,0.0,0.0,0.0,1.0
1717777423.5479493,map,True,False,5,7,0.0,0.0,2.1904842853546143,-2.4302303791046143,0.0,0.0,0.0,0.03852782706432476,0.9992575273304243,4.255583994028328,-9.142016600356683,0.8633986901699012,0.0,0.0,0.0,1.0
1717777423.5987563,map,True,False,5,7,0.0,0.0,2.1904842853546143,-2.4302303791046143,0.0,0.0,0.0,0.03852782706432476,0.9992575273304243,4.255583994028328,-9.142016600356683,0.8633986901699012,0.0,0.0,0.0,1.0
1717777423.6983469,map,True,False,5,6,0.0,0.0,2.1904842853546143,-2.4302303791046143,0.0,0.0,0.0,0.03852782706432476,0.9992575273304243,4.1057125902539795,-7.841726934651574,0.8362331026078906,0.0,0.0,0.0,1.0
1717777423.7981117,map,True,True,5,5,0.612995793784914,0.612995793784914,2.1904842853546143,-2.4302303791046143,0.0,0.0,0.0,0.03852782706432476,0.9992575273304243,4.119044320048808,-7.788470156043248,0.8429710610820291,0.0,0.0,0.0,1.0
1717777423.8481352,map,True,False,5,5,0.612995793784914,0.612995793784914,2.1904842853546143,-2.4302303791046143,0.0,0.0,0.0,0.03852782706432476,0.9992575273304243,4.119044320048808,-7.788470156043248,0.8429710610820291,0.0,0.0,0.0,1.0
1717777423.8989594,map,True,True,5,5,0.612995793784914,0.612995793784914,2.318308115005493,-2.4531822204589844,0.0,0.0,0.0,0.03938944563215899,0.99922392950438,4.119044320048808,-7.788470156043248,0.8429710610820291,0.0,0.0,0.0,1.0
1717777424.0020163,map,True,True,5,5,0.612995793784914,0.612995793784914,2.318308115005493,-2.4531822204589844,0.0,0.0,0.0,0.03938944563215899,0.99922392950438,4.119044320048808,-7.788470156043248,0.8429710610820291,0.0,0.0,0.0,1.0
1717777424.0509424,map,True,False,5,6,0.0,0.0,2.318308115005493,-2.4531822204589844,0.0,0.0,0.0,0.03938944563215899,0.99922392950438,4.196792410316151,-7.825221106765846,0.8440725803231994,0.0,0.0,0.0,1.0
1717777424.1014032,map,True,False,5,6,0.0,0.0,2.318308115005493,-2.4531822204589844,0.0,0.0,0.0,0.03938944563215899,0.99922392950438,4.196792410316151,-7.825221106765846,0.8440725803231994,0.0,0.0,0.0,1.0
1717777424.1515293,map,True,False,5,6,0.0,0.0,2.318308115005493,-2.4531822204589844,0.0,0.0,0.0,0.03938944563215899,0.99922392950438,4.196792410316151,-7.825221106765846,0.8440725803231994,0.0,0.0,0.0,1.0
1717777424.3535402,map,True,False,5,6,0.0,0.0,2.318308115005493,-2.4531822204589844,0.0,0.0,0.0,0.03938944563215899,0.99922392950438,4.398665158068597,-8.346327988881056,0.8596200566765301,0.0,0.0,0.0,1.0
1717777424.452926,map,True,False,5,6,0.0,0.0,2.4138500690460205,-2.470909595489502,0.0,0.0,0.0,0.039605571594549645,0.9992153844709588,4.338020987683175,-7.948326449103064,0.8394834468078457,0.0,0.0,0.0,1.0
1717777424.510372,map,True,False,5,6,0.0,0.0,2.4138500690460205,-2.470909595489502,0.0,0.0,0.0,0.039605571594549645,0.9992153844709588,4.338020987683175,-7.948326449103064,0.8394834468078457,0.0,0.0,0.0,1.0
1717777424.5623646,map,True,False,5,6,0.0,0.0,2.4138500690460205,-2.470909595489502,0.0,0.0,0.0,0.039605571594549645,0.9992153844709588,4.338020987683175,-7.948326449103064,0.8394834468078457,0.0,0.0,0.0,1.0
1717777424.607898,map,True,False,5,6,0.0,0.0,2.4138500690460205,-2.470909595489502,0.0,0.0,0.0,0.039605571594549645,0.9992153844709588,4.338020987683175,-7.948326449103064,0.8394834468078457,0.0,0.0,0.0,1.0
1717777424.7070951,map,True,True,5,5,0.612995793784914,0.612995793784914,2.4138500690460205,-2.470909595489502,0.0,0.0,0.0,0.039605571594549645,0.9992153844709588,4.247799331986198,-6.867667457041563,0.8284682481228479,0.0,0.0,0.0,1.0
1717777424.8052332,map,True,False,5,5,0.612995793784914,0.612995793784914,2.4138500690460205,-2.470909595489502,0.0,0.0,0.0,0.039605571594549645,0.9992153844709588,4.247799331986198,-6.867667457041563,0.8284682481228479,0.0,0.0,0.0,1.0
1717777424.8551579,map,True,True,5,5,0.612995793784914,0.612995793784914,2.4138500690460205,-2.470909595489502,0.0,0.0,0.0,0.039605571594549645,0.9992153844709588,4.247799331986198,-6.867667457041563,0.8284682481228479,0.0,0.0,0.0,1.0
1717777424.9050763,map,True,True,5,5,0.612995793784914,0.612995793784914,2.4138500690460205,-2.470909595489502,0.0,0.0,0.0,0.039605571594549645,0.9992153844709588,4.247799331986198,-6.867667457041563,0.8284682481228479,0.0,0.0,0.0,1.0
1717777424.9557483,map,True,False,5,5,0.612995793784914,0.612995793784914,2.4138500690460205,-2.470909595489502,0.0,0.0,0.0,0.039605571594549645,0.9992153844709588,4.247799331986198,-6.867667457041563,0.8284682481228479,0.0,0.0,0.0,1.0
1717777425.0564835,map,True,False,5,5,0.612995793784914,0.612995793784914,2.4138500690460205,-2.470909595489502,0.0,0.0,0.0,0.039605571594549645,0.9992153844709588,4.326451381427662,-6.919341948805191,0.797204868341385,0.0,0.0,0.0,1.0
1717777425.1063867,map,True,False,5,5,0.612995793784914,0.612995793784914,2.5243115425109863,-2.486752510070801,0.0,0.0,0.0,0.03949719409795715,0.999219679366001,4.326451381427662,-6.919341948805191,0.797204868341385,0.0,0.0,0.0,1.0
1717777425.1650329,map,True,False,5,5,0.612995793784914,0.612995793784914,2.5243115425109863,-2.486752510070801,0.0,0.0,0.0,0.03949719409795715,0.999219679366001,4.326451381427662,-6.919341948805191,0.797204868341385,0.0,0.0,0.0,1.0
1717777425.359732,map,True,True,5,5,0.612995793784914,0.612995793784914,2.5243115425109863,-2.486752510070801,0.0,0.0,0.0,0.03949719409795715,0.999219679366001,4.355449310201679,-6.803415768756868,0.8199884808928419,0.0,0.0,0.0,1.0
1717777425.4111106,map,True,False,5,4,0.0,0.0,2.5243115425109863,-2.486752510070801,0.0,0.0,0.0,0.03949719409795715,0.999219679366001,4.350483493449712,-6.777534536053833,0.8256560352898816,0.0,0.0,0.0,1.0
1717777425.510257,map,True,False,5,4,0.0,0.0,2.5243115425109863,-2.486752510070801,0.0,0.0,0.0,0.03949719409795715,0.999219679366001,4.350483493449712,-6.777534536053833,0.8256560352898816,0.0,0.0,0.0,1.0
1717777425.5605557,map,True,False,5,4,0.0,0.0,2.5243115425109863,-2.486752510070801,0.0,0.0,0.0,0.03949719409795715,0.999219679366001,4.350483493449712,-6.777534536053833,0.8256560352898816,0.0,0.0,0.0,1.0
1717777425.6107306,map,True,False,5,4,0.0,0.0,2.5243115425109863,-2.486752510070801,0.0,0.0,0.0,0.03949719409795715,0.999219679366001,4.350483493449712,-6.777534536053833,0.8256560352898816,0.0,0.0,0.0,1.0
1717777425.6614006,map,True,True,4,4,0.5922520728754596,0.5922520728754596,2.604642391204834,-2.510255813598633,0.0,0.0,0.0,0.04063377339127531,0.999174104816111,4.350483493449712,-6.777534536053833,0.8256560352898816,0.0,0.0,0.0,1.0
1717777425.7172697,map,True,True,4,4,0.5922520728754596,0.5922520728754596,2.604642391204834,-2.510255813598633,0.0,0.0,0.0,0.04063377339127531,0.999174104816111,4.35175534307572,-6.303156198093914,0.7868459194238844,0.0,0.0,0.0,1.0
1717777425.8153095,map,True,True,4,4,0.5922520728754596,0.5922520728754596,2.604642391204834,-2.510255813598633,0.0,0.0,0.0,0.04063377339127531,0.999174104816111,4.329339566206733,-6.115867554473103,0.7873978197533591,0.0,0.0,0.0,1.0
1717777425.865427,map,True,True,4,4,0.5922520728754596,0.5922520728754596,2.604642391204834,-2.510255813598633,0.0,0.0,0.0,0.04063377339127531,0.999174104816111,4.329339566206733,-6.115867554473103,0.7873978197533591,0.0,0.0,0.0,1.0
1717777425.9656975,map,True,True,4,4,0.5922520728754596,0.5922520728754596,2.604642391204834,-2.510255813598633,0.0,0.0,0.0,0.04063377339127531,0.999174104816111,4.329339566206733,-6.115867554473103,0.7873978197533591,0.0,0.0,0.0,1.0
1717777426.0665028,map,True,True,4,4,0.5922520728754596,0.5922520728754596,2.604642391204834,-2.510255813598633,0.0,0.0,0.0,0.04063377339127531,0.999174104816111,4.369265456418001,-5.854378011312445,0.75924097477331,0.0,0.0,0.0,1.0
1717777426.118393,map,True,True,4,4,0.5922520728754596,0.5922520728754596,2.6849942207336426,-2.5277321338653564,0.0,0.0,0.0,0.04147410081237817,0.9991395795176715,4.369265456418001,-5.854378011312445,0.75924097477331,0.0,0.0,0.0,1.0
1717777426.4694667,map,True,False,4,3,0.0,0.0,2.6849942207336426,-2.5277321338653564,0.0,0.0,0.0,0.04147410081237817,0.9991395795176715,4.350674556859451,-5.663181875781932,0.7497941238825607,0.0,0.0,0.0,1.0
1717777426.5689242,map,True,False,4,3,0.0,0.0,2.6849942207336426,-2.5277321338653564,0.0,0.0,0.0,0.04147410081237817,0.9991395795176715,4.350674556859451,-5.663181875781932,0.7497941238825607,0.0,0.0,0.0,1.0
1717777426.6179316,map,True,False,4,3,0.0,0.0,2.6849942207336426,-2.5277321338653564,0.0,0.0,0.0,0.04147410081237817,0.9991395795176715,4.350674556859451,-5.663181875781932,0.7497941238825607,0.0,0.0,0.0,1.0
1717777426.669386,map,True,False,4,3,0.0,0.0,2.6849942207336426,-2.5277321338653564,0.0,0.0,0.0,0.04147410081237817,0.9991395795176715,4.350674556859451,-5.663181875781932,0.7497941238825607,0.0,0.0,0.0,1.0
1717777426.768467,map,True,False,4,3,0.0,0.0,2.7620811462402344,-2.5471792221069336,0.0,0.0,0.0,0.04154673419304967,0.9991365668864427,4.41785896757363,-5.512774573199508,0.7750602191477078,0.0,0.0,0.0,1.0
1717777426.817638,map,True,False,4,3,0.0,0.0,2.7620811462402344,-2.5471792221069336,0.0,0.0,0.0,0.04154673419304967,0.9991365668864427,4.41785896757363,-5.512774573199508,0.7750602191477078,0.0,0.0,0.0,1.0
1717777426.9179814,map,True,False,4,3,0.0,0.0,2.7620811462402344,-2.5471792221069336,0.0,0.0,0.0,0.04154673419304967,0.9991365668864427,4.41785896757363,-5.512774573199508,0.7750602191477078,0.0,0.0,0.0,1.0
1717777426.9695284,map,True,False,4,3,0.0,0.0,2.7620811462402344,-2.5471792221069336,0.0,0.0,0.0,0.04154673419304967,0.9991365668864427,4.41785896757363,-5.512774573199508,0.7750602191477078,0.0,0.0,0.0,1.0
1717777427.018436,map,True,False,4,3,0.0,0.0,2.7620811462402344,-2.5471792221069336,0.0,0.0,0.0,0.04154673419304967,0.9991365668864427,4.41785896757363,-5.512774573199508,0.7750602191477078,0.0,0.0,0.0,1.0
1717777427.1195958,map,True,False,4,3,0.0,0.0,2.7620811462402344,-2.5471792221069336,0.0,0.0,0.0,0.04154673419304967,0.9991365668864427,4.467099593704324,-5.261179720201156,0.7678774458715827,0.0,0.0,0.0,1.0
1717777427.1741877,map,True,False,4,3,0.0,0.0,2.825852394104004,-2.568864107131958,0.0,0.0,0.0,0.04205618135452367,0.9991152544981661,4.467099593704324,-5.261179720201156,0.7678774458715827,0.0,0.0,0.0,1.0
1717777427.4711673,map,True,False,4,3,0.0,0.0,2.825852394104004,-2.568864107131958,0.0,0.0,0.0,0.04205618135452367,0.9991152544981661,4.476376233103139,-4.942714076517436,0.7349429704988144,0.0,0.0,0.0,1.0
1717777427.572599,map,True,False,4,3,0.0,0.0,2.825852394104004,-2.568864107131958,0.0,0.0,0.0,0.04205618135452367,0.9991152544981661,4.476376233103139,-4.942714076517436,0.7349429704988144,0.0,0.0,0.0,1.0
1717777427.6208484,map,True,False,4,3,0.0,0.0,2.825852394104004,-2.568864107131958,0.0,0.0,0.0,0.04205618135452367,0.9991152544981661,4.476376233103139,-4.942714076517436,0.7349429704988144,0.0,0.0,0.0,1.0
1717777427.6714132,map,True,False,4,3,0.0,0.0,2.886484384536743,-2.5739076137542725,0.0,0.0,0.0,0.04227367836789632,0.9991060672122576,4.476376233103139,-4.942714076517436,0.7349429704988144,0.0,0.0,0.0,1.0
1717777427.7719843,map,True,False,4,3,0.0,0.0,2.886484384536743,-2.5739076137542725,0.0,0.0,0.0,0.04227367836789632,0.9991060672122576,4.552423550647092,-4.759904681877232,0.6878104137457675,0.0,0.0,0.0,1.0
1717777427.8713052,map,True,False,4,3,0.0,0.0,2.886484384536743,-2.5739076137542725,0.0,0.0,0.0,0.04227367836789632,0.9991060672122576,4.552423550647092,-4.759904681877232,0.6878104137457675,0.0,0.0,0.0,1.0
1717777427.9708657,map,True,False,4,3,0.0,0.0,2.886484384536743,-2.5739076137542725,0.0,0.0,0.0,0.04227367836789632,0.9991060672122576,4.552423550647092,-4.759904681877232,0.6878104137457675,0.0,0.0,0.0,1.0
1717777428.0207734,map,True,False,4,3,0.0,0.0,2.886484384536743,-2.5739076137542725,0.0,0.0,0.0,0.04227367836789632,0.9991060672122576,4.552423550647092,-4.759904681877232,0.6878104137457675,0.0,0.0,0.0,1.0
1717777428.0801983,map,True,False,4,2,0.0,0.0,2.9671506881713867,-2.6059508323669434,0.0,0.0,0.0,0.0435886976341811,0.9990495545971767,4.582971782374302,-4.574347629138954,0.6837864100614133,0.0,0.0,0.0,1.0
1717777428.124012,map,True,False,4,2,0.0,0.0,2.9671506881713867,-2.6059508323669434,0.0,0.0,0.0,0.0435886976341811,0.9990495545971767,4.588066390646804,-4.465628925397764,0.6834923524975045,0.0,0.0,0.0,1.0
1717777428.424931,map,True,False,4,2,0.0,0.0,2.9671506881713867,-2.6059508323669434,0.0,0.0,0.0,0.0435886976341811,0.9990495545971767,4.584209224604231,-4.230276986978173,0.6858518540012992,0.0,0.0,0.0,1.0
1717777428.5233045,map,True,False,3,2,0.0,0.0,3.0354881286621094,-2.6078782081604004,0.0,0.0,0.0,0.04360517677074275,0.9990488386607247,4.638295432627973,-4.177939191633774,0.6855538080156256,0.0,0.0,0.0,1.0
1717777428.5751603,map,True,False,3,2,0.0,0.0,3.0354881286621094,-2.6078782081604004,0.0,0.0,0.0,0.04360517677074275,0.9990488386607247,4.638295432627973,-4.177939191633774,0.6855538080156256,0.0,0.0,0.0,1.0
1717777428.6743507,map,True,False,3,2,0.0,0.0,3.0354881286621094,-2.6078782081604004,0.0,0.0,0.0,0.04360517677074275,0.9990488386607247,4.638295432627973,-4.177939191633774,0.6855538080156256,0.0,0.0,0.0,1.0
1717777428.7747495,map,True,False,3,2,0.0,0.0,3.0354881286621094,-2.6078782081604004,0.0,0.0,0.0,0.04360517677074275,0.9990488386607247,4.712371686999127,-3.9163617679327665,0.6844392444870795,0.0,0.0,0.0,1.0
1717777428.823882,map,True,False,3,2,0.0,0.0,3.0354881286621094,-2.6078782081604004,0.0,0.0,0.0,0.04360517677074275,0.9990488386607247,4.712371686999127,-3.9163617679327665,0.6844392444870795,0.0,0.0,0.0,1.0
1717777428.8743346,map,True,False,3,2,0.0,0.0,3.0354881286621094,-2.6078782081604004,0.0,0.0,0.0,0.04360517677074275,0.9990488386607247,4.712371686999127,-3.9163617679327665,0.6844392444870795,0.0,0.0,0.0,1.0
1717777428.9741526,map,True,False,3,2,0.0,0.0,3.191575527191162,-2.639521837234497,0.0,0.0,0.0,0.04329744080515342,0.9990622325535315,4.712371686999127,-3.9163617679327665,0.6844392444870795,0.0,0.0,0.0,1.0
1717777429.0257115,map,True,False,3,2,0.0,0.0,3.191575527191162,-2.639521837234497,0.0,0.0,0.0,0.04329744080515342,0.9990622325535315,4.712371686999127,-3.9163617679327665,0.6844392444870795,0.0,0.0,0.0,1.0
1717777429.0785348,map,True,False,3,2,0.0,0.0,3.191575527191162,-2.639521837234497,0.0,0.0,0.0,0.04329744080515342,0.9990622325535315,4.712371686999127,-3.9163617679327665,0.6844392444870795,0.0,0.0,0.0,1.0
1717777429.1289308,map,True,False,3,1,0.0,0.0,3.191575527191162,-2.639521837234497,0.0,0.0,0.0,0.04329744080515342,0.9990622325535315,4.767802015173808,-3.558959966187385,0.6831119633235192,0.0,0.0,0.0,1.0
1717777429.528821,map,True,False,3,1,0.0,0.0,3.2661659717559814,-2.650906562805176,0.0,0.0,0.0,0.04577960822143332,0.9989515709407801,4.790302145535679,-3.253767069714995,0.6819318634467555,0.0,0.0,0.0,1.0
1717777429.6326993,map,True,False,3,1,0.0,0.0,3.2661659717559814,-2.650906562805176,0.0,0.0,0.0,0.04577960822143332,0.9989515709407801,4.790302145535679,-3.253767069714995,0.6819318634467555,0.0,0.0,0.0,1.0
1717777429.7273011,map,True,False,3,1,0.0,0.0,3.2661659717559814,-2.650906562805176,0.0,0.0,0.0,0.04577960822143332,0.9989515709407801,4.790302145535679,-3.253767069714995,0.6819318634467555,0.0,0.0,0.0,1.0
1717777429.7778237,map,True,False,3,1,0.0,0.0,3.2661659717559814,-2.650906562805176,0.0,0.0,0.0,0.04577960822143332,0.9989515709407801,4.8341040077454025,-3.0693804795407926,0.6799403359744733,0.0,0.0,0.0,1.0
1717777429.8775208,map,True,False,3,1,0.0,0.0,3.2661659717559814,-2.650906562805176,0.0,0.0,0.0,0.04577960822143332,0.9989515709407801,4.8341040077454025,-3.0693804795407926,0.6799403359744733,0.0,0.0,0.0,1.0
1717777429.9771926,map,True,False,3,1,0.0,0.0,3.3300223350524902,-2.7047390937805176,0.0,0.0,0.0,0.04296959367643977,0.9990763869288437,4.8341040077454025,-3.0693804795407926,0.6799403359744733,0.0,0.0,0.0,1.0
1717777430.0274603,map,True,False,3,1,0.0,0.0,3.3300223350524902,-2.7047390937805176,0.0,0.0,0.0,0.04296959367643977,0.9990763869288437,4.8341040077454025,-3.0693804795407926,0.6799403359744733,0.0,0.0,0.0,1.0
1717777430.0777483,map,True,False,3,1,0.0,0.0,3.3300223350524902,-2.7047390937805176,0.0,0.0,0.0,0.04296959367643977,0.9990763869288437,4.8341040077454025,-3.0693804795407926,0.6799403359744733,0.0,0.0,0.0,1.0
1717777430.130263,map,True,False,3,8,0.0,0.0,3.3300223350524902,-2.7047390937805176,0.0,0.0,0.0,0.04296959367643977,0.9990763869288437,10.486457805125271,-6.824416480013879,0.6861749397968089,0.0,0.0,0.0,1.0
