car_pos_meter , car_pos_cell, car_speed, ped_pos_meter, ped_pos_cell, ped_speed
-3.727273, 3, 1, 3.999514, 3, 1
-3.719727, 3, 1, 3.986458, 3, 1
-3.712182, 3, 1, 3.973122, 3, 1
-3.704636, 3, 1, 3.960249, 3, 1
-3.697091, 3, 2, 3.947442, 3, 1
-3.681946, 3, 1, 3.941219, 3, 1
-3.659309, 3, 2, 3.906218, 3, 1
-3.280674, 3, 2, 3.676675, 3, 1
-2.90204, 2, 2, 3.439708, 3, 1
-2.523405, 2, 1, 3.24996, 2, 1
-2.334768, 2, 2, 3.136228, 2, 1
-1.956133, 1, 2, 3.083469, 2, 1
-1.577499, 1, 2, 2.970016, 2, 1
-1.198863, 1, 2, 2.758675, 2, 1
-0.8202257, 0, 2, 2.562014, 2, 1
-0.4415888, 0, 2, 2.470464, 2, 1
-0.0629523, 0, 2, 2.450084, 2, 1
0.3156841, 0, 2, 2.384205, 2, 1
0.6943209, 0, 2, 2.327881, 2, 1
1.072958, -1, 2, 2.165259, 1, 1
1.451595, -1, 2, 1.92659, 1, 1
1.830229, -1, 2, 1.72156, 1, 1
2.208864, -2, 2, 1.599325, 1, 1
2.587499, -2, 2, 1.550882, 1, 1
2.966133, -2, 2, 1.548619, 1, 1
3.344768, -3, 2, 1.498348, 1, 1
3.723403, -3, 2, 1.200706, 1, 1
4.102037, -4, 2, 0.927402, 0, 1
4.480672, -4, 2, 0.6904993, 0, 1
4.844162, -4, 2, 0.4282451, 0, 1
5.222796, -5, 2, 0.1926825, 0, 1
5.601431, -5, 2, 0.01204395, 0, 1
5.980069, -5, 2, -0.04251432, 0, 1
6.358713, -6, 2, -0.1036386, 0, 1
6.737356, -6, 2, -0.1189346, 0, 1
7.116, -7, 2, -0.1131845, 0, 1
