timestamp_sec,frame_id,game_played,yielding,player1discrete,player2discrete,player1yieldprob,player2yieldprob,player1_pose_x,player1_pose_y,player1_pose_z,player1_pose_orient_x,player1_pose_orient_y,player1_pose_orient_z,player1_pose_orient_w,player2_pose_x,player2_pose_y,player2_pose_z,player2_pose_orient_x,player2_pose_orient_y,player2_pose_orient_z,player2_pose_orient_w
1718111630.4965022,map,True,True,6,6,0.5957621508060097,0.5957621508060098,1.1142884492874146,-1.6569509506225586,0.0,0.0,0.0,0.04210075752370467,0.9991133752874667,2.990821281548408,-7.667706379455365,0.817418013166082,0.0,0.0,0.0,1.0
1718111630.6014676,map,True,True,6,6,0.5957621508060097,0.5957621508060098,1.1142884492874146,-1.6569509506225586,0.0,0.0,0.0,0.04210075752370467,0.9991133752874667,2.990821281548408,-7.667706379455365,0.817418013166082,0.0,0.0,0.0,1.0
1718111630.6499434,map,True,False,6,6,0.5957621508060097,0.5957621508060098,1.1142884492874146,-1.6569509506225586,0.0,0.0,0.0,0.04210075752370467,0.9991133752874667,2.990821281548408,-7.667706379455365,0.817418013166082,0.0,0.0,0.0,1.0
1718111630.7473612,map,True,False,6,6,0.5957621508060097,0.5957621508060098,1.1142884492874146,-1.6569509506225586,0.0,0.0,0.0,0.04210075752370467,0.9991133752874667,2.990821281548408,-7.667706379455365,0.817418013166082,0.0,0.0,0.0,1.0
1718111630.798269,map,True,False,6,6,0.5957621508060097,0.5957621508060098,1.1142884492874146,-1.6569509506225586,0.0,0.0,0.0,0.04210075752370467,0.9991133752874667,2.990821281548408,-7.667706379455365,0.817418013166082,0.0,0.0,0.0,1.0
1718111630.8590615,map,True,True,6,6,0.5957621508060097,0.5957621508060098,1.1142884492874146,-1.6569509506225586,0.0,0.0,0.0,0.04210075752370467,0.9991133752874667,2.9793093518660885,-7.422021229214517,0.8375556894852862,0.0,0.0,0.0,1.0
1718111630.967568,map,True,True,6,6,0.5957621508060097,0.5957621508060098,1.1142884492874146,-1.6569509506225586,0.0,0.0,0.0,0.04210075752370467,0.9991133752874667,2.9465921060885827,-7.255974233743984,0.8329672319419834,0.0,0.0,0.0,1.0
1718111631.0006483,map,True,False,6,6,0.5957621508060097,0.5957621508060098,1.1142884492874146,-1.6569509506225586,0.0,0.0,0.0,0.04210075752370467,0.9991133752874667,2.9465921060885827,-7.255974233743984,0.8329672319419834,0.0,0.0,0.0,1.0
1718111631.0499494,map,True,False,6,6,0.5957621508060097,0.5957621508060098,1.1142884492874146,-1.6569509506225586,0.0,0.0,0.0,0.04210075752370467,0.9991133752874667,2.9465921060885827,-7.255974233743984,0.8329672319419834,0.0,0.0,0.0,1.0
1718111631.1040943,map,True,True,6,6,0.5957621508060097,0.5957621508060098,1.1142884492874146,-1.6569509506225586,0.0,0.0,0.0,0.04210075752370467,0.9991133752874667,2.9465921060885827,-7.255974233743984,0.8329672319419834,0.0,0.0,0.0,1.0
1718111631.153203,map,True,True,6,6,0.5957621508060097,0.5957621508060098,1.1142884492874146,-1.6569509506225586,0.0,0.0,0.0,0.04210075752370467,0.9991133752874667,2.9465921060885827,-7.255974233743984,0.8329672319419834,0.0,0.0,0.0,1.0
1718111631.2040842,map,True,True,6,6,0.5957621508060097,0.5957621508060098,1.1142884492874146,-1.6569509506225586,0.0,0.0,0.0,0.04210075752370467,0.9991133752874667,2.9465921060885827,-7.255974233743984,0.8329672319419834,0.0,0.0,0.0,1.0
1718111631.3045378,map,True,False,6,6,0.5957621508060097,0.5957621508060098,1.1142884492874146,-1.6569509506225586,0.0,0.0,0.0,0.04210075752370467,0.9991133752874667,3.0332544743358163,-7.092573420463734,0.8131536886798244,0.0,0.0,0.0,1.0
1718111631.3531065,map,True,True,6,6,0.5957621508060097,0.5957621508060098,1.1142884492874146,-1.6569509506225586,0.0,0.0,0.0,0.04210075752370467,0.9991133752874667,3.033242353769151,-7.047895154760697,0.8121530359252501,0.0,0.0,0.0,1.0
1718111631.4040186,map,True,True,6,6,0.5957621508060097,0.5957621508060098,1.1142884492874146,-1.6569509506225586,0.0,0.0,0.0,0.04210075752370467,0.9991133752874667,3.033242353769151,-7.047895154760697,0.8121530359252501,0.0,0.0,0.0,1.0
1718111631.454336,map,True,False,6,6,0.5957621508060097,0.5957621508060098,1.1142884492874146,-1.6569509506225586,0.0,0.0,0.0,0.04210075752370467,0.9991133752874667,3.033242353769151,-7.047895154760697,0.8121530359252501,0.0,0.0,0.0,1.0
1718111631.5053194,map,True,True,6,6,0.5957621508060097,0.5957621508060098,1.1142884492874146,-1.6569509506225586,0.0,0.0,0.0,0.04210075752370467,0.9991133752874667,3.033242353769151,-7.047895154760697,0.8121530359252501,0.0,0.0,0.0,1.0
1718111631.557472,map,True,True,6,6,0.5957621508060097,0.5957621508060098,1.1142884492874146,-1.6569509506225586,0.0,0.0,0.0,0.04210075752370467,0.9991133752874667,3.033242353769151,-7.047895154760697,0.8121530359252501,0.0,0.0,0.0,1.0
1718111631.6076095,map,True,False,5,6,0.0,0.0,1.2904413938522339,-1.6869500875473022,0.0,0.0,0.0,0.041751181834025326,0.9991280360200194,3.033242353769151,-7.047895154760697,0.8121530359252501,0.0,0.0,0.0,1.0
1718111631.7075756,map,True,False,5,5,0.612995793784914,0.612995793784914,1.2904413938522339,-1.6869500875473022,0.0,0.0,0.0,0.041751181834025326,0.9991280360200194,3.068588564934318,-6.510825444443358,0.8062100002821135,0.0,0.0,0.0,1.0
1718111631.758113,map,True,True,5,5,0.612995793784914,0.612995793784914,1.2904413938522339,-1.6869500875473022,0.0,0.0,0.0,0.041751181834025326,0.9991280360200194,3.068588564934318,-6.510825444443358,0.8062100002821135,0.0,0.0,0.0,1.0
1718111631.8086143,map,True,False,5,5,0.612995793784914,0.612995793784914,1.2904413938522339,-1.6869500875473022,0.0,0.0,0.0,0.041751181834025326,0.9991280360200194,3.068588564934318,-6.510825444443358,0.8062100002821135,0.0,0.0,0.0,1.0
1718111631.8659737,map,True,True,5,5,0.612995793784914,0.612995793784914,1.2904413938522339,-1.6869500875473022,0.0,0.0,0.0,0.041751181834025326,0.9991280360200194,3.068588564934318,-6.510825444443358,0.8062100002821135,0.0,0.0,0.0,1.0
1718111631.9173236,map,True,True,5,5,0.612995793784914,0.612995793784914,1.2904413938522339,-1.6869500875473022,0.0,0.0,0.0,0.041751181834025326,0.9991280360200194,3.068588564934318,-6.510825444443358,0.8062100002821135,0.0,0.0,0.0,1.0
1718111631.9677894,map,True,True,5,5,0.612995793784914,0.612995793784914,1.2904413938522339,-1.6869500875473022,0.0,0.0,0.0,0.041751181834025326,0.9991280360200194,3.093234566262141,-6.356196367497289,0.7811737557211952,0.0,0.0,0.0,1.0
1718111632.0151536,map,True,False,5,5,0.612995793784914,0.612995793784914,1.2904413938522339,-1.6869500875473022,0.0,0.0,0.0,0.041751181834025326,0.9991280360200194,3.099799223843301,-6.284805288402853,0.7867321791745002,0.0,0.0,0.0,1.0
1718111632.1152594,map,True,True,5,5,0.612995793784914,0.612995793784914,1.2904413938522339,-1.6869500875473022,0.0,0.0,0.0,0.041751181834025326,0.9991280360200194,3.099799223843301,-6.284805288402853,0.7867321791745002,0.0,0.0,0.0,1.0
1718111632.1652238,map,True,True,5,5,0.612995793784914,0.612995793784914,1.2904413938522339,-1.6869500875473022,0.0,0.0,0.0,0.041751181834025326,0.9991280360200194,3.099799223843301,-6.284805288402853,0.7867321791745002,0.0,0.0,0.0,1.0
1718111632.215578,map,True,False,5,5,0.612995793784914,0.612995793784914,1.2904413938522339,-1.6869500875473022,0.0,0.0,0.0,0.041751181834025326,0.9991280360200194,3.099799223843301,-6.284805288402853,0.7867321791745002,0.0,0.0,0.0,1.0
1718111632.3161914,map,True,False,5,5,0.612995793784914,0.612995793784914,1.2904413938522339,-1.6869500875473022,0.0,0.0,0.0,0.041751181834025326,0.9991280360200194,3.1824901376611243,-6.412478918545517,0.8041434373772021,0.0,0.0,0.0,1.0
1718111632.364617,map,True,True,5,5,0.612995793784914,0.612995793784914,1.2904413938522339,-1.6869500875473022,0.0,0.0,0.0,0.041751181834025326,0.9991280360200194,3.185851347747708,-6.292026610102796,0.7873982428338258,0.0,0.0,0.0,1.0
1718111632.4645007,map,True,True,5,5,0.612995793784914,0.612995793784914,1.2904413938522339,-1.6869500875473022,0.0,0.0,0.0,0.041751181834025326,0.9991280360200194,3.185851347747708,-6.292026610102796,0.7873982428338258,0.0,0.0,0.0,1.0
1718111632.5144565,map,True,True,5,5,0.612995793784914,0.612995793784914,1.2904413938522339,-1.6869500875473022,0.0,0.0,0.0,0.041751181834025326,0.9991280360200194,3.185851347747708,-6.292026610102796,0.7873982428338258,0.0,0.0,0.0,1.0
1718111632.5654163,map,True,True,5,5,0.612995793784914,0.612995793784914,1.446524739265442,-1.7177449464797974,0.0,0.0,0.0,0.04140742531440032,0.9991423386026593,3.185851347747708,-6.292026610102796,0.7873982428338258,0.0,0.0,0.0,1.0
1718111632.6659474,map,True,False,5,4,0.0,0.0,1.446524739265442,-1.7177449464797974,0.0,0.0,0.0,0.04140742531440032,0.9991423386026593,3.1533560222046884,-5.711669143758515,0.7864222587913811,0.0,0.0,0.0,1.0
1718111632.715221,map,True,False,5,4,0.0,0.0,1.446524739265442,-1.7177449464797974,0.0,0.0,0.0,0.04140742531440032,0.9991423386026593,3.1533560222046884,-5.711669143758515,0.7864222587913811,0.0,0.0,0.0,1.0
1718111632.8168259,map,True,False,5,4,0.0,0.0,1.446524739265442,-1.7177449464797974,0.0,0.0,0.0,0.04140742531440032,0.9991423386026593,3.1533560222046884,-5.711669143758515,0.7864222587913811,0.0,0.0,0.0,1.0
1718111632.8677914,map,True,False,5,4,0.0,0.0,1.446524739265442,-1.7177449464797974,0.0,0.0,0.0,0.04140742531440032,0.9991423386026593,3.1533560222046884,-5.711669143758515,0.7864222587913811,0.0,0.0,0.0,1.0
1718111632.9157543,map,True,False,5,4,0.0,0.0,1.446524739265442,-1.7177449464797974,0.0,0.0,0.0,0.04140742531440032,0.9991423386026593,3.1533560222046884,-5.711669143758515,0.7864222587913811,0.0,0.0,0.0,1.0
1718111632.9667838,map,True,False,5,4,0.0,0.0,1.446524739265442,-1.7177449464797974,0.0,0.0,0.0,0.04140742531440032,0.9991423386026593,3.1533560222046884,-5.711669143758515,0.7864222587913811,0.0,0.0,0.0,1.0
1718111633.0688205,map,True,False,5,4,0.0,0.0,1.446524739265442,-1.7177449464797974,0.0,0.0,0.0,0.04140742531440032,0.9991423386026593,3.248185804449263,-5.5242413184045915,0.7825912635804303,0.0,0.0,0.0,1.0
1718111633.115243,map,True,False,5,4,0.0,0.0,1.446524739265442,-1.7177449464797974,0.0,0.0,0.0,0.04140742531440032,0.9991423386026593,3.248185804449263,-5.5242413184045915,0.7825912635804303,0.0,0.0,0.0,1.0
1718111633.1657555,map,True,False,5,4,0.0,0.0,1.446524739265442,-1.7177449464797974,0.0,0.0,0.0,0.04140742531440032,0.9991423386026593,3.248185804449263,-5.5242413184045915,0.7825912635804303,0.0,0.0,0.0,1.0
1718111633.2165508,map,True,False,5,4,0.0,0.0,1.446524739265442,-1.7177449464797974,0.0,0.0,0.0,0.04140742531440032,0.9991423386026593,3.248185804449263,-5.5242413184045915,0.7825912635804303,0.0,0.0,0.0,1.0
1718111633.3654578,map,True,False,5,4,0.0,0.0,1.5418204069137573,-1.7368651628494263,0.0,0.0,0.0,0.04157743964425884,0.9991352842783112,3.3218192865668548,-5.3391127528419275,0.7670215416833769,0.0,0.0,0.0,1.0
1718111633.4157374,map,True,False,5,4,0.0,0.0,1.5418204069137573,-1.7368651628494263,0.0,0.0,0.0,0.04157743964425884,0.9991352842783112,3.3124519015749447,-5.279634942837015,0.7600668268090586,0.0,0.0,0.0,1.0
1718111633.466195,map,True,False,5,4,0.0,0.0,1.5418204069137573,-1.7368651628494263,0.0,0.0,0.0,0.04157743964425884,0.9991352842783112,3.3124519015749447,-5.279634942837015,0.7600668268090586,0.0,0.0,0.0,1.0
1718111633.5159001,map,True,False,5,4,0.0,0.0,1.5418204069137573,-1.7368651628494263,0.0,0.0,0.0,0.04157743964425884,0.9991352842783112,3.3124519015749447,-5.279634942837015,0.7600668268090586,0.0,0.0,0.0,1.0
1718111633.5678985,map,True,False,5,4,0.0,0.0,1.5418204069137573,-1.7368651628494263,0.0,0.0,0.0,0.04157743964425884,0.9991352842783112,3.3124519015749447,-5.279634942837015,0.7600668268090586,0.0,0.0,0.0,1.0
1718111633.6189036,map,True,False,5,4,0.0,0.0,1.5418204069137573,-1.7368651628494263,0.0,0.0,0.0,0.04157743964425884,0.9991352842783112,3.3124519015749447,-5.279634942837015,0.7600668268090586,0.0,0.0,0.0,1.0
1718111633.6691563,map,True,False,5,4,0.0,0.0,1.5418204069137573,-1.7368651628494263,0.0,0.0,0.0,0.04157743964425884,0.9991352842783112,3.3124519015749447,-5.279634942837015,0.7600668268090586,0.0,0.0,0.0,1.0
1718111633.723527,map,True,False,5,3,0.0,0.0,1.5418204069137573,-1.7368651628494263,0.0,0.0,0.0,0.04157743964425884,0.9991352842783112,3.3099605148207516,-4.9461488665050615,0.7685471575686112,0.0,0.0,0.0,1.0
1718111633.8215182,map,True,False,5,3,0.0,0.0,1.5418204069137573,-1.7368651628494263,0.0,0.0,0.0,0.04157743964425884,0.9991352842783112,3.3099605148207516,-4.9461488665050615,0.7685471575686112,0.0,0.0,0.0,1.0
1718111633.8700857,map,True,False,5,3,0.0,0.0,1.5418204069137573,-1.7368651628494263,0.0,0.0,0.0,0.04157743964425884,0.9991352842783112,3.3099605148207516,-4.9461488665050615,0.7685471575686112,0.0,0.0,0.0,1.0
1718111633.919332,map,True,False,5,3,0.0,0.0,1.5418204069137573,-1.7368651628494263,0.0,0.0,0.0,0.04157743964425884,0.9991352842783112,3.3099605148207516,-4.9461488665050615,0.7685471575686112,0.0,0.0,0.0,1.0
1718111633.9703019,map,True,False,5,3,0.0,0.0,1.5418204069137573,-1.7368651628494263,0.0,0.0,0.0,0.04157743964425884,0.9991352842783112,3.3099605148207516,-4.9461488665050615,0.7685471575686112,0.0,0.0,0.0,1.0
1718111634.0695808,map,True,False,5,3,0.0,0.0,1.5418204069137573,-1.7368651628494263,0.0,0.0,0.0,0.04157743964425884,0.9991352842783112,3.4038139581306215,-4.5558795461622115,0.7638303714095981,0.0,0.0,0.0,1.0
1718111634.1192355,map,True,False,4,3,0.0,0.0,1.621936559677124,-1.752692699432373,0.0,0.0,0.0,0.042111709255117126,0.9991129129414353,3.4038139581306215,-4.5558795461622115,0.7638303714095981,0.0,0.0,0.0,1.0
1718111634.1728747,map,True,False,4,3,0.0,0.0,1.621936559677124,-1.752692699432373,0.0,0.0,0.0,0.042111709255117126,0.9991129129414353,3.4038139581306215,-4.5558795461622115,0.7638303714095981,0.0,0.0,0.0,1.0
1718111634.220308,map,True,False,4,3,0.0,0.0,1.621936559677124,-1.752692699432373,0.0,0.0,0.0,0.042111709255117126,0.9991129129414353,3.4038139581306215,-4.5558795461622115,0.7638303714095981,0.0,0.0,0.0,1.0
1718111634.3695788,map,True,False,4,3,0.0,0.0,1.621936559677124,-1.752692699432373,0.0,0.0,0.0,0.042111709255117126,0.9991129129414353,3.4926538347572174,-4.365884025077606,0.76297483585864,0.0,0.0,0.0,1.0
1718111634.4191186,map,True,False,4,3,0.0,0.0,1.621936559677124,-1.752692699432373,0.0,0.0,0.0,0.042111709255117126,0.9991129129414353,3.529712533054692,-4.2604456234057855,0.7607248745841743,0.0,0.0,0.0,1.0
1718111634.519548,map,True,False,4,3,0.0,0.0,1.621936559677124,-1.752692699432373,0.0,0.0,0.0,0.042111709255117126,0.9991129129414353,3.529712533054692,-4.2604456234057855,0.7607248745841743,0.0,0.0,0.0,1.0
1718111634.5724149,map,True,False,4,3,0.0,0.0,1.621936559677124,-1.752692699432373,0.0,0.0,0.0,0.042111709255117126,0.9991129129414353,3.529712533054692,-4.2604456234057855,0.7607248745841743,0.0,0.0,0.0,1.0
1718111634.62076,map,True,False,4,3,0.0,0.0,1.621936559677124,-1.752692699432373,0.0,0.0,0.0,0.042111709255117126,0.9991129129414353,3.529712533054692,-4.2604456234057855,0.7607248745841743,0.0,0.0,0.0,1.0
1718111634.6710215,map,True,False,4,3,0.0,0.0,1.621936559677124,-1.752692699432373,0.0,0.0,0.0,0.042111709255117126,0.9991129129414353,3.529712533054692,-4.2604456234057855,0.7607248745841743,0.0,0.0,0.0,1.0
1718111634.721128,map,True,False,4,2,0.0,0.0,1.621936559677124,-1.752692699432373,0.0,0.0,0.0,0.042111709255117126,0.9991129129414353,3.5294302743496235,-3.8970523932939374,0.6984198190397412,0.0,0.0,0.0,1.0
1718111634.776966,map,True,False,4,2,0.0,0.0,1.621936559677124,-1.752692699432373,0.0,0.0,0.0,0.042111709255117126,0.9991129129414353,3.5294302743496235,-3.8970523932939374,0.6984198190397412,0.0,0.0,0.0,1.0
1718111634.8737376,map,True,False,4,2,0.0,0.0,1.7621502876281738,-1.7880191802978516,0.0,0.0,0.0,0.04289155325954827,0.9990797278691064,3.5294302743496235,-3.8970523932939374,0.6984198190397412,0.0,0.0,0.0,1.0
1718111634.9222884,map,True,False,4,2,0.0,0.0,1.7621502876281738,-1.7880191802978516,0.0,0.0,0.0,0.04289155325954827,0.9990797278691064,3.5294302743496235,-3.8970523932939374,0.6984198190397412,0.0,0.0,0.0,1.0
1718111634.9729543,map,True,False,4,2,0.0,0.0,1.7621502876281738,-1.7880191802978516,0.0,0.0,0.0,0.04289155325954827,0.9990797278691064,3.5294302743496235,-3.8970523932939374,0.6984198190397412,0.0,0.0,0.0,1.0
1718111635.0249562,map,True,False,4,2,0.0,0.0,1.7621502876281738,-1.7880191802978516,0.0,0.0,0.0,0.04289155325954827,0.9990797278691064,3.5142438022891627,-3.7153911364362386,0.6866388863615484,0.0,0.0,0.0,1.0
1718111635.0772517,map,True,False,4,2,0.0,0.0,1.7621502876281738,-1.7880191802978516,0.0,0.0,0.0,0.04289155325954827,0.9990797278691064,3.6502168737197573,-3.618903592760916,0.6860377905027549,0.0,0.0,0.0,1.0
1718111635.1280847,map,True,False,4,2,0.0,0.0,1.7621502876281738,-1.7880191802978516,0.0,0.0,0.0,0.04289155325954827,0.9990797278691064,3.6502168737197573,-3.618903592760916,0.6860377905027549,0.0,0.0,0.0,1.0
1718111635.1798782,map,True,False,4,2,0.0,0.0,1.7621502876281738,-1.7880191802978516,0.0,0.0,0.0,0.04289155325954827,0.9990797278691064,3.6502168737197573,-3.618903592760916,0.6860377905027549,0.0,0.0,0.0,1.0
1718111635.4259772,map,True,False,4,5,0.0,0.0,1.7621502876281738,-1.7880191802978516,0.0,0.0,0.0,0.04289155325954827,0.9990797278691064,4.449707286622285,-5.765082069481766,0.6861257610186755,0.0,0.0,0.0,1.0
1718111635.4772305,map,True,False,4,5,0.0,0.0,1.7621502876281738,-1.7880191802978516,0.0,0.0,0.0,0.04289155325954827,0.9990797278691064,4.449707286622285,-5.765082069481766,0.6861257610186755,0.0,0.0,0.0,1.0
1718111635.576766,map,True,False,4,2,0.0,0.0,1.7621502876281738,-1.7880191802978516,0.0,0.0,0.0,0.04289155325954827,0.9990797278691064,3.6413751360222695,-3.001006791065273,0.6811791059775303,0.0,0.0,0.0,1.0
1718111635.627348,map,True,False,4,2,0.0,0.0,1.7621502876281738,-1.7880191802978516,0.0,0.0,0.0,0.04289155325954827,0.9990797278691064,3.6413751360222695,-3.001006791065273,0.6811791059775303,0.0,0.0,0.0,1.0
1718111635.728314,map,True,False,4,2,0.0,0.0,1.7621502876281738,-1.7880191802978516,0.0,0.0,0.0,0.04289155325954827,0.9990797278691064,3.6413751360222695,-3.001006791065273,0.6811791059775303,0.0,0.0,0.0,1.0
1718111635.7813096,map,True,False,4,2,0.0,0.0,1.8773212432861328,-1.8109745979309082,0.0,0.0,0.0,0.042915162346127106,0.9990787136562791,3.869687191796477,-2.8890601581309445,0.6805395693347914,0.0,0.0,0.0,1.0
1718111635.8288276,map,True,False,4,2,0.0,0.0,1.8773212432861328,-1.8109745979309082,0.0,0.0,0.0,0.042915162346127106,0.9990787136562791,3.869687191796477,-2.8890601581309445,0.6805395693347914,0.0,0.0,0.0,1.0
1718111635.9314857,map,True,False,4,2,0.0,0.0,1.8773212432861328,-1.8109745979309082,0.0,0.0,0.0,0.042915162346127106,0.9990787136562791,3.869687191796477,-2.8890601581309445,0.6805395693347914,0.0,0.0,0.0,1.0
1718111636.034131,map,True,False,4,2,0.0,0.0,1.8773212432861328,-1.8109745979309082,0.0,0.0,0.0,0.042915162346127106,0.9990787136562791,3.869687191796477,-2.8890601581309445,0.6805395693347914,0.0,0.0,0.0,1.0
1718111636.137922,map,True,False,4,1,0.0,0.0,1.8773212432861328,-1.8109745979309082,0.0,0.0,0.0,0.042915162346127106,0.9990787136562791,3.903202234603422,-2.593662779290082,0.6817920709050067,0.0,0.0,0.0,1.0
1718111636.2285142,map,True,False,4,1,0.0,0.0,1.8773212432861328,-1.8109745979309082,0.0,0.0,0.0,0.042915162346127106,0.9990787136562791,3.919645431022623,-2.513334794773025,0.6814715058239041,0.0,0.0,0.0,1.0
