timestamp_sec,frame_id,game_played,yielding,player1discrete,player2discrete,player1yieldprob,player2yieldprob,player1_pose_x,player1_pose_y,player1_pose_z,player1_pose_orient_x,player1_pose_orient_y,player1_pose_orient_z,player1_pose_orient_w,player2_pose_x,player2_pose_y,player2_pose_z,player2_pose_orient_x,player2_pose_orient_y,player2_pose_orient_z,player2_pose_orient_w
1717757288.1565683,map,True,True,6,6,0.5957621508060097,0.5957621508060098,1.9815173149108887,-2.2410097122192383,0.0,0.0,0.0,0.03963119482997533,0.9992143703958244,3.883204954614511,-8.32892205229166,0.7666159958832401,0.0,0.0,0.0,1.0
1717757288.2557669,map,True,False,6,6,0.5957621508060097,0.5957621508060098,1.9815173149108887,-2.2410097122192383,0.0,0.0,0.0,0.03963119482997533,0.9992143703958244,3.883204954614511,-8.32892205229166,0.7666159958832401,0.0,0.0,0.0,1.0
1717757288.3064957,map,True,False,6,6,0.5957621508060097,0.5957621508060098,1.9815173149108887,-2.2410097122192383,0.0,0.0,0.0,0.03963119482997533,0.9992143703958244,3.883204954614511,-8.32892205229166,0.7666159958832401,0.0,0.0,0.0,1.0
1717757288.4073203,map,True,True,6,6,0.5957621508060097,0.5957621508060098,1.9815173149108887,-2.2410097122192383,0.0,0.0,0.0,0.03963119482997533,0.9992143703958244,3.883204954614511,-8.32892205229166,0.7666159958832401,0.0,0.0,0.0,1.0
1717757288.457723,map,True,False,6,6,0.5957621508060097,0.5957621508060098,1.980544090270996,-2.2422280311584473,0.0,0.0,0.0,0.039749850194052146,0.9992096579155193,3.865516194175312,-8.22718810245486,0.7651949095132468,0.0,0.0,0.0,1.0
1717757288.5080473,map,True,False,6,6,0.5957621508060097,0.5957621508060098,1.980544090270996,-2.2422280311584473,0.0,0.0,0.0,0.039749850194052146,0.9992096579155193,3.865516194175312,-8.22718810245486,0.7651949095132468,0.0,0.0,0.0,1.0
1717757288.5585747,map,True,True,6,6,0.5957621508060097,0.5957621508060098,1.980544090270996,-2.2422280311584473,0.0,0.0,0.0,0.039749850194052146,0.9992096579155193,3.865516194175312,-8.22718810245486,0.7651949095132468,0.0,0.0,0.0,1.0
1717757288.6088223,map,True,True,6,6,0.5957621508060097,0.5957621508060098,1.980544090270996,-2.2422280311584473,0.0,0.0,0.0,0.039749850194052146,0.9992096579155193,3.865516194175312,-8.22718810245486,0.7651949095132468,0.0,0.0,0.0,1.0
1717757288.7098954,map,True,True,6,6,0.5957621508060097,0.5957621508060098,1.980544090270996,-2.2422280311584473,0.0,0.0,0.0,0.039749850194052146,0.9992096579155193,3.865516194175312,-8.22718810245486,0.7651949095132468,0.0,0.0,0.0,1.0
1717757289.111102,map,True,True,6,6,0.5957621508060097,0.5957621508060098,1.9804534912109375,-2.239201545715332,0.0,0.0,0.0,0.0396165795204438,0.9992149519978656,3.895137585868835,-8.347168733320553,0.7669087882296554,0.0,0.0,0.0,1.0
1717757289.1615226,map,True,False,6,6,0.5957621508060097,0.5957621508060098,1.9804534912109375,-2.239201545715332,0.0,0.0,0.0,0.0396165795204438,0.9992149519978656,3.895137585868835,-8.347168733320553,0.7669087882296554,0.0,0.0,0.0,1.0
1717757289.2129195,map,True,False,6,6,0.5957621508060097,0.5957621508060098,1.9804534912109375,-2.239201545715332,0.0,0.0,0.0,0.0396165795204438,0.9992149519978656,3.895137585868835,-8.347168733320553,0.7669087882296554,0.0,0.0,0.0,1.0
1717757289.2623231,map,True,True,6,6,0.5957621508060097,0.5957621508060098,1.9804534912109375,-2.239201545715332,0.0,0.0,0.0,0.0396165795204438,0.9992149519978656,3.895137585868835,-8.347168733320553,0.7669087882296554,0.0,0.0,0.0,1.0
1717757289.361684,map,True,False,6,6,0.5957621508060097,0.5957621508060098,1.9804534912109375,-2.239201545715332,0.0,0.0,0.0,0.0396165795204438,0.9992149519978656,3.895137585868835,-8.347168733320553,0.7669087882296554,0.0,0.0,0.0,1.0
1717757289.4622161,map,True,True,6,6,0.5957621508060097,0.5957621508060098,1.9804534912109375,-2.239201545715332,0.0,0.0,0.0,0.0396165795204438,0.9992149519978656,3.9058510578827996,-8.457453371778785,0.7684246512632292,0.0,0.0,0.0,1.0
1717757289.561666,map,True,True,6,6,0.5957621508060097,0.5957621508060098,1.9804534912109375,-2.239201545715332,0.0,0.0,0.0,0.0396165795204438,0.9992149519978656,3.9058510578827996,-8.457453371778785,0.7684246512632292,0.0,0.0,0.0,1.0
1717757289.6117973,map,True,False,6,6,0.5957621508060097,0.5957621508060098,1.981675148010254,-2.2435946464538574,0.0,0.0,0.0,0.039761354694726615,0.9992092105269934,3.9058510578827996,-8.457453371778785,0.7684246512632292,0.0,0.0,0.0,1.0
1717757289.6620011,map,True,True,6,6,0.5957621508060097,0.5957621508060098,1.981675148010254,-2.2435946464538574,0.0,0.0,0.0,0.039761354694726615,0.9992092105269934,3.9058510578827996,-8.457453371778785,0.7684246512632292,0.0,0.0,0.0,1.0
1717757289.7629867,map,True,True,6,6,0.5957621508060097,0.5957621508060098,1.981675148010254,-2.2435946464538574,0.0,0.0,0.0,0.039761354694726615,0.9992092105269934,3.9058510578827996,-8.457453371778785,0.7684246512632292,0.0,0.0,0.0,1.0
1717757289.8161085,map,True,True,6,6,0.5957621508060097,0.5957621508060098,1.981675148010254,-2.2435946464538574,0.0,0.0,0.0,0.039761354694726615,0.9992092105269934,3.8928391875110577,-8.34334367548225,0.7669087882296568,0.0,0.0,0.0,1.0
1717757289.8640337,map,True,True,6,6,0.5957621508060097,0.5957621508060098,1.981675148010254,-2.2435946464538574,0.0,0.0,0.0,0.039761354694726615,0.9992092105269934,3.8928391875110577,-8.34334367548225,0.7669087882296568,0.0,0.0,0.0,1.0
1717757289.91435,map,True,True,6,6,0.5957621508060097,0.5957621508060098,1.981675148010254,-2.2435946464538574,0.0,0.0,0.0,0.039761354694726615,0.9992092105269934,3.8928391875110577,-8.34334367548225,0.7669087882296568,0.0,0.0,0.0,1.0
1717757289.9651847,map,True,False,6,6,0.5957621508060097,0.5957621508060098,1.981675148010254,-2.2435946464538574,0.0,0.0,0.0,0.039761354694726615,0.9992092105269934,3.8928391875110577,-8.34334367548225,0.7669087882296568,0.0,0.0,0.0,1.0
1717757290.0642679,map,True,True,6,6,0.5957621508060097,0.5957621508060098,1.981675148010254,-2.2435946464538574,0.0,0.0,0.0,0.039761354694726615,0.9992092105269934,3.8928391875110577,-8.34334367548225,0.7669087882296568,0.0,0.0,0.0,1.0
1717757290.1643963,map,True,True,6,6,0.5957621508060097,0.5957621508060098,1.981675148010254,-2.2435946464538574,0.0,0.0,0.0,0.039761354694726615,0.9992092105269934,3.8928391875110577,-8.34334367548225,0.7669087882296568,0.0,0.0,0.0,1.0
1717757290.2146096,map,True,False,6,6,0.5957621508060097,0.5957621508060098,1.9811859130859375,-2.2372143268585205,0.0,0.0,0.0,0.03948613408112401,0.9992201118370481,3.888128073670753,-8.352387063711342,0.7669427697544138,0.0,0.0,0.0,1.0
1717757290.3135602,map,True,True,6,6,0.5957621508060097,0.5957621508060098,1.9811859130859375,-2.2372143268585205,0.0,0.0,0.0,0.03948613408112401,0.9992201118370481,3.888128073670753,-8.352387063711342,0.7669427697544138,0.0,0.0,0.0,1.0
1717757290.3637404,map,True,False,6,6,0.5957621508060097,0.5957621508060098,1.9811859130859375,-2.2372143268585205,0.0,0.0,0.0,0.03948613408112401,0.9992201118370481,3.888128073670753,-8.352387063711342,0.7669427697544138,0.0,0.0,0.0,1.0
1717757290.4204142,map,True,True,6,6,0.5957621508060097,0.5957621508060098,1.9811859130859375,-2.2372143268585205,0.0,0.0,0.0,0.03948613408112401,0.9992201118370481,3.888128073670753,-8.352387063711342,0.7669427697544138,0.0,0.0,0.0,1.0
1717757290.4787602,map,True,True,6,6,0.5957621508060097,0.5957621508060098,1.9811859130859375,-2.2372143268585205,0.0,0.0,0.0,0.03948613408112401,0.9992201118370481,3.888128073670753,-8.352387063711342,0.7669427697544138,0.0,0.0,0.0,1.0
1717757290.4921286,map,True,True,6,6,0.5957621508060097,0.5957621508060098,1.9811859130859375,-2.2372143268585205,0.0,0.0,0.0,0.03948613408112401,0.9992201118370481,3.888128073670753,-8.352387063711342,0.7669427697544138,0.0,0.0,0.0,1.0
1717757290.5245862,map,True,True,6,6,0.5957621508060097,0.5957621508060098,1.9811859130859375,-2.2372143268585205,0.0,0.0,0.0,0.03948613408112401,0.9992201118370481,3.856729918641962,-8.231930868260978,0.7742581703927478,0.0,0.0,0.0,1.0
1717757290.5323818,map,True,True,6,6,0.5957621508060097,0.5957621508060098,1.9811859130859375,-2.2372143268585205,0.0,0.0,0.0,0.03948613408112401,0.9992201118370481,3.856729918641962,-8.231930868260978,0.7742581703927478,0.0,0.0,0.0,1.0
1717757290.539939,map,True,False,6,6,0.5957621508060097,0.5957621508060098,1.9811859130859375,-2.2372143268585205,0.0,0.0,0.0,0.03948613408112401,0.9992201118370481,3.856729918641962,-8.231930868260978,0.7742581703927478,0.0,0.0,0.0,1.0
1717757290.5470824,map,True,True,6,6,0.5957621508060097,0.5957621508060098,1.9811859130859375,-2.2372143268585205,0.0,0.0,0.0,0.03948613408112401,0.9992201118370481,3.856729918641962,-8.231930868260978,0.7742581703927478,0.0,0.0,0.0,1.0
1717757290.5562882,map,True,True,6,6,0.5957621508060097,0.5957621508060098,1.9811859130859375,-2.2372143268585205,0.0,0.0,0.0,0.03948613408112401,0.9992201118370481,3.856729918641962,-8.231930868260978,0.7742581703927478,0.0,0.0,0.0,1.0
1717757290.5718212,map,True,False,6,6,0.5957621508060097,0.5957621508060098,1.9811859130859375,-2.2372143268585205,0.0,0.0,0.0,0.03948613408112401,0.9992201118370481,3.856729918641962,-8.231930868260978,0.7742581703927478,0.0,0.0,0.0,1.0
1717757290.5793138,map,True,False,6,6,0.5957621508060097,0.5957621508060098,1.9811859130859375,-2.2372143268585205,0.0,0.0,0.0,0.03948613408112401,0.9992201118370481,3.856729918641962,-8.231930868260978,0.7742581703927478,0.0,0.0,0.0,1.0
1717757290.5884938,map,True,True,6,6,0.5957621508060097,0.5957621508060098,1.9811859130859375,-2.2372143268585205,0.0,0.0,0.0,0.03948613408112401,0.9992201118370481,3.856729918641962,-8.231930868260978,0.7742581703927478,0.0,0.0,0.0,1.0
1717757290.5962274,map,True,True,6,6,0.5957621508060097,0.5957621508060098,1.9811859130859375,-2.2372143268585205,0.0,0.0,0.0,0.03948613408112401,0.9992201118370481,3.856729918641962,-8.231930868260978,0.7742581703927478,0.0,0.0,0.0,1.0
1717757290.5997314,map,True,True,6,6,0.5957621508060097,0.5957621508060098,1.9811859130859375,-2.2372143268585205,0.0,0.0,0.0,0.03948613408112401,0.9992201118370481,3.856729918641962,-8.231930868260978,0.7742581703927478,0.0,0.0,0.0,1.0
1717757290.6069174,map,True,True,6,6,0.5957621508060097,0.5957621508060098,1.9811859130859375,-2.2372143268585205,0.0,0.0,0.0,0.03948613408112401,0.9992201118370481,3.856729918641962,-8.231930868260978,0.7742581703927478,0.0,0.0,0.0,1.0
1717757290.6097646,map,True,False,6,6,0.5957621508060097,0.5957621508060098,1.9811859130859375,-2.2372143268585205,0.0,0.0,0.0,0.03948613408112401,0.9992201118370481,3.856729918641962,-8.231930868260978,0.7742581703927478,0.0,0.0,0.0,1.0
1717757290.6116576,map,True,True,6,6,0.5957621508060097,0.5957621508060098,1.9811859130859375,-2.2372143268585205,0.0,0.0,0.0,0.03948613408112401,0.9992201118370481,3.856729918641962,-8.231930868260978,0.7742581703927478,0.0,0.0,0.0,1.0
1717757290.615048,map,True,False,6,6,0.5957621508060097,0.5957621508060098,1.9811859130859375,-2.2372143268585205,0.0,0.0,0.0,0.03948613408112401,0.9992201118370481,3.856729918641962,-8.231930868260978,0.7742581703927478,0.0,0.0,0.0,1.0
1717757290.6194355,map,True,True,6,6,0.5957621508060097,0.5957621508060098,1.9811859130859375,-2.2372143268585205,0.0,0.0,0.0,0.03948613408112401,0.9992201118370481,3.856729918641962,-8.231930868260978,0.7742581703927478,0.0,0.0,0.0,1.0
1717757290.628736,map,True,True,6,6,0.5957621508060097,0.5957621508060098,1.9811859130859375,-2.2372143268585205,0.0,0.0,0.0,0.03948613408112401,0.9992201118370481,3.856729918641962,-8.231930868260978,0.7742581703927478,0.0,0.0,0.0,1.0
1717757290.6355555,map,True,False,6,6,0.5957621508060097,0.5957621508060098,1.9811859130859375,-2.2372143268585205,0.0,0.0,0.0,0.03948613408112401,0.9992201118370481,3.856729918641962,-8.231930868260978,0.7742581703927478,0.0,0.0,0.0,1.0
1717757290.6399565,map,True,True,6,6,0.5957621508060097,0.5957621508060098,1.9811859130859375,-2.2372143268585205,0.0,0.0,0.0,0.03948613408112401,0.9992201118370481,3.856729918641962,-8.231930868260978,0.7742581703927478,0.0,0.0,0.0,1.0
1717757290.643607,map,True,False,6,6,0.5957621508060097,0.5957621508060098,1.9811859130859375,-2.2372143268585205,0.0,0.0,0.0,0.03948613408112401,0.9992201118370481,3.856729918641962,-8.231930868260978,0.7742581703927478,0.0,0.0,0.0,1.0
1717757290.679867,map,True,True,6,6,0.5957621508060097,0.5957621508060098,1.9811859130859375,-2.2372143268585205,0.0,0.0,0.0,0.03948613408112401,0.9992201118370481,3.856729918641962,-8.231930868260978,0.7742581703927478,0.0,0.0,0.0,1.0
1717757290.6837008,map,True,False,6,6,0.5957621508060097,0.5957621508060098,1.9811859130859375,-2.2372143268585205,0.0,0.0,0.0,0.03948613408112401,0.9992201118370481,3.856729918641962,-8.231930868260978,0.7742581703927478,0.0,0.0,0.0,1.0
1717757290.686921,map,True,False,6,6,0.5957621508060097,0.5957621508060098,1.9811859130859375,-2.2372143268585205,0.0,0.0,0.0,0.03948613408112401,0.9992201118370481,3.856729918641962,-8.231930868260978,0.7742581703927478,0.0,0.0,0.0,1.0
1717757290.6915064,map,True,False,6,6,0.5957621508060097,0.5957621508060098,1.9811859130859375,-2.2372143268585205,0.0,0.0,0.0,0.03948613408112401,0.9992201118370481,3.856729918641962,-8.231930868260978,0.7742581703927478,0.0,0.0,0.0,1.0
1717757290.6960704,map,True,True,6,6,0.5957621508060097,0.5957621508060098,1.9811859130859375,-2.2372143268585205,0.0,0.0,0.0,0.03948613408112401,0.9992201118370481,3.856729918641962,-8.231930868260978,0.7742581703927478,0.0,0.0,0.0,1.0
1717757290.698881,map,True,True,6,6,0.5957621508060097,0.5957621508060098,1.9811859130859375,-2.2372143268585205,0.0,0.0,0.0,0.03948613408112401,0.9992201118370481,3.856729918641962,-8.231930868260978,0.7742581703927478,0.0,0.0,0.0,1.0
1717757290.705248,map,True,False,6,6,0.5957621508060097,0.5957621508060098,1.9811859130859375,-2.2372143268585205,0.0,0.0,0.0,0.03948613408112401,0.9992201118370481,3.856729918641962,-8.231930868260978,0.7742581703927478,0.0,0.0,0.0,1.0
1717757290.707641,map,True,True,6,6,0.5957621508060097,0.5957621508060098,1.9811859130859375,-2.2372143268585205,0.0,0.0,0.0,0.03948613408112401,0.9992201118370481,3.856729918641962,-8.231930868260978,0.7742581703927478,0.0,0.0,0.0,1.0
1717757290.7122865,map,True,True,6,6,0.5957621508060097,0.5957621508060098,1.9811859130859375,-2.2372143268585205,0.0,0.0,0.0,0.03948613408112401,0.9992201118370481,3.856729918641962,-8.231930868260978,0.7742581703927478,0.0,0.0,0.0,1.0
1717757290.7153707,map,True,False,6,6,0.5957621508060097,0.5957621508060098,1.9811859130859375,-2.2372143268585205,0.0,0.0,0.0,0.03948613408112401,0.9992201118370481,3.856729918641962,-8.231930868260978,0.7742581703927478,0.0,0.0,0.0,1.0
1717757290.7196715,map,True,True,6,6,0.5957621508060097,0.5957621508060098,1.9811859130859375,-2.2372143268585205,0.0,0.0,0.0,0.03948613408112401,0.9992201118370481,3.856729918641962,-8.231930868260978,0.7742581703927478,0.0,0.0,0.0,1.0
1717757290.7275927,map,True,True,6,6,0.5957621508060097,0.5957621508060098,1.9811859130859375,-2.2372143268585205,0.0,0.0,0.0,0.03948613408112401,0.9992201118370481,3.856729918641962,-8.231930868260978,0.7742581703927478,0.0,0.0,0.0,1.0
1717757290.7312572,map,True,False,6,6,0.5957621508060097,0.5957621508060098,1.9811859130859375,-2.2372143268585205,0.0,0.0,0.0,0.03948613408112401,0.9992201118370481,3.856729918641962,-8.231930868260978,0.7742581703927478,0.0,0.0,0.0,1.0
1717757290.7365565,map,True,False,6,6,0.5957621508060097,0.5957621508060098,1.9811859130859375,-2.2372143268585205,0.0,0.0,0.0,0.03948613408112401,0.9992201118370481,3.856729918641962,-8.231930868260978,0.7742581703927478,0.0,0.0,0.0,1.0
1717757290.7397645,map,True,True,6,6,0.5957621508060097,0.5957621508060098,1.9811859130859375,-2.2372143268585205,0.0,0.0,0.0,0.03948613408112401,0.9992201118370481,3.856729918641962,-8.231930868260978,0.7742581703927478,0.0,0.0,0.0,1.0
1717757290.7437735,map,True,True,6,6,0.5957621508060097,0.5957621508060098,1.9811859130859375,-2.2372143268585205,0.0,0.0,0.0,0.03948613408112401,0.9992201118370481,3.856729918641962,-8.231930868260978,0.7742581703927478,0.0,0.0,0.0,1.0
1717757290.7511382,map,True,True,6,6,0.5957621508060097,0.5957621508060098,1.9811859130859375,-2.2372143268585205,0.0,0.0,0.0,0.03948613408112401,0.9992201118370481,3.856729918641962,-8.231930868260978,0.7742581703927478,0.0,0.0,0.0,1.0
1717757290.7561243,map,True,True,6,6,0.5957621508060097,0.5957621508060098,1.9811859130859375,-2.2372143268585205,0.0,0.0,0.0,0.03948613408112401,0.9992201118370481,3.856729918641962,-8.231930868260978,0.7742581703927478,0.0,0.0,0.0,1.0
1717757290.7589602,map,True,True,6,6,0.5957621508060097,0.5957621508060098,1.9811859130859375,-2.2372143268585205,0.0,0.0,0.0,0.03948613408112401,0.9992201118370481,3.856729918641962,-8.231930868260978,0.7742581703927478,0.0,0.0,0.0,1.0
1717757290.76432,map,True,True,6,6,0.5957621508060097,0.5957621508060098,1.9811859130859375,-2.2372143268585205,0.0,0.0,0.0,0.03948613408112401,0.9992201118370481,3.856729918641962,-8.231930868260978,0.7742581703927478,0.0,0.0,0.0,1.0
1717757290.7676666,map,True,True,6,6,0.5957621508060097,0.5957621508060098,1.9811859130859375,-2.2372143268585205,0.0,0.0,0.0,0.03948613408112401,0.9992201118370481,3.856729918641962,-8.231930868260978,0.7742581703927478,0.0,0.0,0.0,1.0
1717757290.771988,map,True,True,6,6,0.5957621508060097,0.5957621508060098,1.9811859130859375,-2.2372143268585205,0.0,0.0,0.0,0.03948613408112401,0.9992201118370481,3.856729918641962,-8.231930868260978,0.7742581703927478,0.0,0.0,0.0,1.0
1717757290.7786553,map,True,True,6,6,0.5957621508060097,0.5957621508060098,1.9811859130859375,-2.2372143268585205,0.0,0.0,0.0,0.03948613408112401,0.9992201118370481,3.856729918641962,-8.231930868260978,0.7742581703927478,0.0,0.0,0.0,1.0
1717757290.843091,map,True,True,6,6,0.5957621508060097,0.5957621508060098,1.9811859130859375,-2.2372143268585205,0.0,0.0,0.0,0.03948613408112401,0.9992201118370481,3.8751899334178423,-8.278986023046357,0.7750068750679708,0.0,0.0,0.0,1.0
1717757290.8458877,map,True,True,6,6,0.5957621508060097,0.5957621508060098,1.9811859130859375,-2.2372143268585205,0.0,0.0,0.0,0.03948613408112401,0.9992201118370481,3.8751899334178423,-8.278986023046357,0.7750068750679708,0.0,0.0,0.0,1.0
1717757290.848665,map,True,True,6,6,0.5957621508060097,0.5957621508060098,1.9811859130859375,-2.2372143268585205,0.0,0.0,0.0,0.03948613408112401,0.9992201118370481,3.852207099856284,-8.10396861899246,0.7723423439245924,0.0,0.0,0.0,1.0
1717757290.8507676,map,True,True,6,6,0.5957621508060097,0.5957621508060098,1.9811859130859375,-2.2372143268585205,0.0,0.0,0.0,0.03948613408112401,0.9992201118370481,3.852207099856284,-8.10396861899246,0.7723423439245924,0.0,0.0,0.0,1.0
1717757290.8681912,map,True,False,6,6,0.5957621508060097,0.5957621508060098,1.9811859130859375,-2.2372143268585205,0.0,0.0,0.0,0.03948613408112401,0.9992201118370481,3.852207099856284,-8.10396861899246,0.7723423439245924,0.0,0.0,0.0,1.0
1717757290.880217,map,True,True,6,6,0.5957621508060097,0.5957621508060098,1.9811859130859375,-2.2372143268585205,0.0,0.0,0.0,0.03948613408112401,0.9992201118370481,3.852207099856284,-8.10396861899246,0.7723423439245924,0.0,0.0,0.0,1.0
1717757290.882831,map,True,True,6,6,0.5957621508060097,0.5957621508060098,1.9811859130859375,-2.2372143268585205,0.0,0.0,0.0,0.03948613408112401,0.9992201118370481,3.852207099856284,-8.10396861899246,0.7723423439245924,0.0,0.0,0.0,1.0
1717757290.8875291,map,True,True,6,6,0.5957621508060097,0.5957621508060098,1.9811859130859375,-2.2372143268585205,0.0,0.0,0.0,0.03948613408112401,0.9992201118370481,3.852207099856284,-8.10396861899246,0.7723423439245924,0.0,0.0,0.0,1.0
1717757290.8913176,map,True,False,6,6,0.5957621508060097,0.5957621508060098,1.9796886444091797,-2.2402184009552,0.0,0.0,0.0,0.039727982656026235,0.9992105377790359,3.852207099856284,-8.10396861899246,0.7723423439245924,0.0,0.0,0.0,1.0
1717757290.8956308,map,True,True,6,6,0.5957621508060097,0.5957621508060098,1.9796886444091797,-2.2402184009552,0.0,0.0,0.0,0.039727982656026235,0.9992105377790359,3.852207099856284,-8.10396861899246,0.7723423439245924,0.0,0.0,0.0,1.0
1717757290.8997679,map,True,True,6,6,0.5957621508060097,0.5957621508060098,1.9796886444091797,-2.2402184009552,0.0,0.0,0.0,0.039727982656026235,0.9992105377790359,3.852207099856284,-8.10396861899246,0.7723423439245924,0.0,0.0,0.0,1.0
1717757290.9045184,map,True,False,6,6,0.5957621508060097,0.5957621508060098,1.9796886444091797,-2.2402184009552,0.0,0.0,0.0,0.039727982656026235,0.9992105377790359,3.852207099856284,-8.10396861899246,0.7723423439245924,0.0,0.0,0.0,1.0
1717757290.9076433,map,True,True,6,6,0.5957621508060097,0.5957621508060098,1.9796886444091797,-2.2402184009552,0.0,0.0,0.0,0.039727982656026235,0.9992105377790359,3.852207099856284,-8.10396861899246,0.7723423439245924,0.0,0.0,0.0,1.0
1717757290.9118598,map,True,True,6,6,0.5957621508060097,0.5957621508060098,1.9796886444091797,-2.2402184009552,0.0,0.0,0.0,0.039727982656026235,0.9992105377790359,3.852207099856284,-8.10396861899246,0.7723423439245924,0.0,0.0,0.0,1.0
1717757290.914957,map,True,False,6,6,0.5957621508060097,0.5957621508060098,1.9796886444091797,-2.2402184009552,0.0,0.0,0.0,0.039727982656026235,0.9992105377790359,3.852207099856284,-8.10396861899246,0.7723423439245924,0.0,0.0,0.0,1.0
1717757290.9192648,map,True,True,6,6,0.5957621508060097,0.5957621508060098,1.9796886444091797,-2.2402184009552,0.0,0.0,0.0,0.039727982656026235,0.9992105377790359,3.852207099856284,-8.10396861899246,0.7723423439245924,0.0,0.0,0.0,1.0
1717757290.923593,map,True,False,6,6,0.5957621508060097,0.5957621508060098,1.9796886444091797,-2.2402184009552,0.0,0.0,0.0,0.039727982656026235,0.9992105377790359,3.852207099856284,-8.10396861899246,0.7723423439245924,0.0,0.0,0.0,1.0
1717757290.9278553,map,True,False,6,6,0.5957621508060097,0.5957621508060098,1.9796886444091797,-2.2402184009552,0.0,0.0,0.0,0.039727982656026235,0.9992105377790359,3.852207099856284,-8.10396861899246,0.7723423439245924,0.0,0.0,0.0,1.0
1717757290.9312618,map,True,False,6,6,0.5957621508060097,0.5957621508060098,1.9796886444091797,-2.2402184009552,0.0,0.0,0.0,0.039727982656026235,0.9992105377790359,3.852207099856284,-8.10396861899246,0.7723423439245924,0.0,0.0,0.0,1.0
1717757290.9382179,map,True,True,6,6,0.5957621508060097,0.5957621508060098,1.9796886444091797,-2.2402184009552,0.0,0.0,0.0,0.039727982656026235,0.9992105377790359,3.852207099856284,-8.10396861899246,0.7723423439245924,0.0,0.0,0.0,1.0
1717757290.9474308,map,True,False,6,6,0.5957621508060097,0.5957621508060098,1.9796886444091797,-2.2402184009552,0.0,0.0,0.0,0.039727982656026235,0.9992105377790359,3.852207099856284,-8.10396861899246,0.7723423439245924,0.0,0.0,0.0,1.0
1717757290.9513974,map,True,True,6,6,0.5957621508060097,0.5957621508060098,1.9796886444091797,-2.2402184009552,0.0,0.0,0.0,0.039727982656026235,0.9992105377790359,3.852207099856284,-8.10396861899246,0.7723423439245924,0.0,0.0,0.0,1.0
1717757290.9558563,map,True,False,6,6,0.5957621508060097,0.5957621508060098,1.9796886444091797,-2.2402184009552,0.0,0.0,0.0,0.039727982656026235,0.9992105377790359,3.852207099856284,-8.10396861899246,0.7723423439245924,0.0,0.0,0.0,1.0
1717757290.9600868,map,True,False,6,6,0.5957621508060097,0.5957621508060098,1.9796886444091797,-2.2402184009552,0.0,0.0,0.0,0.039727982656026235,0.9992105377790359,3.852207099856284,-8.10396861899246,0.7723423439245924,0.0,0.0,0.0,1.0
1717757290.963046,map,True,True,6,6,0.5957621508060097,0.5957621508060098,1.9796886444091797,-2.2402184009552,0.0,0.0,0.0,0.039727982656026235,0.9992105377790359,3.852207099856284,-8.10396861899246,0.7723423439245924,0.0,0.0,0.0,1.0
1717757290.9692965,map,True,True,6,6,0.5957621508060097,0.5957621508060098,1.9796886444091797,-2.2402184009552,0.0,0.0,0.0,0.039727982656026235,0.9992105377790359,3.852207099856284,-8.10396861899246,0.7723423439245924,0.0,0.0,0.0,1.0
1717757290.9715097,map,True,True,6,6,0.5957621508060097,0.5957621508060098,1.9796886444091797,-2.2402184009552,0.0,0.0,0.0,0.039727982656026235,0.9992105377790359,3.852207099856284,-8.10396861899246,0.7723423439245924,0.0,0.0,0.0,1.0
1717757290.97579,map,True,True,6,6,0.5957621508060097,0.5957621508060098,1.9796886444091797,-2.2402184009552,0.0,0.0,0.0,0.039727982656026235,0.9992105377790359,3.852207099856284,-8.10396861899246,0.7723423439245924,0.0,0.0,0.0,1.0
1717757290.9792027,map,True,False,6,6,0.5957621508060097,0.5957621508060098,1.9796886444091797,-2.2402184009552,0.0,0.0,0.0,0.039727982656026235,0.9992105377790359,3.852207099856284,-8.10396861899246,0.7723423439245924,0.0,0.0,0.0,1.0
1717757290.983468,map,True,True,6,6,0.5957621508060097,0.5957621508060098,1.9796886444091797,-2.2402184009552,0.0,0.0,0.0,0.039727982656026235,0.9992105377790359,3.852207099856284,-8.10396861899246,0.7723423439245924,0.0,0.0,0.0,1.0
1717757290.9876902,map,True,True,6,6,0.5957621508060097,0.5957621508060098,1.9796886444091797,-2.2402184009552,0.0,0.0,0.0,0.039727982656026235,0.9992105377790359,3.852207099856284,-8.10396861899246,0.7723423439245924,0.0,0.0,0.0,1.0
1717757290.9919982,map,True,False,6,6,0.5957621508060097,0.5957621508060098,1.9796886444091797,-2.2402184009552,0.0,0.0,0.0,0.039727982656026235,0.9992105377790359,3.852207099856284,-8.10396861899246,0.7723423439245924,0.0,0.0,0.0,1.0
1717757290.9953306,map,True,True,6,6,0.5957621508060097,0.5957621508060098,1.9796886444091797,-2.2402184009552,0.0,0.0,0.0,0.039727982656026235,0.9992105377790359,3.852207099856284,-8.10396861899246,0.7723423439245924,0.0,0.0,0.0,1.0
1717757291.0002003,map,True,True,6,6,0.5957621508060097,0.5957621508060098,1.9796886444091797,-2.2402184009552,0.0,0.0,0.0,0.039727982656026235,0.9992105377790359,3.852207099856284,-8.10396861899246,0.7723423439245924,0.0,0.0,0.0,1.0
1717757291.0044665,map,True,True,6,6,0.5957621508060097,0.5957621508060098,1.9796886444091797,-2.2402184009552,0.0,0.0,0.0,0.039727982656026235,0.9992105377790359,3.852207099856284,-8.10396861899246,0.7723423439245924,0.0,0.0,0.0,1.0
1717757291.008077,map,True,True,6,6,0.5957621508060097,0.5957621508060098,1.9796886444091797,-2.2402184009552,0.0,0.0,0.0,0.039727982656026235,0.9992105377790359,3.852207099856284,-8.10396861899246,0.7723423439245924,0.0,0.0,0.0,1.0
1717757291.01103,map,True,False,6,6,0.5957621508060097,0.5957621508060098,1.9796886444091797,-2.2402184009552,0.0,0.0,0.0,0.039727982656026235,0.9992105377790359,3.852207099856284,-8.10396861899246,0.7723423439245924,0.0,0.0,0.0,1.0
1717757291.0158489,map,True,True,6,6,0.5957621508060097,0.5957621508060098,1.9796886444091797,-2.2402184009552,0.0,0.0,0.0,0.039727982656026235,0.9992105377790359,3.852207099856284,-8.10396861899246,0.7723423439245924,0.0,0.0,0.0,1.0
1717757291.0236874,map,True,True,6,6,0.5957621508060097,0.5957621508060098,1.9796886444091797,-2.2402184009552,0.0,0.0,0.0,0.039727982656026235,0.9992105377790359,3.852207099856284,-8.10396861899246,0.7723423439245924,0.0,0.0,0.0,1.0
1717757291.0295143,map,True,False,6,6,0.5957621508060097,0.5957621508060098,1.9796886444091797,-2.2402184009552,0.0,0.0,0.0,0.039727982656026235,0.9992105377790359,3.852207099856284,-8.10396861899246,0.7723423439245924,0.0,0.0,0.0,1.0
1717757291.0322146,map,True,False,6,6,0.5957621508060097,0.5957621508060098,1.9796886444091797,-2.2402184009552,0.0,0.0,0.0,0.039727982656026235,0.9992105377790359,3.852207099856284,-8.10396861899246,0.7723423439245924,0.0,0.0,0.0,1.0
1717757291.0375566,map,True,True,6,6,0.5957621508060097,0.5957621508060098,1.9796886444091797,-2.2402184009552,0.0,0.0,0.0,0.039727982656026235,0.9992105377790359,3.852207099856284,-8.10396861899246,0.7723423439245924,0.0,0.0,0.0,1.0
1717757291.0438359,map,True,True,6,6,0.5957621508060097,0.5957621508060098,1.9796886444091797,-2.2402184009552,0.0,0.0,0.0,0.039727982656026235,0.9992105377790359,3.852207099856284,-8.10396861899246,0.7723423439245924,0.0,0.0,0.0,1.0
1717757291.0479672,map,True,False,6,6,0.5957621508060097,0.5957621508060098,1.9796886444091797,-2.2402184009552,0.0,0.0,0.0,0.039727982656026235,0.9992105377790359,3.852207099856284,-8.10396861899246,0.7723423439245924,0.0,0.0,0.0,1.0
1717757291.0512576,map,True,True,6,6,0.5957621508060097,0.5957621508060098,1.9796886444091797,-2.2402184009552,0.0,0.0,0.0,0.039727982656026235,0.9992105377790359,3.852207099856284,-8.10396861899246,0.7723423439245924,0.0,0.0,0.0,1.0
1717757291.0556881,map,True,False,6,6,0.5957621508060097,0.5957621508060098,1.9796886444091797,-2.2402184009552,0.0,0.0,0.0,0.039727982656026235,0.9992105377790359,3.852207099856284,-8.10396861899246,0.7723423439245924,0.0,0.0,0.0,1.0
1717757291.0604079,map,True,True,6,6,0.5957621508060097,0.5957621508060098,1.9796886444091797,-2.2402184009552,0.0,0.0,0.0,0.039727982656026235,0.9992105377790359,3.852207099856284,-8.10396861899246,0.7723423439245924,0.0,0.0,0.0,1.0
1717757291.0658724,map,True,True,6,6,0.5957621508060097,0.5957621508060098,1.9796886444091797,-2.2402184009552,0.0,0.0,0.0,0.039727982656026235,0.9992105377790359,3.852207099856284,-8.10396861899246,0.7723423439245924,0.0,0.0,0.0,1.0
1717757291.0669785,map,True,True,6,6,0.5957621508060097,0.5957621508060098,1.9796886444091797,-2.2402184009552,0.0,0.0,0.0,0.039727982656026235,0.9992105377790359,3.852207099856284,-8.10396861899246,0.7723423439245924,0.0,0.0,0.0,1.0
1717757291.0736227,map,True,False,6,6,0.5957621508060097,0.5957621508060098,1.9796886444091797,-2.2402184009552,0.0,0.0,0.0,0.039727982656026235,0.9992105377790359,3.852207099856284,-8.10396861899246,0.7723423439245924,0.0,0.0,0.0,1.0
1717757291.0757012,map,True,False,6,6,0.5957621508060097,0.5957621508060098,1.9796886444091797,-2.2402184009552,0.0,0.0,0.0,0.039727982656026235,0.9992105377790359,3.852207099856284,-8.10396861899246,0.7723423439245924,0.0,0.0,0.0,1.0
1717757291.0860038,map,True,True,6,6,0.5957621508060097,0.5957621508060098,1.9796886444091797,-2.2402184009552,0.0,0.0,0.0,0.039727982656026235,0.9992105377790359,3.852207099856284,-8.10396861899246,0.7723423439245924,0.0,0.0,0.0,1.0
1717757291.087331,map,True,True,6,6,0.5957621508060097,0.5957621508060098,1.9796886444091797,-2.2402184009552,0.0,0.0,0.0,0.039727982656026235,0.9992105377790359,3.852207099856284,-8.10396861899246,0.7723423439245924,0.0,0.0,0.0,1.0
1717757291.0949569,map,True,True,6,6,0.5957621508060097,0.5957621508060098,1.9796886444091797,-2.2402184009552,0.0,0.0,0.0,0.039727982656026235,0.9992105377790359,3.852207099856284,-8.10396861899246,0.7723423439245924,0.0,0.0,0.0,1.0
1717757291.101944,map,True,True,6,6,0.5957621508060097,0.5957621508060098,1.9796886444091797,-2.2402184009552,0.0,0.0,0.0,0.039727982656026235,0.9992105377790359,3.852207099856284,-8.10396861899246,0.7723423439245924,0.0,0.0,0.0,1.0
1717757291.1036797,map,True,True,6,6,0.5957621508060097,0.5957621508060098,1.9796886444091797,-2.2402184009552,0.0,0.0,0.0,0.039727982656026235,0.9992105377790359,3.852207099856284,-8.10396861899246,0.7723423439245924,0.0,0.0,0.0,1.0
1717757291.1050954,map,True,True,6,6,0.5957621508060097,0.5957621508060098,1.9796886444091797,-2.2402184009552,0.0,0.0,0.0,0.039727982656026235,0.9992105377790359,3.852207099856284,-8.10396861899246,0.7723423439245924,0.0,0.0,0.0,1.0
1717757291.110395,map,True,True,6,6,0.5957621508060097,0.5957621508060098,1.9796886444091797,-2.2402184009552,0.0,0.0,0.0,0.039727982656026235,0.9992105377790359,3.852207099856284,-8.10396861899246,0.7723423439245924,0.0,0.0,0.0,1.0
1717757291.1122549,map,True,True,6,6,0.5957621508060097,0.5957621508060098,1.9796886444091797,-2.2402184009552,0.0,0.0,0.0,0.039727982656026235,0.9992105377790359,3.852207099856284,-8.10396861899246,0.7723423439245924,0.0,0.0,0.0,1.0
1717757291.1153636,map,True,True,6,6,0.5957621508060097,0.5957621508060098,1.9796886444091797,-2.2402184009552,0.0,0.0,0.0,0.039727982656026235,0.9992105377790359,3.852207099856284,-8.10396861899246,0.7723423439245924,0.0,0.0,0.0,1.0
1717757291.11935,map,True,False,6,6,0.5957621508060097,0.5957621508060098,1.9796886444091797,-2.2402184009552,0.0,0.0,0.0,0.039727982656026235,0.9992105377790359,3.852207099856284,-8.10396861899246,0.7723423439245924,0.0,0.0,0.0,1.0
1717757291.124058,map,True,False,6,6,0.5957621508060097,0.5957621508060098,1.9796886444091797,-2.2402184009552,0.0,0.0,0.0,0.039727982656026235,0.9992105377790359,3.852207099856284,-8.10396861899246,0.7723423439245924,0.0,0.0,0.0,1.0
1717757291.127254,map,True,False,6,6,0.5957621508060097,0.5957621508060098,1.9796886444091797,-2.2402184009552,0.0,0.0,0.0,0.039727982656026235,0.9992105377790359,3.852207099856284,-8.10396861899246,0.7723423439245924,0.0,0.0,0.0,1.0
1717757291.1313634,map,True,False,6,6,0.5957621508060097,0.5957621508060098,1.9796886444091797,-2.2402184009552,0.0,0.0,0.0,0.039727982656026235,0.9992105377790359,3.852207099856284,-8.10396861899246,0.7723423439245924,0.0,0.0,0.0,1.0
1717757291.1352153,map,True,False,6,6,0.5957621508060097,0.5957621508060098,1.9796886444091797,-2.2402184009552,0.0,0.0,0.0,0.039727982656026235,0.9992105377790359,3.852207099856284,-8.10396861899246,0.7723423439245924,0.0,0.0,0.0,1.0
1717757291.1411111,map,True,True,6,6,0.5957621508060097,0.5957621508060098,1.9796886444091797,-2.2402184009552,0.0,0.0,0.0,0.039727982656026235,0.9992105377790359,3.852207099856284,-8.10396861899246,0.7723423439245924,0.0,0.0,0.0,1.0
1717757291.143349,map,True,True,6,6,0.5957621508060097,0.5957621508060098,1.9796886444091797,-2.2402184009552,0.0,0.0,0.0,0.039727982656026235,0.9992105377790359,3.852207099856284,-8.10396861899246,0.7723423439245924,0.0,0.0,0.0,1.0
1717757291.1474075,map,True,True,6,6,0.5957621508060097,0.5957621508060098,1.9796886444091797,-2.2402184009552,0.0,0.0,0.0,0.039727982656026235,0.9992105377790359,3.852207099856284,-8.10396861899246,0.7723423439245924,0.0,0.0,0.0,1.0
1717757291.1516984,map,True,True,6,6,0.5957621508060097,0.5957621508060098,1.9796886444091797,-2.2402184009552,0.0,0.0,0.0,0.039727982656026235,0.9992105377790359,3.852207099856284,-8.10396861899246,0.7723423439245924,0.0,0.0,0.0,1.0
1717757291.1568103,map,True,True,6,6,0.5957621508060097,0.5957621508060098,1.9796886444091797,-2.2402184009552,0.0,0.0,0.0,0.039727982656026235,0.9992105377790359,3.852207099856284,-8.10396861899246,0.7723423439245924,0.0,0.0,0.0,1.0
1717757291.1597729,map,True,True,6,6,0.5957621508060097,0.5957621508060098,1.9796886444091797,-2.2402184009552,0.0,0.0,0.0,0.039727982656026235,0.9992105377790359,3.852207099856284,-8.10396861899246,0.7723423439245924,0.0,0.0,0.0,1.0
1717757291.1638412,map,True,True,6,6,0.5957621508060097,0.5957621508060098,1.9796886444091797,-2.2402184009552,0.0,0.0,0.0,0.039727982656026235,0.9992105377790359,3.852207099856284,-8.10396861899246,0.7723423439245924,0.0,0.0,0.0,1.0
1717757291.1668744,map,True,False,6,6,0.5957621508060097,0.5957621508060098,1.9796886444091797,-2.2402184009552,0.0,0.0,0.0,0.039727982656026235,0.9992105377790359,3.852207099856284,-8.10396861899246,0.7723423439245924,0.0,0.0,0.0,1.0
1717757291.1725814,map,True,False,6,6,0.5957621508060097,0.5957621508060098,1.9796886444091797,-2.2402184009552,0.0,0.0,0.0,0.039727982656026235,0.9992105377790359,3.852207099856284,-8.10396861899246,0.7723423439245924,0.0,0.0,0.0,1.0
1717757291.17574,map,True,True,6,6,0.5957621508060097,0.5957621508060098,1.9796886444091797,-2.2402184009552,0.0,0.0,0.0,0.039727982656026235,0.9992105377790359,3.97425533048735,-8.156693300469788,0.7376388789001738,0.0,0.0,0.0,1.0
1717757291.1787858,map,True,True,6,6,0.5957621508060097,0.5957621508060098,1.9796886444091797,-2.2402184009552,0.0,0.0,0.0,0.039727982656026235,0.9992105377790359,3.97425533048735,-8.156693300469788,0.7376388789001738,0.0,0.0,0.0,1.0
1717757291.1832323,map,True,False,6,6,0.5957621508060097,0.5957621508060098,1.9796886444091797,-2.2402184009552,0.0,0.0,0.0,0.039727982656026235,0.9992105377790359,3.9750071170677037,-8.076167786670688,0.7369010410475145,0.0,0.0,0.0,1.0
1717757291.1922812,map,True,True,6,6,0.5957621508060097,0.5957621508060098,1.9796886444091797,-2.2402184009552,0.0,0.0,0.0,0.039727982656026235,0.9992105377790359,3.9750071170677037,-8.076167786670688,0.7369010410475145,0.0,0.0,0.0,1.0
1717757291.1956358,map,True,True,6,6,0.5957621508060097,0.5957621508060098,1.9796886444091797,-2.2402184009552,0.0,0.0,0.0,0.039727982656026235,0.9992105377790359,3.9750071170677037,-8.076167786670688,0.7369010410475145,0.0,0.0,0.0,1.0
1717757291.1996617,map,True,False,6,6,0.5957621508060097,0.5957621508060098,1.9796886444091797,-2.2402184009552,0.0,0.0,0.0,0.039727982656026235,0.9992105377790359,3.9750071170677037,-8.076167786670688,0.7369010410475145,0.0,0.0,0.0,1.0
1717757291.2043583,map,True,True,6,6,0.5957621508060097,0.5957621508060098,1.9796886444091797,-2.2402184009552,0.0,0.0,0.0,0.039727982656026235,0.9992105377790359,3.9750071170677037,-8.076167786670688,0.7369010410475145,0.0,0.0,0.0,1.0
1717757291.2146091,map,True,True,6,6,0.5957621508060097,0.5957621508060098,1.9796886444091797,-2.2402184009552,0.0,0.0,0.0,0.039727982656026235,0.9992105377790359,3.9750071170677037,-8.076167786670688,0.7369010410475145,0.0,0.0,0.0,1.0
1717757291.2193246,map,True,True,6,6,0.5957621508060097,0.5957621508060098,1.9796886444091797,-2.2402184009552,0.0,0.0,0.0,0.039727982656026235,0.9992105377790359,3.9750071170677037,-8.076167786670688,0.7369010410475145,0.0,0.0,0.0,1.0
1717757291.224394,map,True,True,6,6,0.5957621508060097,0.5957621508060098,1.9796886444091797,-2.2402184009552,0.0,0.0,0.0,0.039727982656026235,0.9992105377790359,3.9750071170677037,-8.076167786670688,0.7369010410475145,0.0,0.0,0.0,1.0
1717757291.2293184,map,True,True,6,6,0.5957621508060097,0.5957621508060098,1.9796886444091797,-2.2402184009552,0.0,0.0,0.0,0.039727982656026235,0.9992105377790359,3.9750071170677037,-8.076167786670688,0.7369010410475145,0.0,0.0,0.0,1.0
1717757291.2336144,map,True,True,6,6,0.5957621508060097,0.5957621508060098,1.9796886444091797,-2.2402184009552,0.0,0.0,0.0,0.039727982656026235,0.9992105377790359,3.9750071170677037,-8.076167786670688,0.7369010410475145,0.0,0.0,0.0,1.0
1717757291.2370088,map,True,True,6,6,0.5957621508060097,0.5957621508060098,1.9796886444091797,-2.2402184009552,0.0,0.0,0.0,0.039727982656026235,0.9992105377790359,3.9750071170677037,-8.076167786670688,0.7369010410475145,0.0,0.0,0.0,1.0
1717757291.2389662,map,True,True,6,6,0.5957621508060097,0.5957621508060098,1.9796886444091797,-2.2402184009552,0.0,0.0,0.0,0.039727982656026235,0.9992105377790359,3.9750071170677037,-8.076167786670688,0.7369010410475145,0.0,0.0,0.0,1.0
1717757291.242989,map,True,True,6,6,0.5957621508060097,0.5957621508060098,1.9796886444091797,-2.2402184009552,0.0,0.0,0.0,0.039727982656026235,0.9992105377790359,3.9750071170677037,-8.076167786670688,0.7369010410475145,0.0,0.0,0.0,1.0
1717757291.2456584,map,True,True,6,6,0.5957621508060097,0.5957621508060098,1.9796886444091797,-2.2402184009552,0.0,0.0,0.0,0.039727982656026235,0.9992105377790359,3.9750071170677037,-8.076167786670688,0.7369010410475145,0.0,0.0,0.0,1.0
1717757291.2501185,map,True,False,6,6,0.5957621508060097,0.5957621508060098,1.9796886444091797,-2.2402184009552,0.0,0.0,0.0,0.039727982656026235,0.9992105377790359,3.9750071170677037,-8.076167786670688,0.7369010410475145,0.0,0.0,0.0,1.0
1717757291.2518663,map,True,False,6,6,0.5957621508060097,0.5957621508060098,1.9796886444091797,-2.2402184009552,0.0,0.0,0.0,0.039727982656026235,0.9992105377790359,3.9750071170677037,-8.076167786670688,0.7369010410475145,0.0,0.0,0.0,1.0
1717757291.2706187,map,True,False,6,6,0.5957621508060097,0.5957621508060098,1.9796886444091797,-2.2402184009552,0.0,0.0,0.0,0.039727982656026235,0.9992105377790359,3.9750071170677037,-8.076167786670688,0.7369010410475145,0.0,0.0,0.0,1.0
1717757291.2723722,map,True,True,6,6,0.5957621508060097,0.5957621508060098,1.9796886444091797,-2.2402184009552,0.0,0.0,0.0,0.039727982656026235,0.9992105377790359,3.9750071170677037,-8.076167786670688,0.7369010410475145,0.0,0.0,0.0,1.0
1717757291.276844,map,True,True,6,6,0.5957621508060097,0.5957621508060098,1.9796886444091797,-2.2402184009552,0.0,0.0,0.0,0.039727982656026235,0.9992105377790359,3.9750071170677037,-8.076167786670688,0.7369010410475145,0.0,0.0,0.0,1.0
1717757291.2895877,map,True,False,6,6,0.5957621508060097,0.5957621508060098,1.9796886444091797,-2.2402184009552,0.0,0.0,0.0,0.039727982656026235,0.9992105377790359,3.9750071170677037,-8.076167786670688,0.7369010410475145,0.0,0.0,0.0,1.0
1717757291.2903445,map,True,True,6,6,0.5957621508060097,0.5957621508060098,1.9796886444091797,-2.2402184009552,0.0,0.0,0.0,0.039727982656026235,0.9992105377790359,3.9750071170677037,-8.076167786670688,0.7369010410475145,0.0,0.0,0.0,1.0
1717757291.2984908,map,True,False,6,6,0.5957621508060097,0.5957621508060098,1.9796886444091797,-2.2402184009552,0.0,0.0,0.0,0.039727982656026235,0.9992105377790359,3.9750071170677037,-8.076167786670688,0.7369010410475145,0.0,0.0,0.0,1.0
1717757291.2998302,map,True,True,6,6,0.5957621508060097,0.5957621508060098,1.9796886444091797,-2.2402184009552,0.0,0.0,0.0,0.039727982656026235,0.9992105377790359,3.9750071170677037,-8.076167786670688,0.7369010410475145,0.0,0.0,0.0,1.0
1717757291.302963,map,True,False,6,6,0.5957621508060097,0.5957621508060098,1.9796886444091797,-2.2402184009552,0.0,0.0,0.0,0.039727982656026235,0.9992105377790359,3.9750071170677037,-8.076167786670688,0.7369010410475145,0.0,0.0,0.0,1.0
1717757291.305422,map,True,True,6,6,0.5957621508060097,0.5957621508060098,1.9796886444091797,-2.2402184009552,0.0,0.0,0.0,0.039727982656026235,0.9992105377790359,3.9750071170677037,-8.076167786670688,0.7369010410475145,0.0,0.0,0.0,1.0
1717757291.3086493,map,True,False,6,6,0.5957621508060097,0.5957621508060098,1.9796886444091797,-2.2402184009552,0.0,0.0,0.0,0.039727982656026235,0.9992105377790359,3.9750071170677037,-8.076167786670688,0.7369010410475145,0.0,0.0,0.0,1.0
1717757291.3110738,map,True,True,6,6,0.5957621508060097,0.5957621508060098,1.9796886444091797,-2.2402184009552,0.0,0.0,0.0,0.039727982656026235,0.9992105377790359,3.9750071170677037,-8.076167786670688,0.7369010410475145,0.0,0.0,0.0,1.0
1717757291.3132017,map,True,True,6,6,0.5957621508060097,0.5957621508060098,1.9796886444091797,-2.2402184009552,0.0,0.0,0.0,0.039727982656026235,0.9992105377790359,3.9750071170677037,-8.076167786670688,0.7369010410475145,0.0,0.0,0.0,1.0
1717757291.3171759,map,True,True,6,6,0.5957621508060097,0.5957621508060098,1.9796886444091797,-2.2402184009552,0.0,0.0,0.0,0.039727982656026235,0.9992105377790359,3.9750071170677037,-8.076167786670688,0.7369010410475145,0.0,0.0,0.0,1.0
1717757291.318457,map,True,True,6,6,0.5957621508060097,0.5957621508060098,1.9796886444091797,-2.2402184009552,0.0,0.0,0.0,0.039727982656026235,0.9992105377790359,3.9750071170677037,-8.076167786670688,0.7369010410475145,0.0,0.0,0.0,1.0
1717757291.3205278,map,True,False,6,6,0.5957621508060097,0.5957621508060098,1.9796886444091797,-2.2402184009552,0.0,0.0,0.0,0.039727982656026235,0.9992105377790359,3.9750071170677037,-8.076167786670688,0.7369010410475145,0.0,0.0,0.0,1.0
1717757291.322014,map,True,True,6,6,0.5957621508060097,0.5957621508060098,1.9796886444091797,-2.2402184009552,0.0,0.0,0.0,0.039727982656026235,0.9992105377790359,3.9750071170677037,-8.076167786670688,0.7369010410475145,0.0,0.0,0.0,1.0
1717757291.3244658,map,True,True,6,6,0.5957621508060097,0.5957621508060098,1.9796886444091797,-2.2402184009552,0.0,0.0,0.0,0.039727982656026235,0.9992105377790359,3.9750071170677037,-8.076167786670688,0.7369010410475145,0.0,0.0,0.0,1.0
1717757291.327277,map,True,True,6,6,0.5957621508060097,0.5957621508060098,1.9796886444091797,-2.2402184009552,0.0,0.0,0.0,0.039727982656026235,0.9992105377790359,3.9750071170677037,-8.076167786670688,0.7369010410475145,0.0,0.0,0.0,1.0
1717757291.3313904,map,True,True,6,6,0.5957621508060097,0.5957621508060098,1.9796886444091797,-2.2402184009552,0.0,0.0,0.0,0.039727982656026235,0.9992105377790359,3.9750071170677037,-8.076167786670688,0.7369010410475145,0.0,0.0,0.0,1.0
1717757291.335173,map,True,True,6,6,0.5957621508060097,0.5957621508060098,1.9796886444091797,-2.2402184009552,0.0,0.0,0.0,0.039727982656026235,0.9992105377790359,3.9750071170677037,-8.076167786670688,0.7369010410475145,0.0,0.0,0.0,1.0
1717757291.3415883,map,True,False,6,6,0.5957621508060097,0.5957621508060098,1.9796886444091797,-2.2402184009552,0.0,0.0,0.0,0.039727982656026235,0.9992105377790359,3.9750071170677037,-8.076167786670688,0.7369010410475145,0.0,0.0,0.0,1.0
1717757291.3438585,map,True,True,6,6,0.5957621508060097,0.5957621508060098,1.9796886444091797,-2.2402184009552,0.0,0.0,0.0,0.039727982656026235,0.9992105377790359,3.9750071170677037,-8.076167786670688,0.7369010410475145,0.0,0.0,0.0,1.0
1717757291.3500495,map,True,False,6,6,0.5957621508060097,0.5957621508060098,1.9796886444091797,-2.2402184009552,0.0,0.0,0.0,0.039727982656026235,0.9992105377790359,3.9750071170677037,-8.076167786670688,0.7369010410475145,0.0,0.0,0.0,1.0
1717757291.3565652,map,True,False,6,6,0.5957621508060097,0.5957621508060098,1.9796886444091797,-2.2402184009552,0.0,0.0,0.0,0.039727982656026235,0.9992105377790359,3.9750071170677037,-8.076167786670688,0.7369010410475145,0.0,0.0,0.0,1.0
1717757291.3642063,map,True,True,6,6,0.5957621508060097,0.5957621508060098,1.9796886444091797,-2.2402184009552,0.0,0.0,0.0,0.039727982656026235,0.9992105377790359,3.9750071170677037,-8.076167786670688,0.7369010410475145,0.0,0.0,0.0,1.0
1717757291.3683825,map,True,False,6,6,0.5957621508060097,0.5957621508060098,1.9796886444091797,-2.2402184009552,0.0,0.0,0.0,0.039727982656026235,0.9992105377790359,3.9750071170677037,-8.076167786670688,0.7369010410475145,0.0,0.0,0.0,1.0
1717757291.3723657,map,True,False,6,6,0.5957621508060097,0.5957621508060098,1.9796886444091797,-2.2402184009552,0.0,0.0,0.0,0.039727982656026235,0.9992105377790359,3.9750071170677037,-8.076167786670688,0.7369010410475145,0.0,0.0,0.0,1.0
1717757291.3758297,map,True,False,6,6,0.5957621508060097,0.5957621508060098,1.9796886444091797,-2.2402184009552,0.0,0.0,0.0,0.039727982656026235,0.9992105377790359,3.9750071170677037,-8.076167786670688,0.7369010410475145,0.0,0.0,0.0,1.0
1717757291.3828948,map,True,True,6,6,0.5957621508060097,0.5957621508060098,1.9796886444091797,-2.2402184009552,0.0,0.0,0.0,0.039727982656026235,0.9992105377790359,3.9750071170677037,-8.076167786670688,0.7369010410475145,0.0,0.0,0.0,1.0
1717757291.3844538,map,True,True,6,6,0.5957621508060097,0.5957621508060098,1.9796886444091797,-2.2402184009552,0.0,0.0,0.0,0.039727982656026235,0.9992105377790359,3.9750071170677037,-8.076167786670688,0.7369010410475145,0.0,0.0,0.0,1.0
1717757291.3897529,map,True,False,6,6,0.5957621508060097,0.5957621508060098,1.9796886444091797,-2.2402184009552,0.0,0.0,0.0,0.039727982656026235,0.9992105377790359,3.9750071170677037,-8.076167786670688,0.7369010410475145,0.0,0.0,0.0,1.0
1717757291.4002445,map,True,False,6,6,0.5957621508060097,0.5957621508060098,1.9796886444091797,-2.2402184009552,0.0,0.0,0.0,0.039727982656026235,0.9992105377790359,3.9750071170677037,-8.076167786670688,0.7369010410475145,0.0,0.0,0.0,1.0
1717757291.4030604,map,True,False,6,6,0.5957621508060097,0.5957621508060098,1.9796886444091797,-2.2402184009552,0.0,0.0,0.0,0.039727982656026235,0.9992105377790359,3.9750071170677037,-8.076167786670688,0.7369010410475145,0.0,0.0,0.0,1.0
1717757291.4098363,map,True,True,6,6,0.5957621508060097,0.5957621508060098,1.9796886444091797,-2.2402184009552,0.0,0.0,0.0,0.039727982656026235,0.9992105377790359,3.9750071170677037,-8.076167786670688,0.7369010410475145,0.0,0.0,0.0,1.0
1717757291.4154887,map,True,False,6,6,0.5957621508060097,0.5957621508060098,1.9796886444091797,-2.2402184009552,0.0,0.0,0.0,0.039727982656026235,0.9992105377790359,3.9750071170677037,-8.076167786670688,0.7369010410475145,0.0,0.0,0.0,1.0
1717757291.4201357,map,True,False,6,6,0.5957621508060097,0.5957621508060098,1.9796886444091797,-2.2402184009552,0.0,0.0,0.0,0.039727982656026235,0.9992105377790359,3.9750071170677037,-8.076167786670688,0.7369010410475145,0.0,0.0,0.0,1.0
1717757291.4284773,map,True,False,6,6,0.5957621508060097,0.5957621508060098,1.9796886444091797,-2.2402184009552,0.0,0.0,0.0,0.039727982656026235,0.9992105377790359,3.9750071170677037,-8.076167786670688,0.7369010410475145,0.0,0.0,0.0,1.0
1717757291.431449,map,True,True,6,6,0.5957621508060097,0.5957621508060098,1.9796886444091797,-2.2402184009552,0.0,0.0,0.0,0.039727982656026235,0.9992105377790359,3.9750071170677037,-8.076167786670688,0.7369010410475145,0.0,0.0,0.0,1.0
1717757291.435976,map,True,False,6,6,0.5957621508060097,0.5957621508060098,1.9796886444091797,-2.2402184009552,0.0,0.0,0.0,0.039727982656026235,0.9992105377790359,3.9750071170677037,-8.076167786670688,0.7369010410475145,0.0,0.0,0.0,1.0
1717757291.4445984,map,True,False,6,6,0.5957621508060097,0.5957621508060098,1.9796886444091797,-2.2402184009552,0.0,0.0,0.0,0.039727982656026235,0.9992105377790359,3.9750071170677037,-8.076167786670688,0.7369010410475145,0.0,0.0,0.0,1.0
1717757291.4472647,map,True,True,6,6,0.5957621508060097,0.5957621508060098,1.9796886444091797,-2.2402184009552,0.0,0.0,0.0,0.039727982656026235,0.9992105377790359,3.9750071170677037,-8.076167786670688,0.7369010410475145,0.0,0.0,0.0,1.0
1717757291.45145,map,True,False,6,6,0.5957621508060097,0.5957621508060098,1.9796886444091797,-2.2402184009552,0.0,0.0,0.0,0.039727982656026235,0.9992105377790359,3.9750071170677037,-8.076167786670688,0.7369010410475145,0.0,0.0,0.0,1.0
1717757291.45612,map,True,True,6,6,0.5957621508060097,0.5957621508060098,1.9796886444091797,-2.2402184009552,0.0,0.0,0.0,0.039727982656026235,0.9992105377790359,3.9750071170677037,-8.076167786670688,0.7369010410475145,0.0,0.0,0.0,1.0
1717757291.4620614,map,True,True,6,6,0.5957621508060097,0.5957621508060098,1.9796886444091797,-2.2402184009552,0.0,0.0,0.0,0.039727982656026235,0.9992105377790359,3.9750071170677037,-8.076167786670688,0.7369010410475145,0.0,0.0,0.0,1.0
1717757291.4677353,map,True,False,6,6,0.5957621508060097,0.5957621508060098,1.9796886444091797,-2.2402184009552,0.0,0.0,0.0,0.039727982656026235,0.9992105377790359,3.9750071170677037,-8.076167786670688,0.7369010410475145,0.0,0.0,0.0,1.0
1717757291.5010307,map,True,True,6,6,0.5957621508060097,0.5957621508060098,1.9796886444091797,-2.2402184009552,0.0,0.0,0.0,0.039727982656026235,0.9992105377790359,3.9750071170677037,-8.076167786670688,0.7369010410475145,0.0,0.0,0.0,1.0
1717757291.5132391,map,True,False,6,5,0.0,0.0,1.9796886444091797,-2.2402184009552,0.0,0.0,0.0,0.039727982656026235,0.9992105377790359,3.9735266300484144,-7.482713637570713,0.7395381634719819,0.0,0.0,0.0,1.0
1717757291.5153863,map,True,False,6,5,0.0,0.0,1.9796886444091797,-2.2402184009552,0.0,0.0,0.0,0.039727982656026235,0.9992105377790359,3.9735266300484144,-7.482713637570713,0.7395381634719819,0.0,0.0,0.0,1.0
1717757291.5190616,map,True,False,6,5,0.0,0.0,1.9796886444091797,-2.2402184009552,0.0,0.0,0.0,0.039727982656026235,0.9992105377790359,3.9735266300484144,-7.482713637570713,0.7395381634719819,0.0,0.0,0.0,1.0
1717757291.5280168,map,True,False,6,5,0.0,0.0,1.9796886444091797,-2.2402184009552,0.0,0.0,0.0,0.039727982656026235,0.9992105377790359,3.9735266300484144,-7.482713637570713,0.7395381634719819,0.0,0.0,0.0,1.0
1717757291.5596175,map,True,False,6,5,0.0,0.0,1.9796886444091797,-2.2402184009552,0.0,0.0,0.0,0.039727982656026235,0.9992105377790359,3.9735266300484144,-7.482713637570713,0.7395381634719819,0.0,0.0,0.0,1.0
1717757291.5634775,map,True,False,6,5,0.0,0.0,1.9796886444091797,-2.2402184009552,0.0,0.0,0.0,0.039727982656026235,0.9992105377790359,3.9735266300484144,-7.482713637570713,0.7395381634719819,0.0,0.0,0.0,1.0
1717757291.57209,map,True,False,6,5,0.0,0.0,1.9796886444091797,-2.2402184009552,0.0,0.0,0.0,0.039727982656026235,0.9992105377790359,3.9735266300484144,-7.482713637570713,0.7395381634719819,0.0,0.0,0.0,1.0
1717757291.5760143,map,True,False,6,5,0.0,0.0,1.9796886444091797,-2.2402184009552,0.0,0.0,0.0,0.039727982656026235,0.9992105377790359,3.9735266300484144,-7.482713637570713,0.7395381634719819,0.0,0.0,0.0,1.0
1717757291.5792599,map,True,False,6,5,0.0,0.0,1.9796886444091797,-2.2402184009552,0.0,0.0,0.0,0.039727982656026235,0.9992105377790359,3.9735266300484144,-7.482713637570713,0.7395381634719819,0.0,0.0,0.0,1.0
1717757291.583358,map,True,False,6,5,0.0,0.0,1.9796886444091797,-2.2402184009552,0.0,0.0,0.0,0.039727982656026235,0.9992105377790359,3.9735266300484144,-7.482713637570713,0.7395381634719819,0.0,0.0,0.0,1.0
1717757291.595888,map,True,False,6,5,0.0,0.0,1.9796886444091797,-2.2402184009552,0.0,0.0,0.0,0.039727982656026235,0.9992105377790359,3.9735266300484144,-7.482713637570713,0.7395381634719819,0.0,0.0,0.0,1.0
1717757291.6082368,map,True,False,6,5,0.0,0.0,1.9796886444091797,-2.2402184009552,0.0,0.0,0.0,0.039727982656026235,0.9992105377790359,3.9735266300484144,-7.482713637570713,0.7395381634719819,0.0,0.0,0.0,1.0
1717757291.6094506,map,True,False,6,5,0.0,0.0,1.9796886444091797,-2.2402184009552,0.0,0.0,0.0,0.039727982656026235,0.9992105377790359,3.9735266300484144,-7.482713637570713,0.7395381634719819,0.0,0.0,0.0,1.0
1717757291.610393,map,True,False,6,5,0.0,0.0,1.9796886444091797,-2.2402184009552,0.0,0.0,0.0,0.039727982656026235,0.9992105377790359,3.9735266300484144,-7.482713637570713,0.7395381634719819,0.0,0.0,0.0,1.0
1717757291.611418,map,True,False,6,5,0.0,0.0,1.9796886444091797,-2.2402184009552,0.0,0.0,0.0,0.039727982656026235,0.9992105377790359,3.9735266300484144,-7.482713637570713,0.7395381634719819,0.0,0.0,0.0,1.0
1717757291.6153243,map,True,False,6,5,0.0,0.0,1.9796886444091797,-2.2402184009552,0.0,0.0,0.0,0.039727982656026235,0.9992105377790359,3.9735266300484144,-7.482713637570713,0.7395381634719819,0.0,0.0,0.0,1.0
1717757291.619747,map,True,False,6,5,0.0,0.0,1.9796886444091797,-2.2402184009552,0.0,0.0,0.0,0.039727982656026235,0.9992105377790359,3.9735266300484144,-7.482713637570713,0.7395381634719819,0.0,0.0,0.0,1.0
1717757291.6235824,map,True,False,6,5,0.0,0.0,1.9796886444091797,-2.2402184009552,0.0,0.0,0.0,0.039727982656026235,0.9992105377790359,3.9735266300484144,-7.482713637570713,0.7395381634719819,0.0,0.0,0.0,1.0
1717757291.676781,map,True,False,6,5,0.0,0.0,1.9827351570129395,-2.24180269241333,0.0,0.0,0.0,0.03969993231950345,0.9992116413355715,3.9735266300484144,-7.482713637570713,0.7395381634719819,0.0,0.0,0.0,1.0
1717757291.7274852,map,True,False,6,5,0.0,0.0,1.9827351570129395,-2.24180269241333,0.0,0.0,0.0,0.03969993231950345,0.9992116413355715,3.9735266300484144,-7.482713637570713,0.7395381634719819,0.0,0.0,0.0,1.0
1717757291.8791888,map,True,False,6,5,0.0,0.0,1.9827351570129395,-2.24180269241333,0.0,0.0,0.0,0.03969993231950345,0.9992116413355715,4.014156809347031,-7.326713905692449,0.7378891909677755,0.0,0.0,0.0,1.0
1717757291.929968,map,True,False,6,5,0.0,0.0,1.9827351570129395,-2.24180269241333,0.0,0.0,0.0,0.03969993231950345,0.9992116413355715,4.014156809347031,-7.326713905692449,0.7378891909677755,0.0,0.0,0.0,1.0
1717757291.981199,map,True,False,6,5,0.0,0.0,1.9827351570129395,-2.24180269241333,0.0,0.0,0.0,0.03969993231950345,0.9992116413355715,4.014156809347031,-7.326713905692449,0.7378891909677755,0.0,0.0,0.0,1.0
1717757292.031879,map,True,False,6,5,0.0,0.0,1.9827351570129395,-2.24180269241333,0.0,0.0,0.0,0.03969993231950345,0.9992116413355715,4.014156809347031,-7.326713905692449,0.7378891909677755,0.0,0.0,0.0,1.0
1717757292.1296942,map,True,False,6,5,0.0,0.0,1.9827351570129395,-2.24180269241333,0.0,0.0,0.0,0.03969993231950345,0.9992116413355715,4.014156809347031,-7.326713905692449,0.7378891909677755,0.0,0.0,0.0,1.0
1717757292.180268,map,True,False,6,5,0.0,0.0,1.9827351570129395,-2.24180269241333,0.0,0.0,0.0,0.03969993231950345,0.9992116413355715,4.141603175156335,-7.139763698733241,0.7361743443830391,0.0,0.0,0.0,1.0
1717757292.2308493,map,True,False,6,5,0.0,0.0,1.9827351570129395,-2.24180269241333,0.0,0.0,0.0,0.03969993231950345,0.9992116413355715,4.141603175156335,-7.139763698733241,0.7361743443830391,0.0,0.0,0.0,1.0
1717757292.329765,map,True,False,6,5,0.0,0.0,2.0275156497955322,-2.243814706802368,0.0,0.0,0.0,0.040354370807917525,0.9991854240819215,4.141603175156335,-7.139763698733241,0.7361743443830391,0.0,0.0,0.0,1.0
1717757292.3802023,map,True,False,6,5,0.0,0.0,2.0275156497955322,-2.243814706802368,0.0,0.0,0.0,0.040354370807917525,0.9991854240819215,4.141603175156335,-7.139763698733241,0.7361743443830391,0.0,0.0,0.0,1.0
1717757292.4303558,map,True,False,6,5,0.0,0.0,2.0275156497955322,-2.243814706802368,0.0,0.0,0.0,0.040354370807917525,0.9991854240819215,4.141603175156335,-7.139763698733241,0.7361743443830391,0.0,0.0,0.0,1.0
1717757292.530328,map,True,False,6,4,0.0,0.0,2.0275156497955322,-2.243814706802368,0.0,0.0,0.0,0.040354370807917525,0.9991854240819215,4.127910008295649,-6.572347988449048,0.729997656877766,0.0,0.0,0.0,1.0
1717757292.5690672,map,True,False,6,4,0.0,0.0,2.0275156497955322,-2.243814706802368,0.0,0.0,0.0,0.040354370807917525,0.9991854240819215,4.127910008295649,-6.572347988449048,0.729997656877766,0.0,0.0,0.0,1.0
1717757292.579052,map,True,False,6,4,0.0,0.0,2.0275156497955322,-2.243814706802368,0.0,0.0,0.0,0.040354370807917525,0.9991854240819215,4.127910008295649,-6.572347988449048,0.729997656877766,0.0,0.0,0.0,1.0
1717757292.5803115,map,True,False,6,4,0.0,0.0,2.0275156497955322,-2.243814706802368,0.0,0.0,0.0,0.040354370807917525,0.9991854240819215,4.127910008295649,-6.572347988449048,0.729997656877766,0.0,0.0,0.0,1.0
1717757292.5823743,map,True,False,6,4,0.0,0.0,2.0275156497955322,-2.243814706802368,0.0,0.0,0.0,0.040354370807917525,0.9991854240819215,4.127910008295649,-6.572347988449048,0.729997656877766,0.0,0.0,0.0,1.0
1717757292.5840452,map,True,False,6,4,0.0,0.0,2.0275156497955322,-2.243814706802368,0.0,0.0,0.0,0.040354370807917525,0.9991854240819215,4.127910008295649,-6.572347988449048,0.729997656877766,0.0,0.0,0.0,1.0
1717757292.5876136,map,True,False,6,4,0.0,0.0,2.0275156497955322,-2.243814706802368,0.0,0.0,0.0,0.040354370807917525,0.9991854240819215,4.127910008295649,-6.572347988449048,0.729997656877766,0.0,0.0,0.0,1.0
1717757292.5909433,map,True,False,6,4,0.0,0.0,2.0275156497955322,-2.243814706802368,0.0,0.0,0.0,0.040354370807917525,0.9991854240819215,4.127910008295649,-6.572347988449048,0.729997656877766,0.0,0.0,0.0,1.0
1717757292.595886,map,True,False,6,4,0.0,0.0,2.0275156497955322,-2.243814706802368,0.0,0.0,0.0,0.040354370807917525,0.9991854240819215,4.127910008295649,-6.572347988449048,0.729997656877766,0.0,0.0,0.0,1.0
1717757292.6001074,map,True,False,6,4,0.0,0.0,2.0275156497955322,-2.243814706802368,0.0,0.0,0.0,0.040354370807917525,0.9991854240819215,4.127910008295649,-6.572347988449048,0.729997656877766,0.0,0.0,0.0,1.0
1717757292.602819,map,True,False,6,4,0.0,0.0,2.0275156497955322,-2.243814706802368,0.0,0.0,0.0,0.040354370807917525,0.9991854240819215,4.127910008295649,-6.572347988449048,0.729997656877766,0.0,0.0,0.0,1.0
1717757292.608966,map,True,False,6,4,0.0,0.0,2.0275156497955322,-2.243814706802368,0.0,0.0,0.0,0.040354370807917525,0.9991854240819215,4.127910008295649,-6.572347988449048,0.729997656877766,0.0,0.0,0.0,1.0
1717757292.6119905,map,True,False,6,4,0.0,0.0,2.0275156497955322,-2.243814706802368,0.0,0.0,0.0,0.040354370807917525,0.9991854240819215,4.127910008295649,-6.572347988449048,0.729997656877766,0.0,0.0,0.0,1.0
1717757292.6167593,map,True,False,6,4,0.0,0.0,2.0275156497955322,-2.243814706802368,0.0,0.0,0.0,0.040354370807917525,0.9991854240819215,4.127910008295649,-6.572347988449048,0.729997656877766,0.0,0.0,0.0,1.0
1717757292.6200235,map,True,False,6,4,0.0,0.0,2.0275156497955322,-2.243814706802368,0.0,0.0,0.0,0.040354370807917525,0.9991854240819215,4.127910008295649,-6.572347988449048,0.729997656877766,0.0,0.0,0.0,1.0
1717757292.6231537,map,True,False,6,4,0.0,0.0,2.0275156497955322,-2.243814706802368,0.0,0.0,0.0,0.040354370807917525,0.9991854240819215,4.127910008295649,-6.572347988449048,0.729997656877766,0.0,0.0,0.0,1.0
1717757292.6271937,map,True,False,6,4,0.0,0.0,2.0275156497955322,-2.243814706802368,0.0,0.0,0.0,0.040354370807917525,0.9991854240819215,4.127910008295649,-6.572347988449048,0.729997656877766,0.0,0.0,0.0,1.0
1717757292.6334014,map,True,False,6,4,0.0,0.0,2.0275156497955322,-2.243814706802368,0.0,0.0,0.0,0.040354370807917525,0.9991854240819215,4.127910008295649,-6.572347988449048,0.729997656877766,0.0,0.0,0.0,1.0
1717757292.6374316,map,True,False,6,4,0.0,0.0,2.0275156497955322,-2.243814706802368,0.0,0.0,0.0,0.040354370807917525,0.9991854240819215,4.127910008295649,-6.572347988449048,0.729997656877766,0.0,0.0,0.0,1.0
1717757292.6393492,map,True,False,6,4,0.0,0.0,2.0275156497955322,-2.243814706802368,0.0,0.0,0.0,0.040354370807917525,0.9991854240819215,4.127910008295649,-6.572347988449048,0.729997656877766,0.0,0.0,0.0,1.0
1717757292.6486452,map,True,False,6,4,0.0,0.0,2.0275156497955322,-2.243814706802368,0.0,0.0,0.0,0.040354370807917525,0.9991854240819215,4.127910008295649,-6.572347988449048,0.729997656877766,0.0,0.0,0.0,1.0
1717757292.651402,map,True,False,6,4,0.0,0.0,2.0275156497955322,-2.243814706802368,0.0,0.0,0.0,0.040354370807917525,0.9991854240819215,4.127910008295649,-6.572347988449048,0.729997656877766,0.0,0.0,0.0,1.0
1717757292.6556766,map,True,False,6,4,0.0,0.0,2.0275156497955322,-2.243814706802368,0.0,0.0,0.0,0.040354370807917525,0.9991854240819215,4.127910008295649,-6.572347988449048,0.729997656877766,0.0,0.0,0.0,1.0
1717757292.6601129,map,True,False,6,4,0.0,0.0,2.0275156497955322,-2.243814706802368,0.0,0.0,0.0,0.040354370807917525,0.9991854240819215,4.127910008295649,-6.572347988449048,0.729997656877766,0.0,0.0,0.0,1.0
1717757292.6644032,map,True,False,6,4,0.0,0.0,2.0275156497955322,-2.243814706802368,0.0,0.0,0.0,0.040354370807917525,0.9991854240819215,4.127910008295649,-6.572347988449048,0.729997656877766,0.0,0.0,0.0,1.0
1717757292.6678553,map,True,False,6,4,0.0,0.0,2.0275156497955322,-2.243814706802368,0.0,0.0,0.0,0.040354370807917525,0.9991854240819215,4.127910008295649,-6.572347988449048,0.729997656877766,0.0,0.0,0.0,1.0
1717757292.6765609,map,True,False,6,4,0.0,0.0,2.0275156497955322,-2.243814706802368,0.0,0.0,0.0,0.040354370807917525,0.9991854240819215,4.127910008295649,-6.572347988449048,0.729997656877766,0.0,0.0,0.0,1.0
1717757292.6790304,map,True,False,6,4,0.0,0.0,2.0275156497955322,-2.243814706802368,0.0,0.0,0.0,0.040354370807917525,0.9991854240819215,4.127910008295649,-6.572347988449048,0.729997656877766,0.0,0.0,0.0,1.0
1717757292.699606,map,True,False,6,4,0.0,0.0,2.0275156497955322,-2.243814706802368,0.0,0.0,0.0,0.040354370807917525,0.9991854240819215,4.127910008295649,-6.572347988449048,0.729997656877766,0.0,0.0,0.0,1.0
1717757292.711705,map,True,False,6,4,0.0,0.0,2.0275156497955322,-2.243814706802368,0.0,0.0,0.0,0.040354370807917525,0.9991854240819215,4.127910008295649,-6.572347988449048,0.729997656877766,0.0,0.0,0.0,1.0
1717757292.7157302,map,True,False,6,4,0.0,0.0,2.0275156497955322,-2.243814706802368,0.0,0.0,0.0,0.040354370807917525,0.9991854240819215,4.127910008295649,-6.572347988449048,0.729997656877766,0.0,0.0,0.0,1.0
1717757292.7189553,map,True,False,6,4,0.0,0.0,2.0275156497955322,-2.243814706802368,0.0,0.0,0.0,0.040354370807917525,0.9991854240819215,4.127910008295649,-6.572347988449048,0.729997656877766,0.0,0.0,0.0,1.0
1717757292.7236028,map,True,False,6,4,0.0,0.0,2.0275156497955322,-2.243814706802368,0.0,0.0,0.0,0.040354370807917525,0.9991854240819215,4.127910008295649,-6.572347988449048,0.729997656877766,0.0,0.0,0.0,1.0
1717757292.7406218,map,True,False,6,4,0.0,0.0,2.0275156497955322,-2.243814706802368,0.0,0.0,0.0,0.040354370807917525,0.9991854240819215,4.127910008295649,-6.572347988449048,0.729997656877766,0.0,0.0,0.0,1.0
1717757292.7431664,map,True,False,6,4,0.0,0.0,2.0275156497955322,-2.243814706802368,0.0,0.0,0.0,0.040354370807917525,0.9991854240819215,4.127910008295649,-6.572347988449048,0.729997656877766,0.0,0.0,0.0,1.0
1717757292.751836,map,True,False,6,4,0.0,0.0,2.0275156497955322,-2.243814706802368,0.0,0.0,0.0,0.040354370807917525,0.9991854240819215,4.127910008295649,-6.572347988449048,0.729997656877766,0.0,0.0,0.0,1.0
1717757292.767689,map,True,False,6,4,0.0,0.0,2.0275156497955322,-2.243814706802368,0.0,0.0,0.0,0.040354370807917525,0.9991854240819215,4.127910008295649,-6.572347988449048,0.729997656877766,0.0,0.0,0.0,1.0
1717757292.9181335,map,True,False,6,4,0.0,0.0,2.0275156497955322,-2.243814706802368,0.0,0.0,0.0,0.040354370807917525,0.9991854240819215,4.223756918481223,-6.392801208400161,0.7214912629930946,0.0,0.0,0.0,1.0
1717757292.969925,map,True,False,6,4,0.0,0.0,2.0275156497955322,-2.243814706802368,0.0,0.0,0.0,0.040354370807917525,0.9991854240819215,4.223756918481223,-6.392801208400161,0.7214912629930946,0.0,0.0,0.0,1.0
1717757293.0196104,map,True,False,6,4,0.0,0.0,2.132100820541382,-2.2582993507385254,0.0,0.0,0.0,0.04369099561032604,0.999045094901338,4.223756918481223,-6.392801208400161,0.7214912629930946,0.0,0.0,0.0,1.0
1717757293.0474422,map,True,False,6,4,0.0,0.0,2.132100820541382,-2.2582993507385254,0.0,0.0,0.0,0.04369099561032604,0.999045094901338,4.223756918481223,-6.392801208400161,0.7214912629930946,0.0,0.0,0.0,1.0
1717757293.0798373,map,True,False,6,4,0.0,0.0,2.132100820541382,-2.2582993507385254,0.0,0.0,0.0,0.04369099561032604,0.999045094901338,4.223756918481223,-6.392801208400161,0.7214912629930946,0.0,0.0,0.0,1.0
1717757293.1073682,map,True,False,6,4,0.0,0.0,2.132100820541382,-2.2582993507385254,0.0,0.0,0.0,0.04369099561032604,0.999045094901338,4.223756918481223,-6.392801208400161,0.7214912629930946,0.0,0.0,0.0,1.0
1717757293.1190822,map,True,False,6,4,0.0,0.0,2.132100820541382,-2.2582993507385254,0.0,0.0,0.0,0.04369099561032604,0.999045094901338,4.223756918481223,-6.392801208400161,0.7214912629930946,0.0,0.0,0.0,1.0
1717757293.1233964,map,True,False,6,4,0.0,0.0,2.132100820541382,-2.2582993507385254,0.0,0.0,0.0,0.04369099561032604,0.999045094901338,4.223756918481223,-6.392801208400161,0.7214912629930946,0.0,0.0,0.0,1.0
1717757293.1279852,map,True,False,6,4,0.0,0.0,2.132100820541382,-2.2582993507385254,0.0,0.0,0.0,0.04369099561032604,0.999045094901338,4.223756918481223,-6.392801208400161,0.7214912629930946,0.0,0.0,0.0,1.0
1717757293.1319556,map,True,False,6,4,0.0,0.0,2.132100820541382,-2.2582993507385254,0.0,0.0,0.0,0.04369099561032604,0.999045094901338,4.223756918481223,-6.392801208400161,0.7214912629930946,0.0,0.0,0.0,1.0
1717757293.1358657,map,True,False,6,4,0.0,0.0,2.132100820541382,-2.2582993507385254,0.0,0.0,0.0,0.04369099561032604,0.999045094901338,4.223756918481223,-6.392801208400161,0.7214912629930946,0.0,0.0,0.0,1.0
1717757293.1400034,map,True,False,6,4,0.0,0.0,2.132100820541382,-2.2582993507385254,0.0,0.0,0.0,0.04369099561032604,0.999045094901338,4.223756918481223,-6.392801208400161,0.7214912629930946,0.0,0.0,0.0,1.0
1717757293.1430392,map,True,False,6,4,0.0,0.0,2.132100820541382,-2.2582993507385254,0.0,0.0,0.0,0.04369099561032604,0.999045094901338,4.223756918481223,-6.392801208400161,0.7214912629930946,0.0,0.0,0.0,1.0
1717757293.147224,map,True,False,6,4,0.0,0.0,2.132100820541382,-2.2582993507385254,0.0,0.0,0.0,0.04369099561032604,0.999045094901338,4.223756918481223,-6.392801208400161,0.7214912629930946,0.0,0.0,0.0,1.0
1717757293.1515749,map,True,False,6,4,0.0,0.0,2.132100820541382,-2.2582993507385254,0.0,0.0,0.0,0.04369099561032604,0.999045094901338,4.223756918481223,-6.392801208400161,0.7214912629930946,0.0,0.0,0.0,1.0
1717757293.15462,map,True,False,6,4,0.0,0.0,2.132100820541382,-2.2582993507385254,0.0,0.0,0.0,0.04369099561032604,0.999045094901338,4.223756918481223,-6.392801208400161,0.7214912629930946,0.0,0.0,0.0,1.0
1717757293.1697528,map,True,False,6,4,0.0,0.0,2.132100820541382,-2.2582993507385254,0.0,0.0,0.0,0.04369099561032604,0.999045094901338,4.223756918481223,-6.392801208400161,0.7214912629930946,0.0,0.0,0.0,1.0
1717757293.1729534,map,True,False,6,4,0.0,0.0,2.132100820541382,-2.2582993507385254,0.0,0.0,0.0,0.04369099561032604,0.999045094901338,4.223756918481223,-6.392801208400161,0.7214912629930946,0.0,0.0,0.0,1.0
1717757293.2737024,map,True,False,6,4,0.0,0.0,2.132100820541382,-2.2582993507385254,0.0,0.0,0.0,0.04369099561032604,0.999045094901338,4.293659611587582,-6.215577522451466,0.7068276170201695,0.0,0.0,0.0,1.0
1717757293.3726478,map,True,False,6,4,0.0,0.0,2.132100820541382,-2.2582993507385254,0.0,0.0,0.0,0.04369099561032604,0.999045094901338,4.293659611587582,-6.215577522451466,0.7068276170201695,0.0,0.0,0.0,1.0
1717757293.4219363,map,True,False,6,4,0.0,0.0,2.132100820541382,-2.2582993507385254,0.0,0.0,0.0,0.04369099561032604,0.999045094901338,4.293659611587582,-6.215577522451466,0.7068276170201695,0.0,0.0,0.0,1.0
1717757293.473373,map,True,False,6,4,0.0,0.0,2.132100820541382,-2.2582993507385254,0.0,0.0,0.0,0.04369099561032604,0.999045094901338,4.293659611587582,-6.215577522451466,0.7068276170201695,0.0,0.0,0.0,1.0
1717757293.5723727,map,True,False,6,3,0.0,0.0,2.132100820541382,-2.2582993507385254,0.0,0.0,0.0,0.04369099561032604,0.999045094901338,4.292703640785067,-5.751102899682394,0.7151508364110596,0.0,0.0,0.0,1.0
1717757293.622537,map,True,False,5,3,0.0,0.0,2.2163989543914795,-2.2726385593414307,0.0,0.0,0.0,0.045287945361939606,0.9989739757237317,4.292703640785067,-5.751102899682394,0.7151508364110596,0.0,0.0,0.0,1.0
1717757293.722108,map,True,False,5,3,0.0,0.0,2.2163989543914795,-2.2726385593414307,0.0,0.0,0.0,0.045287945361939606,0.9989739757237317,4.292703640785067,-5.751102899682394,0.7151508364110596,0.0,0.0,0.0,1.0
1717757293.772558,map,True,False,5,3,0.0,0.0,2.2163989543914795,-2.2726385593414307,0.0,0.0,0.0,0.045287945361939606,0.9989739757237317,4.292703640785067,-5.751102899682394,0.7151508364110596,0.0,0.0,0.0,1.0
1717757293.8733382,map,True,False,5,3,0.0,0.0,2.2163989543914795,-2.2726385593414307,0.0,0.0,0.0,0.045287945361939606,0.9989739757237317,4.329343749451077,-5.404978513154939,0.6960412370266245,0.0,0.0,0.0,1.0
1717757293.924333,map,True,False,5,3,0.0,0.0,2.2163989543914795,-2.2726385593414307,0.0,0.0,0.0,0.045287945361939606,0.9989739757237317,4.329343749451077,-5.404978513154939,0.6960412370266245,0.0,0.0,0.0,1.0
1717757293.977747,map,True,False,5,3,0.0,0.0,2.2163989543914795,-2.2726385593414307,0.0,0.0,0.0,0.045287945361939606,0.9989739757237317,4.329343749451077,-5.404978513154939,0.6960412370266245,0.0,0.0,0.0,1.0
1717757294.025947,map,True,False,5,3,0.0,0.0,2.2163989543914795,-2.2726385593414307,0.0,0.0,0.0,0.045287945361939606,0.9989739757237317,4.329343749451077,-5.404978513154939,0.6960412370266245,0.0,0.0,0.0,1.0
1717757294.124641,map,True,False,5,3,0.0,0.0,2.2163989543914795,-2.2726385593414307,0.0,0.0,0.0,0.045287945361939606,0.9989739757237317,4.329343749451077,-5.404978513154939,0.6960412370266245,0.0,0.0,0.0,1.0
1717757294.2245982,map,True,False,5,3,0.0,0.0,2.2163989543914795,-2.2726385593414307,0.0,0.0,0.0,0.045287945361939606,0.9989739757237317,4.4394964911501145,-5.247628996146451,0.7053149479805241,0.0,0.0,0.0,1.0
1717757294.3238463,map,True,False,5,3,0.0,0.0,2.372032403945923,-2.297513484954834,0.0,0.0,0.0,0.04325939206842869,0.9990638732184792,4.4394964911501145,-5.247628996146451,0.7053149479805241,0.0,0.0,0.0,1.0
1717757294.373977,map,True,False,5,3,0.0,0.0,2.372032403945923,-2.297513484954834,0.0,0.0,0.0,0.04325939206842869,0.9990638732184792,4.4394964911501145,-5.247628996146451,0.7053149479805241,0.0,0.0,0.0,1.0
1717757294.424152,map,True,False,5,3,0.0,0.0,2.372032403945923,-2.297513484954834,0.0,0.0,0.0,0.04325939206842869,0.9990638732184792,4.4394964911501145,-5.247628996146451,0.7053149479805241,0.0,0.0,0.0,1.0
1717757294.4749634,map,True,False,5,3,0.0,0.0,2.372032403945923,-2.297513484954834,0.0,0.0,0.0,0.04325939206842869,0.9990638732184792,4.4394964911501145,-5.247628996146451,0.7053149479805241,0.0,0.0,0.0,1.0
1717757294.574167,map,True,False,5,3,0.0,0.0,2.372032403945923,-2.297513484954834,0.0,0.0,0.0,0.04325939206842869,0.9990638732184792,4.4265414423999525,-4.867488404518321,0.7021939555332771,0.0,0.0,0.0,1.0
1717757294.624358,map,True,False,5,3,0.0,0.0,2.372032403945923,-2.297513484954834,0.0,0.0,0.0,0.04325939206842869,0.9990638732184792,4.4265414423999525,-4.867488404518321,0.7021939555332771,0.0,0.0,0.0,1.0
1717757294.7239382,map,True,False,5,3,0.0,0.0,2.372032403945923,-2.297513484954834,0.0,0.0,0.0,0.04325939206842869,0.9990638732184792,4.4265414423999525,-4.867488404518321,0.7021939555332771,0.0,0.0,0.0,1.0
1717757294.7745185,map,True,False,5,3,0.0,0.0,2.372032403945923,-2.297513484954834,0.0,0.0,0.0,0.04325939206842869,0.9990638732184792,4.4265414423999525,-4.867488404518321,0.7021939555332771,0.0,0.0,0.0,1.0
1717757294.8760622,map,True,False,5,2,0.0,0.0,2.4790360927581787,-2.314676523208618,0.0,0.0,0.0,0.04291459802725874,0.9990787434860827,4.455266201300622,-4.597703324902645,0.6792415972542206,0.0,0.0,0.0,1.0
1717757294.9263504,map,True,False,5,2,0.0,0.0,2.4790360927581787,-2.314676523208618,0.0,0.0,0.0,0.04291459802725874,0.9990787434860827,4.455266201300622,-4.597703324902645,0.6792415972542206,0.0,0.0,0.0,1.0
1717757294.9777696,map,True,False,5,2,0.0,0.0,2.4790360927581787,-2.314676523208618,0.0,0.0,0.0,0.04291459802725874,0.9990787434860827,4.455266201300622,-4.597703324902645,0.6792415972542206,0.0,0.0,0.0,1.0
1717757295.0759037,map,True,False,5,2,0.0,0.0,2.4790360927581787,-2.314676523208618,0.0,0.0,0.0,0.04291459802725874,0.9990787434860827,4.455266201300622,-4.597703324902645,0.6792415972542206,0.0,0.0,0.0,1.0
1717757295.1270666,map,True,False,5,2,0.0,0.0,2.4790360927581787,-2.314676523208618,0.0,0.0,0.0,0.04291459802725874,0.9990787434860827,4.455266201300622,-4.597703324902645,0.6792415972542206,0.0,0.0,0.0,1.0
1717757295.17681,map,True,False,5,2,0.0,0.0,2.4790360927581787,-2.314676523208618,0.0,0.0,0.0,0.04291459802725874,0.9990787434860827,4.5773194414172345,-4.431789724319906,0.7026802820407679,0.0,0.0,0.0,1.0
1717757295.2758873,map,True,False,5,2,0.0,0.0,2.4790360927581787,-2.314676523208618,0.0,0.0,0.0,0.04291459802725874,0.9990787434860827,4.595878511991469,-4.367771449370642,0.7099212395001219,0.0,0.0,0.0,1.0
1717757295.376048,map,True,False,5,2,0.0,0.0,2.502359628677368,-2.3172833919525146,0.0,0.0,0.0,0.042691035840274956,0.9990883188070526,4.595878511991469,-4.367771449370642,0.7099212395001219,0.0,0.0,0.0,1.0
1717757295.4266238,map,True,False,5,2,0.0,0.0,2.502359628677368,-2.3172833919525146,0.0,0.0,0.0,0.042691035840274956,0.9990883188070526,4.595878511991469,-4.367771449370642,0.7099212395001219,0.0,0.0,0.0,1.0
1717757295.4770727,map,True,False,5,2,0.0,0.0,2.502359628677368,-2.3172833919525146,0.0,0.0,0.0,0.042691035840274956,0.9990883188070526,4.595878511991469,-4.367771449370642,0.7099212395001219,0.0,0.0,0.0,1.0
1717757295.5273604,map,True,False,5,2,0.0,0.0,2.502359628677368,-2.3172833919525146,0.0,0.0,0.0,0.042691035840274956,0.9990883188070526,4.58289038050631,-4.083353241342056,0.6889718414011362,0.0,0.0,0.0,1.0
1717757295.5777109,map,True,False,5,2,0.0,0.0,2.502359628677368,-2.3172833919525146,0.0,0.0,0.0,0.042691035840274956,0.9990883188070526,4.58289038050631,-4.083353241342056,0.6889718414011362,0.0,0.0,0.0,1.0
1717757295.6765702,map,True,False,5,2,0.0,0.0,2.502359628677368,-2.3172833919525146,0.0,0.0,0.0,0.042691035840274956,0.9990883188070526,4.58289038050631,-4.083353241342056,0.6889718414011362,0.0,0.0,0.0,1.0
1717757295.7269478,map,True,False,5,2,0.0,0.0,2.502359628677368,-2.3172833919525146,0.0,0.0,0.0,0.042691035840274956,0.9990883188070526,4.58289038050631,-4.083353241342056,0.6889718414011362,0.0,0.0,0.0,1.0
1717757295.7774208,map,True,False,5,2,0.0,0.0,2.502359628677368,-2.3172833919525146,0.0,0.0,0.0,0.042691035840274956,0.9990883188070526,4.58289038050631,-4.083353241342056,0.6889718414011362,0.0,0.0,0.0,1.0
1717757295.9271452,map,True,False,4,2,0.0,0.0,2.6551501750946045,-2.336942434310913,0.0,0.0,0.0,0.042323843496848534,0.9991039493519006,4.679365728859278,-4.012102435830789,0.6817987691440316,0.0,0.0,0.0,1.0
1717757295.9780784,map,True,False,4,2,0.0,0.0,2.6551501750946045,-2.336942434310913,0.0,0.0,0.0,0.042323843496848534,0.9991039493519006,4.679365728859278,-4.012102435830789,0.6817987691440316,0.0,0.0,0.0,1.0
1717757296.0794306,map,True,False,4,2,0.0,0.0,2.6551501750946045,-2.336942434310913,0.0,0.0,0.0,0.042323843496848534,0.9991039493519006,4.679365728859278,-4.012102435830789,0.6817987691440316,0.0,0.0,0.0,1.0
1717757296.128202,map,True,False,4,2,0.0,0.0,2.6551501750946045,-2.336942434310913,0.0,0.0,0.0,0.042323843496848534,0.9991039493519006,4.679365728859278,-4.012102435830789,0.6817987691440316,0.0,0.0,0.0,1.0
1717757296.177802,map,True,False,4,2,0.0,0.0,2.6551501750946045,-2.336942434310913,0.0,0.0,0.0,0.042323843496848534,0.9991039493519006,4.644718097620371,-3.8984017912783786,0.6848354048988116,0.0,0.0,0.0,1.0
1717757296.2780948,map,True,False,4,2,0.0,0.0,2.6551501750946045,-2.336942434310913,0.0,0.0,0.0,0.042323843496848534,0.9991039493519006,4.636351860993656,-3.896988851997956,0.6817291214989217,0.0,0.0,0.0,1.0
1717757296.3289084,map,True,False,4,2,0.0,0.0,2.6551501750946045,-2.336942434310913,0.0,0.0,0.0,0.042323843496848534,0.9991039493519006,4.636351860993656,-3.896988851997956,0.6817291214989217,0.0,0.0,0.0,1.0
1717757296.3786983,map,True,False,4,2,0.0,0.0,2.6551501750946045,-2.336942434310913,0.0,0.0,0.0,0.042323843496848534,0.9991039493519006,4.636351860993656,-3.896988851997956,0.6817291214989217,0.0,0.0,0.0,1.0
1717757296.4289708,map,True,False,4,2,0.0,0.0,2.794607400894165,-2.371696949005127,0.0,0.0,0.0,0.04141044287775635,0.9991422192910336,4.636351860993656,-3.896988851997956,0.6817291214989217,0.0,0.0,0.0,1.0
1717757296.5292797,map,True,False,4,2,0.0,0.0,2.794607400894165,-2.371696949005127,0.0,0.0,0.0,0.04141044287775635,0.9991422192910336,4.632275899781831,-3.8654636694659112,0.684798859207246,0.0,0.0,0.0,1.0
1717757296.5795949,map,True,False,4,2,0.0,0.0,2.794607400894165,-2.371696949005127,0.0,0.0,0.0,0.04141044287775635,0.9991422192910336,4.632275899781831,-3.8654636694659112,0.684798859207246,0.0,0.0,0.0,1.0
1717757296.6312923,map,True,False,4,2,0.0,0.0,2.794607400894165,-2.371696949005127,0.0,0.0,0.0,0.04141044287775635,0.9991422192910336,4.632275899781831,-3.8654636694659112,0.684798859207246,0.0,0.0,0.0,1.0
1717757296.6815991,map,True,False,4,2,0.0,0.0,2.794607400894165,-2.371696949005127,0.0,0.0,0.0,0.04141044287775635,0.9991422192910336,4.632275899781831,-3.8654636694659112,0.684798859207246,0.0,0.0,0.0,1.0
1717757296.732426,map,True,False,4,2,0.0,0.0,2.794607400894165,-2.371696949005127,0.0,0.0,0.0,0.04141044287775635,0.9991422192910336,4.632275899781831,-3.8654636694659112,0.684798859207246,0.0,0.0,0.0,1.0
1717757296.8826735,map,True,False,4,2,0.0,0.0,2.794607400894165,-2.371696949005127,0.0,0.0,0.0,0.04141044287775635,0.9991422192910336,4.684457682955661,-3.855491198465142,0.6847399635065516,0.0,0.0,0.0,1.0
1717757296.9334028,map,True,False,4,2,0.0,0.0,2.880373001098633,-2.3840386867523193,0.0,0.0,0.0,0.04014542862641247,0.9991938500661012,4.684457682955661,-3.855491198465142,0.6847399635065516,0.0,0.0,0.0,1.0
1717757296.9843779,map,True,False,4,2,0.0,0.0,2.880373001098633,-2.3840386867523193,0.0,0.0,0.0,0.04014542862641247,0.9991938500661012,4.684457682955661,-3.855491198465142,0.6847399635065516,0.0,0.0,0.0,1.0
1717757297.0344024,map,True,False,4,2,0.0,0.0,2.880373001098633,-2.3840386867523193,0.0,0.0,0.0,0.04014542862641247,0.9991938500661012,4.684457682955661,-3.855491198465142,0.6847399635065516,0.0,0.0,0.0,1.0
1717757297.1388223,map,True,False,4,2,0.0,0.0,2.880373001098633,-2.3840386867523193,0.0,0.0,0.0,0.04014542862641247,0.9991938500661012,4.684457682955661,-3.855491198465142,0.6847399635065516,0.0,0.0,0.0,1.0
1717757297.1905684,map,True,False,4,2,0.0,0.0,2.880373001098633,-2.3840386867523193,0.0,0.0,0.0,0.04014542862641247,0.9991938500661012,4.707883805587979,-3.857077894008516,0.6847713438047693,0.0,0.0,0.0,1.0
1717757297.2858195,map,True,False,4,2,0.0,0.0,2.880373001098633,-2.3840386867523193,0.0,0.0,0.0,0.04014542862641247,0.9991938500661012,4.707883805587979,-3.857077894008516,0.6847713438047693,0.0,0.0,0.0,1.0
1717757297.3362763,map,True,False,4,2,0.0,0.0,2.880373001098633,-2.3840386867523193,0.0,0.0,0.0,0.04014542862641247,0.9991938500661012,4.707883805587979,-3.857077894008516,0.6847713438047693,0.0,0.0,0.0,1.0
1717757297.3865564,map,True,False,4,2,0.0,0.0,2.880373001098633,-2.3840386867523193,0.0,0.0,0.0,0.04014542862641247,0.9991938500661012,4.707883805587979,-3.857077894008516,0.6847713438047693,0.0,0.0,0.0,1.0
1717757297.4858508,map,True,False,4,2,0.0,0.0,2.880373001098633,-2.3840386867523193,0.0,0.0,0.0,0.04014542862641247,0.9991938500661012,4.707883805587979,-3.857077894008516,0.6847713438047693,0.0,0.0,0.0,1.0
1717757297.5366466,map,True,False,4,2,0.0,0.0,2.9955453872680664,-2.4031548500061035,0.0,0.0,0.0,0.04020963676941674,0.9991912700820325,4.68747649436369,-3.8512136751317056,0.6847964809776099,0.0,0.0,0.0,1.0
1717757297.587028,map,True,False,4,2,0.0,0.0,2.9955453872680664,-2.4031548500061035,0.0,0.0,0.0,0.04020963676941674,0.9991912700820325,4.68747649436369,-3.8512136751317056,0.6847964809776099,0.0,0.0,0.0,1.0
1717757297.6376195,map,True,False,4,2,0.0,0.0,2.9955453872680664,-2.4031548500061035,0.0,0.0,0.0,0.04020963676941674,0.9991912700820325,4.68747649436369,-3.8512136751317056,0.6847964809776099,0.0,0.0,0.0,1.0
1717757297.737023,map,True,False,4,2,0.0,0.0,2.9955453872680664,-2.4031548500061035,0.0,0.0,0.0,0.04020963676941674,0.9991912700820325,4.68747649436369,-3.8512136751317056,0.6847964809776099,0.0,0.0,0.0,1.0
1717757297.887865,map,True,False,4,2,0.0,0.0,2.9955453872680664,-2.4031548500061035,0.0,0.0,0.0,0.04020963676941674,0.9991912700820325,4.736768890970946,-3.8658490326102575,0.6848707105763228,0.0,0.0,0.0,1.0
1717757297.9392192,map,True,False,4,2,0.0,0.0,2.9955453872680664,-2.4031548500061035,0.0,0.0,0.0,0.04020963676941674,0.9991912700820325,4.736768890970946,-3.8658490326102575,0.6848707105763228,0.0,0.0,0.0,1.0
1717757297.9893756,map,True,False,4,2,0.0,0.0,2.9955453872680664,-2.4031548500061035,0.0,0.0,0.0,0.04020963676941674,0.9991912700820325,4.736768890970946,-3.8658490326102575,0.6848707105763228,0.0,0.0,0.0,1.0
1717757298.0400615,map,True,False,3,2,0.0,0.0,3.094928503036499,-2.4161858558654785,0.0,0.0,0.0,0.039174646642666046,0.9992323849890815,4.736768890970946,-3.8658490326102575,0.6848707105763228,0.0,0.0,0.0,1.0
1717757298.1394396,map,True,False,3,2,0.0,0.0,3.094928503036499,-2.4161858558654785,0.0,0.0,0.0,0.039174646642666046,0.9992323849890815,4.736768890970946,-3.8658490326102575,0.6848707105763228,0.0,0.0,0.0,1.0
1717757298.1887474,map,True,False,3,2,0.0,0.0,3.094928503036499,-2.4161858558654785,0.0,0.0,0.0,0.039174646642666046,0.9992323849890815,4.73687171754156,-3.853678812641326,0.6849058256648898,0.0,0.0,0.0,1.0
1717757298.2408278,map,True,False,3,2,0.0,0.0,3.094928503036499,-2.4161858558654785,0.0,0.0,0.0,0.039174646642666046,0.9992323849890815,4.73687171754156,-3.853678812641326,0.6849058256648898,0.0,0.0,0.0,1.0
1717757298.342592,map,True,False,3,2,0.0,0.0,3.094928503036499,-2.4161858558654785,0.0,0.0,0.0,0.039174646642666046,0.9992323849890815,4.73687171754156,-3.853678812641326,0.6849058256648898,0.0,0.0,0.0,1.0
1717757298.4412415,map,True,False,3,2,0.0,0.0,3.094928503036499,-2.4161858558654785,0.0,0.0,0.0,0.039174646642666046,0.9992323849890815,4.73687171754156,-3.853678812641326,0.6849058256648898,0.0,0.0,0.0,1.0
1717757298.490783,map,True,False,3,2,0.0,0.0,3.094928503036499,-2.4161858558654785,0.0,0.0,0.0,0.039174646642666046,0.9992323849890815,4.73687171754156,-3.853678812641326,0.6849058256648898,0.0,0.0,0.0,1.0
1717757298.5420003,map,True,False,3,2,0.0,0.0,3.094928503036499,-2.4161858558654785,0.0,0.0,0.0,0.039174646642666046,0.9992323849890815,4.722345489726784,-3.8734844673138924,0.6850452267949434,0.0,0.0,0.0,1.0
1717757298.6423042,map,True,False,3,2,0.0,0.0,3.1803674697875977,-2.424577236175537,0.0,0.0,0.0,0.040458191719587144,0.9991812334332437,4.722345489726784,-3.8734844673138924,0.6850452267949434,0.0,0.0,0.0,1.0
1717757298.7421198,map,True,False,3,2,0.0,0.0,3.1803674697875977,-2.424577236175537,0.0,0.0,0.0,0.040458191719587144,0.9991812334332437,4.722345489726784,-3.8734844673138924,0.6850452267949434,0.0,0.0,0.0,1.0
1717757298.9415028,map,True,False,3,2,0.0,0.0,3.1803674697875977,-2.424577236175537,0.0,0.0,0.0,0.040458191719587144,0.9991812334332437,4.73929522636505,-3.868307379553882,0.6850614651823377,0.0,0.0,0.0,1.0
1717757298.9922426,map,True,False,3,2,0.0,0.0,3.1803674697875977,-2.424577236175537,0.0,0.0,0.0,0.040458191719587144,0.9991812334332437,4.73929522636505,-3.868307379553882,0.6850614651823377,0.0,0.0,0.0,1.0
1717757299.0430696,map,True,False,3,2,0.0,0.0,3.1803674697875977,-2.424577236175537,0.0,0.0,0.0,0.040458191719587144,0.9991812334332437,4.73929522636505,-3.868307379553882,0.6850614651823377,0.0,0.0,0.0,1.0
1717757299.1416101,map,True,False,3,2,0.0,0.0,3.1803674697875977,-2.424577236175537,0.0,0.0,0.0,0.040458191719587144,0.9991812334332437,4.73929522636505,-3.868307379553882,0.6850614651823377,0.0,0.0,0.0,1.0
1717757299.1940758,map,True,False,3,2,0.0,0.0,3.1803674697875977,-2.424577236175537,0.0,0.0,0.0,0.040458191719587144,0.9991812334332437,4.774450737365558,-3.8808848285950024,0.6850960345869375,0.0,0.0,0.0,1.0
1717757299.2444575,map,True,False,3,2,0.0,0.0,3.3016128540039062,-2.4560446739196777,0.0,0.0,0.0,0.04007196344168449,0.9991968028720624,4.732297636822293,-3.886755163901145,0.6851933891458037,0.0,0.0,0.0,1.0
1717757299.2927914,map,True,False,3,2,0.0,0.0,3.3016128540039062,-2.4560446739196777,0.0,0.0,0.0,0.04007196344168449,0.9991968028720624,4.732297636822293,-3.886755163901145,0.6851933891458037,0.0,0.0,0.0,1.0
1717757299.3431926,map,True,False,3,2,0.0,0.0,3.3016128540039062,-2.4560446739196777,0.0,0.0,0.0,0.04007196344168449,0.9991968028720624,4.732297636822293,-3.886755163901145,0.6851933891458037,0.0,0.0,0.0,1.0
1717757299.393566,map,True,False,3,2,0.0,0.0,3.3016128540039062,-2.4560446739196777,0.0,0.0,0.0,0.04007196344168449,0.9991968028720624,4.732297636822293,-3.886755163901145,0.6851933891458037,0.0,0.0,0.0,1.0
1717757299.4933128,map,True,False,3,2,0.0,0.0,3.3016128540039062,-2.4560446739196777,0.0,0.0,0.0,0.04007196344168449,0.9991968028720624,4.732297636822293,-3.886755163901145,0.6851933891458037,0.0,0.0,0.0,1.0
1717757299.593053,map,True,False,3,2,0.0,0.0,3.3016128540039062,-2.4560446739196777,0.0,0.0,0.0,0.04007196344168449,0.9991968028720624,4.750401290007279,-3.874792258734598,0.685192344245684,0.0,0.0,0.0,1.0
1717757299.6935682,map,True,False,3,2,0.0,0.0,3.3016128540039062,-2.4560446739196777,0.0,0.0,0.0,0.04007196344168449,0.9991968028720624,4.750401290007279,-3.874792258734598,0.685192344245684,0.0,0.0,0.0,1.0
1717757299.7458394,map,True,False,3,2,0.0,0.0,3.3016128540039062,-2.4560446739196777,0.0,0.0,0.0,0.04007196344168449,0.9991968028720624,4.750401290007279,-3.874792258734598,0.685192344245684,0.0,0.0,0.0,1.0
1717757299.894744,map,True,False,3,2,0.0,0.0,3.386991024017334,-2.4743874073028564,0.0,0.0,0.0,0.04043342864354303,0.9991822326286522,4.738119254207282,-3.890008034107985,0.6829665395775999,0.0,0.0,0.0,1.0
1717757299.9449646,map,True,False,3,2,0.0,0.0,3.386991024017334,-2.4743874073028564,0.0,0.0,0.0,0.04043342864354303,0.9991822326286522,4.738119254207282,-3.890008034107985,0.6829665395775999,0.0,0.0,0.0,1.0
1717757299.996555,map,True,False,3,2,0.0,0.0,3.386991024017334,-2.4743874073028564,0.0,0.0,0.0,0.04043342864354303,0.9991822326286522,4.738119254207282,-3.890008034107985,0.6829665395775999,0.0,0.0,0.0,1.0
1717757300.0466976,map,True,False,3,2,0.0,0.0,3.386991024017334,-2.4743874073028564,0.0,0.0,0.0,0.04043342864354303,0.9991822326286522,4.738119254207282,-3.890008034107985,0.6829665395775999,0.0,0.0,0.0,1.0
1717757300.145609,map,True,False,3,2,0.0,0.0,3.386991024017334,-2.4743874073028564,0.0,0.0,0.0,0.04043342864354303,0.9991822326286522,4.738119254207282,-3.890008034107985,0.6829665395775999,0.0,0.0,0.0,1.0
1717757300.2466345,map,True,False,3,2,0.0,0.0,3.386991024017334,-2.4743874073028564,0.0,0.0,0.0,0.04043342864354303,0.9991822326286522,4.739926223375614,-3.882963315798163,0.6853350224852015,0.0,0.0,0.0,1.0
1717757300.2960663,map,True,False,3,2,0.0,0.0,3.386991024017334,-2.4743874073028564,0.0,0.0,0.0,0.04043342864354303,0.9991822326286522,4.739926223375614,-3.882963315798163,0.6853350224852015,0.0,0.0,0.0,1.0
1717757300.3949773,map,True,True,2,2,0.49874686716791977,0.49874686716791977,3.4784538745880127,-2.4864749908447266,0.0,0.0,0.0,0.04044719363868021,0.9991816808342965,4.739926223375614,-3.882963315798163,0.6853350224852015,0.0,0.0,0.0,1.0
1717757300.4458404,map,True,True,2,2,0.49874686716791977,0.49874686716791977,3.4784538745880127,-2.4864749908447266,0.0,0.0,0.0,0.04044719363868021,0.9991816808342965,4.739926223375614,-3.882963315798163,0.6853350224852015,0.0,0.0,0.0,1.0
1717757300.504239,map,True,False,2,2,0.49874686716791977,0.49874686716791977,3.4784538745880127,-2.4864749908447266,0.0,0.0,0.0,0.04044719363868021,0.9991816808342965,4.739926223375614,-3.882963315798163,0.6853350224852015,0.0,0.0,0.0,1.0
1717757300.596813,map,True,True,2,2,0.49874686716791977,0.49874686716791977,3.4784538745880127,-2.4864749908447266,0.0,0.0,0.0,0.04044719363868021,0.9991816808342965,4.796638731616183,-3.9118917610594997,0.6854113997197859,0.0,0.0,0.0,1.0
1717757300.6465905,map,True,True,2,2,0.49874686716791977,0.49874686716791977,3.4784538745880127,-2.4864749908447266,0.0,0.0,0.0,0.04044719363868021,0.9991816808342965,4.796638731616183,-3.9118917610594997,0.6854113997197859,0.0,0.0,0.0,1.0
1717757300.6972678,map,True,True,2,2,0.49874686716791977,0.49874686716791977,3.4784538745880127,-2.4864749908447266,0.0,0.0,0.0,0.04044719363868021,0.9991816808342965,4.796638731616183,-3.9118917610594997,0.6854113997197859,0.0,0.0,0.0,1.0
1717757300.7484727,map,True,False,2,2,0.49874686716791977,0.49874686716791977,3.4784538745880127,-2.4864749908447266,0.0,0.0,0.0,0.04044719363868021,0.9991816808342965,4.796638731616183,-3.9118917610594997,0.6854113997197859,0.0,0.0,0.0,1.0
1717757300.8988972,map,True,False,2,2,0.49874686716791977,0.49874686716791977,3.572451591491699,-2.5075833797454834,0.0,0.0,0.0,0.0407885009934558,0.9991677963949334,4.798799603963616,-3.8753480017013393,0.6852915809228951,0.0,0.0,0.0,1.0
1717757301.0001152,map,True,True,2,2,0.49874686716791977,0.49874686716791977,3.572451591491699,-2.5075833797454834,0.0,0.0,0.0,0.0407885009934558,0.9991677963949334,4.798799603963616,-3.8753480017013393,0.6852915809228951,0.0,0.0,0.0,1.0
1717757301.0979855,map,True,True,2,2,0.49874686716791977,0.49874686716791977,3.572451591491699,-2.5075833797454834,0.0,0.0,0.0,0.0407885009934558,0.9991677963949334,4.798799603963616,-3.8753480017013393,0.6852915809228951,0.0,0.0,0.0,1.0
1717757301.1481774,map,True,True,2,2,0.49874686716791977,0.49874686716791977,3.572451591491699,-2.5075833797454834,0.0,0.0,0.0,0.0407885009934558,0.9991677963949334,4.798799603963616,-3.8753480017013393,0.6852915809228951,0.0,0.0,0.0,1.0
1717757301.199046,map,True,True,2,2,0.49874686716791977,0.49874686716791977,3.572451591491699,-2.5075833797454834,0.0,0.0,0.0,0.0407885009934558,0.9991677963949334,4.826643321180886,-3.8908765927082265,0.6853344182004518,0.0,0.0,0.0,1.0
1717757301.2486272,map,True,True,2,2,0.49874686716791977,0.49874686716791977,3.572451591491699,-2.5075833797454834,0.0,0.0,0.0,0.0407885009934558,0.9991677963949334,4.826643321180886,-3.8908765927082265,0.6853344182004518,0.0,0.0,0.0,1.0
1717757301.2985842,map,True,False,2,2,0.49874686716791977,0.49874686716791977,3.572451591491699,-2.5075833797454834,0.0,0.0,0.0,0.0407885009934558,0.9991677963949334,4.826643321180886,-3.8908765927082265,0.6853344182004518,0.0,0.0,0.0,1.0
1717757301.3993793,map,True,True,2,2,0.49874686716791977,0.49874686716791977,3.6782824993133545,-2.525021553039551,0.0,0.0,0.0,0.0421302252468102,0.9991121224783701,4.826643321180886,-3.8908765927082265,0.6853344182004518,0.0,0.0,0.0,1.0
1717757301.449406,map,True,True,2,2,0.49874686716791977,0.49874686716791977,3.6782824993133545,-2.525021553039551,0.0,0.0,0.0,0.0421302252468102,0.9991121224783701,4.826643321180886,-3.8908765927082265,0.6853344182004518,0.0,0.0,0.0,1.0
1717757301.5009782,map,True,False,2,2,0.49874686716791977,0.49874686716791977,3.6782824993133545,-2.525021553039551,0.0,0.0,0.0,0.0421302252468102,0.9991121224783701,4.826643321180886,-3.8908765927082265,0.6853344182004518,0.0,0.0,0.0,1.0
1717757301.5492642,map,True,False,2,2,0.49874686716791977,0.49874686716791977,3.6782824993133545,-2.525021553039551,0.0,0.0,0.0,0.0421302252468102,0.9991121224783701,4.867539734505491,-3.928482030860065,0.6854398968414497,0.0,0.0,0.0,1.0
1717757301.6489747,map,True,False,2,2,0.49874686716791977,0.49874686716791977,3.6782824993133545,-2.525021553039551,0.0,0.0,0.0,0.0421302252468102,0.9991121224783701,4.867539734505491,-3.928482030860065,0.6854398968414497,0.0,0.0,0.0,1.0
1717757301.7006338,map,True,False,2,2,0.49874686716791977,0.49874686716791977,3.6782824993133545,-2.525021553039551,0.0,0.0,0.0,0.0421302252468102,0.9991121224783701,4.867539734505491,-3.928482030860065,0.6854398968414497,0.0,0.0,0.0,1.0
1717757301.749361,map,True,False,2,2,0.49874686716791977,0.49874686716791977,3.6782824993133545,-2.525021553039551,0.0,0.0,0.0,0.0421302252468102,0.9991121224783701,4.867539734505491,-3.928482030860065,0.6854398968414497,0.0,0.0,0.0,1.0
1717757301.9003518,map,True,False,2,2,0.49874686716791977,0.49874686716791977,3.7591426372528076,-2.565013885498047,0.0,0.0,0.0,0.04366809780194418,0.9990460942329054,4.881067093178141,-3.912136369847575,0.68542856957662,0.0,0.0,0.0,1.0
1717757301.9495173,map,True,True,2,2,0.49874686716791977,0.49874686716791977,3.7591426372528076,-2.565013885498047,0.0,0.0,0.0,0.04366809780194418,0.9990460942329054,4.881067093178141,-3.912136369847575,0.68542856957662,0.0,0.0,0.0,1.0
1717757302.0005403,map,True,True,2,2,0.49874686716791977,0.49874686716791977,3.7591426372528076,-2.565013885498047,0.0,0.0,0.0,0.04366809780194418,0.9990460942329054,4.881067093178141,-3.912136369847575,0.68542856957662,0.0,0.0,0.0,1.0
1717757302.0508122,map,True,True,2,2,0.49874686716791977,0.49874686716791977,3.7591426372528076,-2.565013885498047,0.0,0.0,0.0,0.04366809780194418,0.9990460942329054,4.881067093178141,-3.912136369847575,0.68542856957662,0.0,0.0,0.0,1.0
1717757302.1496375,map,True,False,2,2,0.49874686716791977,0.49874686716791977,3.7591426372528076,-2.565013885498047,0.0,0.0,0.0,0.04366809780194418,0.9990460942329054,4.881067093178141,-3.912136369847575,0.68542856957662,0.0,0.0,0.0,1.0
1717757302.2495546,map,True,True,2,2,0.49874686716791977,0.49874686716791977,3.7591426372528076,-2.565013885498047,0.0,0.0,0.0,0.04366809780194418,0.9990460942329054,4.946063874057912,-3.976584283372528,0.6833745550256181,0.0,0.0,0.0,1.0
1717757302.3497593,map,True,False,2,2,0.49874686716791977,0.49874686716791977,3.7591426372528076,-2.565013885498047,0.0,0.0,0.0,0.04366809780194418,0.9990460942329054,4.946063874057912,-3.976584283372528,0.6833745550256181,0.0,0.0,0.0,1.0
1717757302.3993618,map,True,False,2,2,0.49874686716791977,0.49874686716791977,3.7591426372528076,-2.565013885498047,0.0,0.0,0.0,0.04366809780194418,0.9990460942329054,4.946063874057912,-3.976584283372528,0.6833745550256181,0.0,0.0,0.0,1.0
1717757302.4499736,map,True,True,2,2,0.49874686716791977,0.49874686716791977,3.7591426372528076,-2.565013885498047,0.0,0.0,0.0,0.04366809780194418,0.9990460942329054,4.946063874057912,-3.976584283372528,0.6833745550256181,0.0,0.0,0.0,1.0
1717757302.5499582,map,True,False,2,2,0.49874686716791977,0.49874686716791977,3.8069984912872314,-2.5891966819763184,0.0,0.0,0.0,0.04415741185398147,0.9990245860103445,4.981604820707249,-4.017135544829333,0.6856892129776178,0.0,0.0,0.0,1.0
1717757302.6500516,map,True,False,2,2,0.49874686716791977,0.49874686716791977,3.8069984912872314,-2.5891966819763184,0.0,0.0,0.0,0.04415741185398147,0.9990245860103445,4.981604820707249,-4.017135544829333,0.6856892129776178,0.0,0.0,0.0,1.0
1717757302.7012033,map,True,True,2,2,0.49874686716791977,0.49874686716791977,3.8069984912872314,-2.5891966819763184,0.0,0.0,0.0,0.04415741185398147,0.9990245860103445,4.981604820707249,-4.017135544829333,0.6856892129776178,0.0,0.0,0.0,1.0
1717757302.8497505,map,True,False,2,2,0.49874686716791977,0.49874686716791977,3.8069984912872314,-2.5891966819763184,0.0,0.0,0.0,0.04415741185398147,0.9990245860103445,4.995432709485628,-4.0443297935672335,0.6857183208579265,0.0,0.0,0.0,1.0
1717757302.949266,map,True,True,2,2,0.49874686716791977,0.49874686716791977,3.8069984912872314,-2.5891966819763184,0.0,0.0,0.0,0.04415741185398147,0.9990245860103445,4.99930203286203,-4.076660966409201,0.6858377807007552,0.0,0.0,0.0,1.0
1717757303.0003502,map,True,True,2,2,0.49874686716791977,0.49874686716791977,3.8069984912872314,-2.5891966819763184,0.0,0.0,0.0,0.04415741185398147,0.9990245860103445,4.99930203286203,-4.076660966409201,0.6858377807007552,0.0,0.0,0.0,1.0
1717757303.099503,map,True,False,1,2,0.0,0.0,3.888758897781372,-2.6000821590423584,0.0,0.0,0.0,0.04276358350788556,0.9990852165324269,4.99930203286203,-4.076660966409201,0.6858377807007552,0.0,0.0,0.0,1.0
1717757303.1492589,map,True,False,1,2,0.0,0.0,3.888758897781372,-2.6000821590423584,0.0,0.0,0.0,0.04276358350788556,0.9990852165324269,4.99930203286203,-4.076660966409201,0.6858377807007552,0.0,0.0,0.0,1.0
1717757303.2493408,map,True,False,1,2,0.0,0.0,3.888758897781372,-2.6000821590423584,0.0,0.0,0.0,0.04276358350788556,0.9990852165324269,4.99930203286203,-4.076660966409201,0.6858377807007552,0.0,0.0,0.0,1.0
1717757303.2996602,map,True,False,1,2,0.0,0.0,3.888758897781372,-2.6000821590423584,0.0,0.0,0.0,0.04276358350788556,0.9990852165324269,4.99930203286203,-4.076660966409201,0.6858377807007552,0.0,0.0,0.0,1.0
1717757303.4008598,map,True,False,1,2,0.0,0.0,3.888758897781372,-2.6000821590423584,0.0,0.0,0.0,0.04276358350788556,0.9990852165324269,4.99930203286203,-4.076660966409201,0.6858377807007552,0.0,0.0,0.0,1.0
1717757303.450967,map,True,False,1,2,0.0,0.0,3.888758897781372,-2.6000821590423584,0.0,0.0,0.0,0.04276358350788556,0.9990852165324269,4.99930203286203,-4.076660966409201,0.6858377807007552,0.0,0.0,0.0,1.0
1717757303.5499954,map,True,False,1,2,0.0,0.0,3.888758897781372,-2.6000821590423584,0.0,0.0,0.0,0.04276358350788556,0.9990852165324269,4.99930203286203,-4.076660966409201,0.6858377807007552,0.0,0.0,0.0,1.0
1717757303.6513264,map,True,False,1,2,0.0,0.0,3.888758897781372,-2.6000821590423584,0.0,0.0,0.0,0.04276358350788556,0.9990852165324269,4.99930203286203,-4.076660966409201,0.6858377807007552,0.0,0.0,0.0,1.0
1717757303.700041,map,True,False,1,2,0.0,0.0,3.888758897781372,-2.6000821590423584,0.0,0.0,0.0,0.04276358350788556,0.9990852165324269,4.99930203286203,-4.076660966409201,0.6858377807007552,0.0,0.0,0.0,1.0
1717757303.7503076,map,True,False,1,2,0.0,0.0,3.888758897781372,-2.6000821590423584,0.0,0.0,0.0,0.04276358350788556,0.9990852165324269,4.99930203286203,-4.076660966409201,0.6858377807007552,0.0,0.0,0.0,1.0
