car_pos_meter , car_pos_cell, car_speed, ped_pos_meter, ped_pos_cell, ped_speed
-10.25, 10, 2, 4.093744, 11, 1
-10.20835, 10, 2, 4.077091, 11, 1
-10.1667, 10, 1, 4.061112, 10, 1
-10.16095, 10, 2, 4.044727, 10, 1
-10.1193, 10, 2, 4.036509, 10, 1
-10.07765, 10, 2, 4.020768, 10, 1
-10.036, 10, 1, 4.005938, 10, 1
-10.03025, 10, 1, 3.991426, 10, 1
-10.0245, 10, 2, 3.977539, 10, 1
-9.982852, 9, 2, 3.970424, 10, 1
-9.941202, 9, 2, 3.956226, 10, 1
-9.899552, 9, 2, 3.942713, 10, 1
-9.857903, 9, 2, 3.930095, 10, 1
-9.816253, 9, 2, 3.918403, 10, 1
-9.774603, 9, 2, 3.91292, 10, 1
-9.732953, 9, 2, 3.902483, 10, 1
-9.691303, 9, 2, 3.892937, 10, 1
-9.649653, 9, 2, 3.883617, 10, 1
-9.608004, 9, 2, 3.873647, 10, 1
-9.566354, 9, 2, 3.868303, 10, 1
-9.524704, 9, 2, 3.857604, 10, 1
-9.483054, 9, 2, 3.846352, 10, 1
-9.441404, 9, 2, 3.834546, 10, 1
-9.399755, 9, 2, 3.822483, 10, 1
-9.358105, 9, 2, 3.816337, 10, 1
-9.316455, 9, 2, 3.80362, 10, 1
-9.274805, 9, 2, 3.79069, 10, 1
-9.233155, 9, 2, 3.777484, 10, 1
-9.191505, 9, 2, 3.764212, 10, 1
-9.149856, 9, 2, 3.75771, 10, 1
-9.108206, 9, 2, 3.744736, 10, 1
-9.066556, 9, 2, 3.731205, 10, 1
-9.024906, 9, 2, 3.717948, 10, 1
-8.983256, 8, 2, 3.704882, 10, 1
-8.941607, 8, 2, 3.698248, 9, 1
-8.899957, 8, 2, 3.685178, 9, 1
-8.858307, 8, 2, 3.671356, 9, 1
-8.816657, 8, 2, 3.657938, 9, 1
-8.775007, 8, 2, 3.643717, 9, 1
-8.733357, 8, 2, 3.636395, 9, 1
-8.691708, 8, 2, 3.621939, 9, 1
-8.650058, 8, 2, 3.608466, 9, 1
-8.608408, 8, 2, 3.594636, 9, 1
-8.566758, 8, 2, 3.581299, 9, 1
-8.525108, 8, 2, 3.574657, 9, 1
-8.483459, 8, 2, 3.561282, 9, 1
-8.441809, 8, 2, 3.548316, 9, 1
-8.400159, 8, 2, 3.536071, 9, 1
-8.358509, 8, 2, 3.524336, 9, 1
-8.316859, 8, 2, 3.518691, 9, 1
-8.275209, 8, 2, 3.507549, 9, 1
-8.23356, 8, 2, 3.49624, 9, 1
-8.19191, 8, 2, 3.485528, 9, 1
-8.15026, 8, 2, 3.475362, 9, 1
-8.10861, 8, 2, 3.470012, 9, 1
-8.06696, 8, 2, 3.459501, 9, 1
-8.025311, 8, 2, 3.448551, 9, 1
-7.983661, 7, 2, 3.437752, 9, 1
-7.942011, 7, 2, 3.426873, 9, 1
-7.900361, 7, 2, 3.421468, 9, 1
-7.858711, 7, 2, 3.410655, 9, 1
-7.817061, 7, 2, 3.399725, 9, 1
-7.775412, 7, 2, 3.388741, 9, 1
-7.733762, 7, 2, 3.377698, 9, 1
-7.692112, 7, 2, 3.372312, 9, 1
-7.650462, 7, 2, 3.361612, 9, 1
-7.608812, 7, 2, 3.351008, 9, 1
-7.567163, 7, 2, 3.340386, 9, 1
-7.525513, 7, 2, 3.330059, 8, 1
-7.483863, 7, 2, 3.325047, 8, 1
-7.442213, 7, 2, 3.315028, 8, 1
-7.400563, 7, 2, 3.304913, 8, 1
-7.358913, 7, 2, 3.294926, 8, 1
-7.317264, 7, 2, 3.285044, 8, 1
-7.275614, 7, 2, 3.279991, 8, 1
-7.233964, 7, 2, 3.270469, 8, 1
-7.192314, 7, 2, 3.260872, 8, 1
-7.150664, 7, 2, 3.250895, 8, 1
-7.109015, 7, 2, 3.24134, 8, 1
-7.067365, 7, 2, 3.232252, 8, 1
-7.025715, 7, 2, 3.227449, 8, 1
-6.984065, 6, 2, 3.217871, 8, 1
-6.942415, 6, 2, 3.208419, 8, 1
-6.900765, 6, 2, 3.198598, 8, 1
-6.859116, 6, 2, 3.193526, 8, 1
-6.817466, 6, 2, 3.183667, 8, 1
-6.775816, 6, 2, 3.174077, 8, 1
-6.734166, 6, 2, 3.165013, 8, 1
-6.692516, 6, 2, 3.156674, 8, 1
-6.650867, 6, 2, 3.152492, 8, 1
-6.609217, 6, 2, 3.144721, 8, 1
-6.567567, 6, 2, 3.137535, 8, 1
-6.525917, 6, 2, 3.131041, 8, 1
-6.484267, 6, 2, 3.124664, 8, 1
-6.442617, 6, 2, 3.118543, 8, 1
-6.400968, 6, 2, 3.115506, 8, 1
-6.359318, 6, 2, 3.109736, 8, 1
-6.317668, 6, 2, 3.103844, 8, 1
-6.276018, 6, 2, 3.098564, 8, 1
-6.234368, 6, 2, 3.093377, 8, 1
-6.192719, 6, 2, 3.090858, 8, 1
-6.151069, 6, 2, 3.086333, 8, 1
-6.109419, 6, 2, 3.082461, 8, 1
-6.067769, 6, 2, 3.079038, 8, 1
-6.026119, 6, 2, 3.077665, 8, 1
-5.984469, 5, 2, 3.07472, 8, 1
-5.94282, 5, 2, 3.071809, 8, 1
-5.90117, 5, 2, 3.068646, 8, 1
-5.85952, 5, 2, 3.067096, 8, 1
-5.81787, 5, 2, 3.06202, 8, 1
-5.77622, 5, 2, 3.05843, 8, 1
-5.734571, 5, 2, 3.056532, 8, 1
-5.692921, 5, 2, 3.052402, 8, 1
-5.651271, 5, 2, 3.048243, 8, 1
-5.609621, 5, 2, 3.044328, 8, 1
-5.567971, 5, 2, 3.040452, 8, 1
-5.526321, 5, 2, 3.038801, 8, 1
-5.484672, 5, 2, 3.035049, 8, 1
-5.443022, 5, 2, 3.031616, 8, 1
-5.401372, 5, 2, 3.028258, 8, 1
-5.359722, 5, 2, 3.026522, 8, 1
-5.318072, 5, 2, 3.023654, 8, 1
-5.276423, 5, 2, 3.020959, 8, 1
-5.234773, 5, 2, 3.018569, 8, 1
-5.193123, 5, 2, 3.016311, 8, 1
-5.151473, 5, 2, 3.015186, 8, 1
-5.109823, 5, 2, 3.013226, 8, 1
-5.068173, 5, 2, 3.011442, 8, 1
-5.026524, 5, 2, 3.009785, 8, 1
-4.984874, 4, 2, 3.008645, 8, 1
-4.943224, 4, 2, 3.008051, 8, 1
-4.901574, 4, 2, 3.007433, 8, 1
-4.859924, 4, 2, 3.00706, 8, 1
-4.818274, 4, 2, 3.0073, 8, 1
-4.776625, 4, 2, 3.007622, 8, 1
-4.734975, 4, 2, 3.008694, 8, 1
-4.693325, 4, 2, 3.009886, 8, 1
-4.651675, 4, 2, 3.011021, 8, 1
-4.610025, 4, 2, 3.012075, 8, 1
-4.568376, 4, 2, 3.012567, 8, 1
-4.526726, 4, 2, 3.013696, 8, 1
-4.485076, 4, 2, 3.015192, 8, 1
-4.443426, 4, 2, 3.016378, 8, 1
-4.401776, 4, 2, 3.017044, 8, 1
-4.360126, 4, 2, 3.017319, 8, 1
-4.318477, 4, 2, 3.018216, 8, 1
-4.276827, 4, 2, 3.018957, 8, 1
-4.235177, 4, 2, 3.019227, 8, 1
-4.193527, 4, 2, 3.019678, 8, 1
-4.151877, 4, 2, 3.019888, 8, 1
-4.110228, 4, 2, 3.019925, 8, 1
-4.068578, 4, 2, 3.020124, 8, 1
-4.026928, 4, 2, 3.020109, 8, 1
-3.985278, 3, 2, 3.020112, 8, 1
-3.943628, 3, 2, 3.019921, 8, 1
-3.901978, 3, 2, 3.019563, 8, 1
-3.860327, 3, 2, 3.019351, 8, 1
-3.818677, 3, 2, 3.018888, 8, 1
-3.777027, 3, 2, 3.018385, 8, 1
-3.735377, 3, 2, 3.01811, 8, 1
-3.693727, 3, 2, 3.017407, 8, 1
-3.652077, 3, 2, 3.016733, 8, 1
-3.610427, 3, 2, 3.015691, 8, 1
-3.568777, 3, 2, 3.014753, 8, 1
-3.527127, 3, 2, 3.014347, 8, 1
-3.485477, 3, 2, 3.01334, 8, 1
-3.443827, 3, 2, 3.012396, 8, 1
-3.402177, 3, 2, 3.011609, 8, 1
-3.360527, 3, 2, 3.010677, 8, 1
-3.318877, 3, 2, 3.010262, 8, 1
-3.277227, 3, 2, 3.009216, 8, 1
-3.235577, 3, 2, 3.00812, 8, 1
-3.193927, 3, 2, 3.007045, 8, 1
-3.152277, 3, 2, 3.006083, 8, 1
-3.110626, 3, 2, 3.005001, 8, 1
-3.068976, 3, 2, 3.004333, 8, 1
-3.027326, 3, 2, 3.003466, 8, 1
-2.985676, 2, 2, 3.002779, 8, 1
-2.944026, 2, 2, 3.002172, 8, 1
-2.902376, 2, 2, 3.001341, 8, 1
-2.860726, 2, 2, 3.000722, 8, 1
-2.819076, 2, 2, 2.999944, 8, 1
-2.777426, 2, 2, 2.999481, 8, 1
-2.735776, 2, 2, 2.998723, 8, 1
-2.694126, 2, 2, 2.998068, 8, 1
-2.652476, 2, 2, 2.997742, 8, 1
-2.610826, 2, 2, 2.997154, 8, 1
-2.569176, 2, 2, 2.996467, 8, 1
-2.527526, 2, 2, 2.995752, 8, 1
-2.485876, 2, 2, 2.994985, 8, 1
-2.444226, 2, 2, 2.994365, 8, 1
-2.402575, 2, 2, 2.99372, 8, 1
-2.360925, 2, 2, 2.992901, 8, 1
-2.319275, 2, 2, 2.992216, 8, 1
-2.277625, 2, 2, 2.991366, 8, 1
-2.235975, 2, 2, 2.990704, 8, 1
-2.194325, 2, 2, 2.990154, 8, 1
-2.152675, 2, 2, 2.989292, 8, 1
-2.111025, 2, 2, 2.988447, 8, 1
-2.069375, 2, 2, 2.987514, 8, 1
-2.027725, 2, 2, 2.98688, 8, 1
-1.986075, 1, 2, 2.985933, 8, 1
-1.944425, 1, 2, 2.984942, 8, 1
-1.902775, 1, 2, 2.983891, 8, 1
-1.861125, 1, 2, 2.982871, 8, 1
-1.819475, 1, 2, 2.982402, 8, 1
-1.777825, 1, 2, 2.981574, 8, 1
-1.736175, 1, 2, 2.980649, 8, 1
-1.694525, 1, 2, 2.97992, 8, 1
-1.652874, 1, 2, 2.979204, 8, 1
-1.611224, 1, 2, 2.978716, 8, 1
-1.569574, 1, 2, 2.978158, 8, 1
-1.527924, 1, 2, 2.977602, 8, 1
-1.486274, 1, 2, 2.977086, 8, 1
-1.444624, 1, 2, 2.976815, 8, 1
-1.402974, 1, 2, 2.976453, 8, 1
-1.361324, 1, 2, 2.975987, 8, 1
-1.319674, 1, 2, 2.975822, 8, 1
-1.278024, 1, 2, 2.975126, 8, 1
-1.236374, 1, 2, 2.974802, 8, 1
-1.194724, 1, 2, 2.974396, 8, 1
-1.153074, 1, 2, 2.973917, 8, 1
-1.111424, 1, 2, 2.973186, 8, 1
-1.069774, 1, 2, 2.972571, 8, 1
-1.028124, 1, 2, 2.972368, 8, 1
-0.9864736, 0, 2, 2.972199, 8, 1
-0.9448236, 0, 2, 2.971878, 8, 1
-0.9031736, 0, 2, 2.971303, 8, 1
-0.8615236, 0, 2, 2.970784, 8, 1
-0.8198736, 0, 2, 2.970515, 8, 1
-0.7782236, 0, 2, 2.970175, 8, 1
-0.7365736, 0, 2, 2.969856, 8, 1
-0.6949236, 0, 2, 2.969059, 8, 1
-0.6532736, 0, 2, 2.968092, 8, 1
-0.6116236, 0, 2, 2.967301, 8, 1
-0.5699736, 0, 2, 2.966644, 8, 1
-0.5283237, 0, 2, 2.965649, 8, 1
-0.4866737, 0, 2, 2.964428, 8, 1
-0.4450237, 0, 2, 2.963397, 8, 1
-0.4033737, 0, 2, 2.962255, 7, 1
-0.3617237, 0, 2, 2.961493, 7, 1
-0.3200737, 0, 2, 2.960515, 7, 1
-0.2784237, 0, 2, 2.959022, 7, 1
-0.2367737, 0, 2, 2.957438, 7, 1
-0.1951237, 0, 2, 2.955645, 7, 1
-0.1534737, 0, 2, 2.954652, 7, 1
-0.1118237, 0, 2, 2.952549, 7, 1
-0.07017368, 0, 2, 2.949651, 7, 1
-0.02852369, 0, 2, 2.946628, 7, 1
0.01312631, 0, 2, 2.942903, 7, 1
0.05477631, 0, 2, 2.940826, 7, 1
0.09642631, 0, 2, 2.936663, 7, 1
0.1380763, 0, 2, 2.931494, 7, 1
0.1797263, 0, 2, 2.925898, 7, 1
0.2213763, 0, 2, 2.919952, 7, 1
0.2630263, 0, 2, 2.916842, 7, 1
0.3046763, 0, 2, 2.910851, 7, 1
0.3463263, 0, 2, 2.904357, 7, 1
0.3879763, 0, 2, 2.897707, 7, 1
0.4296263, 0, 2, 2.891797, 7, 1
0.4712763, 0, 2, 2.888672, 7, 1
0.5129263, 0, 2, 2.882917, 7, 1
0.5545763, 0, 2, 2.876989, 7, 1
0.5962263, 0, 2, 2.871534, 7, 1
0.6378763, 0, 2, 2.866362, 7, 1
0.6795263, 0, 2, 2.863441, 7, 1
0.7211763, 0, 2, 2.858854, 7, 1
0.7628263, 0, 2, 2.853757, 7, 1
0.8044763, 0, 2, 2.849198, 7, 1
0.8461263, 0, 2, 2.844753, 7, 1
0.8877763, 0, 2, 2.842191, 7, 1
0.9294263, 0, 2, 2.837485, 7, 1
0.9710763, 0, 2, 2.832984, 7, 1
1.012726, -1, 2, 2.829252, 7, 1
1.054376, -1, 2, 2.825639, 7, 1
1.096026, -1, 2, 2.823744, 7, 1
1.137676, -1, 2, 2.820307, 7, 1
1.179327, -1, 2, 2.818753, 7, 1
1.220977, -1, 2, 2.81818, 7, 1
1.262627, -1, 2, 2.818552, 7, 1
1.304277, -1, 2, 2.819067, 7, 1
1.345927, -1, 2, 2.820527, 7, 1
1.387577, -1, 2, 2.821301, 7, 1
1.429227, -1, 2, 2.821887, 7, 1
1.470877, -1, 2, 2.821768, 7, 1
1.512527, -1, 2, 2.820769, 7, 1
1.554177, -1, 2, 2.81977, 7, 1
1.595827, -1, 2, 2.815999, 7, 1
1.637477, -1, 2, 2.811283, 7, 1
1.679127, -1, 2, 2.805873, 7, 1
1.720777, -1, 2, 2.802694, 7, 1
1.762427, -1, 2, 2.796802, 7, 1
1.804077, -1, 2, 2.790078, 7, 1
1.845727, -1, 2, 2.783612, 7, 1
1.887378, -1, 2, 2.777321, 7, 1
1.929028, -1, 2, 2.773983, 7, 1
1.970678, -1, 2, 2.767643, 7, 1
2.012328, -2, 2, 2.761094, 7, 1
2.053978, -2, 2, 2.753987, 7, 1
2.095628, -2, 2, 2.746814, 7, 1
2.137278, -2, 2, 2.743093, 7, 1
2.178928, -2, 2, 2.735222, 7, 1
2.220578, -2, 2, 2.726641, 7, 1
2.262228, -2, 2, 2.717765, 7, 1
2.303878, -2, 2, 2.708542, 7, 1
2.345528, -2, 2, 2.703467, 7, 1
2.387178, -2, 2, 2.693646, 7, 1
2.428828, -2, 2, 2.682739, 7, 1
2.470478, -2, 2, 2.671266, 7, 1
2.512128, -2, 2, 2.659293, 7, 1
2.553778, -2, 2, 2.653088, 7, 1
2.595428, -2, 2, 2.640634, 7, 1
2.637079, -2, 2, 2.627809, 7, 1
2.678729, -2, 2, 2.614785, 7, 1
2.720379, -2, 2, 2.601606, 7, 1
2.762029, -2, 2, 2.594568, 7, 1
2.803679, -2, 2, 2.580812, 6, 1
2.845329, -2, 2, 2.566665, 6, 1
2.886979, -2, 2, 2.552474, 6, 1
2.928629, -2, 2, 2.53713, 6, 1
2.970279, -2, 2, 2.529052, 6, 1
3.011929, -3, 2, 2.513088, 6, 1
3.053579, -3, 2, 2.496883, 6, 1
3.095229, -3, 2, 2.480074, 6, 1
3.136879, -3, 2, 2.471257, 6, 1
3.178529, -3, 2, 2.443551, 6, 1
3.220179, -3, 2, 2.434232, 6, 1
3.261829, -3, 2, 2.414757, 6, 1
3.303479, -3, 2, 2.394161, 6, 1
3.345129, -3, 2, 2.372937, 6, 1
3.38678, -3, 2, 2.351492, 6, 1
3.42843, -3, 2, 2.340672, 6, 1
3.47008, -3, 2, 2.319268, 6, 1
3.51173, -3, 2, 2.297552, 6, 1
3.55338, -3, 2, 2.276989, 6, 1
3.59503, -3, 2, 2.257685, 6, 1
3.63668, -3, 2, 2.24811, 6, 1
3.67833, -3, 2, 2.229676, 6, 1
3.71998, -3, 2, 2.210732, 5, 1
3.76163, -3, 2, 2.192083, 5, 1
3.80328, -3, 2, 2.172987, 5, 1
3.84493, -3, 2, 2.163681, 5, 1
3.88658, -3, 2, 2.143827, 5, 1
3.92823, -3, 2, 2.12447, 5, 1
3.96988, -3, 2, 2.104784, 5, 1
4.01153, -4, 2, 2.084948, 5, 1
4.05318, -4, 2, 2.075238, 5, 1
4.09483, -4, 2, 2.055427, 5, 1
4.13648, -4, 2, 2.035474, 5, 1
4.17813, -4, 2, 2.014894, 5, 1
4.219779, -4, 2, 2.004825, 5, 1
4.261429, -4, 2, 1.983691, 5, 1
4.303079, -4, 2, 1.962687, 5, 1
4.344729, -4, 2, 1.941658, 5, 1
4.386379, -4, 2, 1.920214, 5, 1
4.428029, -4, 2, 1.898872, 5, 1
4.469678, -4, 2, 1.88825, 5, 1
4.511328, -4, 2, 1.865663, 5, 1
4.552978, -4, 2, 1.843192, 4, 1
4.594628, -4, 2, 1.821087, 4, 1
4.636278, -4, 2, 1.798838, 4, 1
4.677927, -4, 2, 1.787866, 4, 1
4.719577, -4, 2, 1.765228, 4, 1
4.761227, -4, 2, 1.744116, 4, 1
4.802877, -4, 2, 1.722702, 4, 1
4.844527, -4, 2, 1.700746, 4, 1
4.886177, -4, 2, 1.68992, 4, 1
4.927826, -4, 2, 1.667177, 4, 1
4.969476, -4, 2, 1.645062, 4, 1
5.011126, -5, 2, 1.622382, 4, 1
5.052776, -5, 2, 1.610887, 4, 1
5.094426, -5, 2, 1.587268, 4, 1
5.136075, -5, 2, 1.563299, 4, 1
5.177725, -5, 2, 1.539373, 4, 1
5.219375, -5, 2, 1.51403, 4, 1
5.261025, -5, 2, 1.501016, 4, 1
5.302675, -5, 2, 1.475421, 3, 1
5.344325, -5, 2, 1.450518, 3, 1
5.385974, -5, 2, 1.426225, 3, 1
5.427624, -5, 2, 1.401354, 3, 1
5.469274, -5, 2, 1.377418, 3, 1
5.510924, -5, 2, 1.352194, 3, 1
5.552574, -5, 2, 1.328455, 3, 1
5.594223, -5, 2, 1.316525, 3, 1
5.635873, -5, 2, 1.291328, 3, 1
5.677523, -5, 2, 1.268092, 3, 1
5.719173, -5, 2, 1.240858, 3, 1
5.760823, -5, 2, 1.215379, 3, 1
5.802473, -5, 2, 1.202324, 3, 1
5.844122, -5, 2, 1.178574, 3, 1
5.885772, -5, 2, 1.154395, 3, 1
5.927422, -5, 2, 1.130191, 3, 1
5.969072, -5, 2, 1.108296, 2, 1
6.010722, -6, 2, 1.097193, 2, 1
6.052372, -6, 2, 1.07517, 2, 1
6.094021, -6, 2, 1.052577, 2, 1
6.135671, -6, 2, 1.029331, 2, 1
6.177321, -6, 2, 1.005688, 2, 1
6.218971, -6, 2, 0.9937313, 2, 1
6.260621, -6, 2, 0.9696808, 2, 1
6.30227, -6, 2, 0.945096, 2, 1
6.34392, -6, 2, 0.9205723, 2, 1
6.38557, -6, 2, 0.9081616, 2, 1
6.42722, -6, 2, 0.8829367, 2, 1
6.46887, -6, 2, 0.8575029, 2, 1
6.51052, -6, 2, 0.8320541, 2, 1
6.552169, -6, 2, 0.8195281, 2, 1
6.593819, -6, 2, 0.7944467, 2, 1
6.635469, -6, 2, 0.7686665, 2, 1
6.677119, -6, 2, 0.7430446, 2, 1
6.718769, -6, 2, 0.7189832, 1, 1
6.760418, -6, 2, 0.706701, 1, 1
6.802068, -6, 2, 0.6821399, 1, 1
6.843718, -6, 2, 0.6568198, 1, 1
6.885368, -6, 2, 0.6317079, 1, 1
6.927018, -6, 2, 0.6059933, 1, 1
6.968668, -6, 2, 0.5932, 1, 1
7.010317, -7, 2, 0.5680318, 1, 1
7.051967, -7, 2, 0.5426347, 1, 1
7.093617, -7, 2, 0.5182066, 1, 1
7.135267, -7, 2, 0.4937694, 1, 1
7.176917, -7, 2, 0.4815547, 1, 1
7.218566, -7, 2, 0.4578199, 1, 1
7.260216, -7, 2, 0.4336786, 1, 1
7.301866, -7, 2, 0.4092774, 1, 1
7.343516, -7, 2, 0.3843098, 1, 1
7.385166, -7, 2, 0.3718429, 1, 1
7.426816, -7, 2, 0.3468406, 0, 1
7.468465, -7, 2, 0.3212185, 0, 1
7.510115, -7, 2, 0.2960913, 0, 1
7.551765, -7, 2, 0.2708616, 0, 1
7.593415, -7, 2, 0.2580335, 0, 1
7.635065, -7, 2, 0.2452092, 0, 1
7.676714, -7, 2, 0.2452092, 0, 1
7.718364, -7, 2, 0.2452092, 0, 1
7.760014, -7, 2, 0.1686931, 0, 1
7.801664, -7, 2, 0.1423297, 0, 1
7.843314, -7, 2, 0.1037955, 0, 1
7.884964, -7, 2, 0.09118223, 0, 1
7.926613, -7, 2, 0.06522465, 0, 1
7.968263, -7, 2, 0.03987598, 0, 1
8.009913, -8, 2, 0.01553702, 0, 1
8.051563, -8, 2, -0.01037669, 0, 1
8.093213, -8, 2, -0.02303982, 0, 1
8.134863, -8, 2, -0.04734516, 0, 1
8.176513, -8, 2, -0.07122183, 0, 1
8.218163, -8, 2, -0.09520149, 0, 1
8.259812, -8, 2, -0.1066875, 0, 1
8.301462, -8, 2, -0.1293874, 0, 1
8.343112, -8, 2, -0.1519084, 0, 1
8.384762, -8, 2, -0.174257, 0, 1
8.426412, -8, 2, -0.1974607, 0, 1
8.468061, -8, 2, -0.2208772, 0, 1
8.509711, -8, 2, -0.2317529, 0, 1
8.551361, -8, 2, -0.2551637, 0, 1
8.593011, -8, 2, -0.2785895, 0, 1
8.634661, -8, 2, -0.301394, 0, 1
8.676311, -8, 2, -0.3243713, 0, 1
8.71796, -8, 2, -0.3359921, 0, 1
8.75961, -8, 2, -0.3594208, 0, 1
8.80126, -8, 2, -0.382405, -1, 1
8.84291, -8, 2, -0.4060721, -1, 1
8.88456, -8, 2, -0.4294868, -1, 1
8.926209, -8, 2, -0.4410558, -1, 1
8.967859, -8, 2, -0.4640443, -1, 1
9.009509, -9, 2, -0.4861593, -1, 1
9.051159, -9, 2, -0.5075893, -1, 1
9.092809, -9, 2, -0.5300956, -1, 1
9.134459, -9, 2, -0.5406857, -1, 1
9.176108, -9, 2, -0.5619273, -1, 1
9.217758, -9, 2, -0.5729349, -1, 1
9.259408, -9, 2, -0.5729349, -1, 1
9.301058, -9, 2, -0.605082, -1, 1
9.342708, -9, 2, -0.605082, -1, 1
9.384357, -9, 2, -0.605082, -1, 1
9.426007, -9, 2, -0.605082, -1, 1
9.467657, -9, 2, -0.6800869, -1, 1
9.509307, -9, 2, -0.6800869, -1, 1
9.550957, -9, 2, -0.6800869, -1, 1
9.592607, -9, 2, -0.6800869, -1, 1
9.634256, -9, 2, -0.6800869, -1, 1
9.675906, -9, 2, -0.8116155, -2, 1
9.717556, -9, 2, -0.8116155, -2, 1
9.759206, -9, 2, -0.8116155, -2, 1
9.800856, -9, 2, -0.8116155, -2, 1
9.842505, -9, 2, -0.8116155, -2, 1
9.884155, -9, 2, -0.9536996, -2, 1
9.925805, -9, 2, -0.9536996, -2, 1
9.967455, -9, 2, -0.9536996, -2, 1
10.0091, -10, 2, -0.9536996, -2, 1
10.05075, -10, 2, -0.9536996, -2, 1
10.0924, -10, 2, -1.080581, -2, 1
10.13405, -10, 2, -1.080581, -2, 1
10.1757, -10, 2, -1.101855, -2, 1
10.21735, -10, 2, -1.122143, -3, 1
10.259, -10, 2, -1.128462, -3, 1
10.30065, -10, 2, -1.141323, -3, 1
10.3423, -10, 2, -1.15308, -3, 1
10.38395, -10, 2, -1.164762, -3, 1
10.4256, -10, 2, -1.175635, -3, 1
10.46725, -10, 2, -1.180988, -3, 1
10.5089, -10, 2, -1.190911, -3, 1
10.55055, -10, 2, -1.200847, -3, 1
10.5922, -10, 2, -1.210305, -3, 1
10.63385, -10, 2, -1.219461, -3, 1
10.6755, -10, 2, -1.223595, -3, 1
10.71715, -10, 2, -1.231463, -3, 1
10.7588, -10, 2, -1.238097, -3, 1
10.80045, -10, 2, -1.244207, -3, 1
10.8421, -10, 2, -1.248868, -3, 1
10.88375, -10, 2, -1.25223, -3, 1
10.9254, -10, 2, -1.253325, -3, 1
10.96705, -10, 2, -1.255279, -3, 1
11.0087, -11, 2, -1.257164, -3, 1
11.05035, -11, 2, -1.258418, -3, 1
11.092, -11, 2, -1.259093, -3, 1
11.13365, -11, 2, -1.259841, -3, 1
11.1753, -11, 2, -1.260987, -3, 1
11.21695, -11, 2, -1.262364, -3, 1
11.2586, -11, 2, -1.264372, -3, 1
11.30025, -11, 2, -1.266087, -3, 1
11.3419, -11, 2, -1.26734, -3, 1
11.38355, -11, 2, -1.269258, -3, 1
11.4252, -11, 2, -1.271173, -3, 1
11.46685, -11, 2, -1.272841, -3, 1
11.5085, -11, 2, -1.27375, -3, 1
11.55015, -11, 2, -1.274281, -3, 1
11.5918, -11, 2, -1.274534, -3, 1
11.63345, -11, 2, -1.274912, -3, 1
11.6751, -11, 2, -1.2752, -3, 1
11.71675, -11, 2, -1.27586, -3, 1
11.7584, -11, 2, -1.276764, -3, 1
11.80005, -11, 2, -1.277706, -3, 1
11.8417, -11, 2, -1.278758, -3, 1
11.88335, -11, 2, -1.279284, -3, 1
11.925, -11, 2, -1.280321, -3, 1
11.96665, -11, 2, -1.282157, -3, 1
12.0083, -12, 2, -1.282869, -3, 1
12.04995, -12, 2, -1.282861, -3, 1
12.0916, -12, 2, -1.282825, -3, 1
12.13325, -12, 2, -1.28246, -3, 1
12.1749, -12, 2, -1.28251, -3, 1
12.21655, -12, 2, -1.283342, -3, 1
12.25819, -12, 2, -1.284781, -3, 1
12.29984, -12, 2, -1.285867, -3, 1
12.34149, -12, 2, -1.288382, -3, 1
12.38314, -12, 2, -1.291104, -3, 1
12.42479, -12, 2, -1.293927, -3, 1
12.46644, -12, 2, -1.295294, -3, 1
12.50809, -12, 2, -1.297775, -3, 1
12.54974, -12, 2, -1.299506, -3, 1
12.59139, -12, 2, -1.300615, -3, 1
12.63304, -12, 2, -1.30121, -3, 1
12.67469, -12, 2, -1.30148, -3, 1
12.71634, -12, 2, -1.301431, -3, 1
12.75799, -12, 2, -1.30121, -3, 1
12.79964, -12, 2, -1.300884, -3, 1
12.84129, -12, 2, -1.300503, -3, 1
12.88294, -12, 2, -1.30015, -3, 1
12.92459, -12, 2, -1.299932, -3, 1
12.96624, -12, 2, -1.299913, -3, 1
13.00789, -13, 2, -1.300292, -3, 1
13.04954, -13, 2, -1.301222, -3, 1
13.09119, -13, 2, -1.302758, -3, 1
13.13284, -13, 2, -1.302971, -3, 1
13.17449, -13, 2, -1.30388, -3, 1
13.21614, -13, 2, -1.304901, -3, 1
13.25779, -13, 2, -1.305214, -3, 1
13.29944, -13, 2, -1.304619, -3, 1
13.34109, -13, 2, -1.304116, -3, 1
13.38274, -13, 2, -1.30274, -3, 1
13.42439, -13, 2, -1.300166, -3, 1
13.46604, -13, 2, -1.297162, -3, 1
13.50769, -13, 2, -1.293083, -3, 1
13.54934, -13, 2, -1.291531, -3, 1
13.59099, -13, 2, -1.288829, -3, 1
13.63264, -13, 2, -1.286347, -3, 1
13.67429, -13, 2, -1.283905, -3, 1
13.71594, -13, 2, -1.281976, -3, 1
13.75759, -13, 2, -1.281287, -3, 1
13.79924, -13, 2, -1.280678, -3, 1
13.84089, -13, 2, -1.280307, -3, 1
13.88254, -13, 2, -1.280344, -3, 1
13.92419, -13, 2, -1.279843, -3, 1
13.96584, -13, 2, -1.279846, -3, 1
14.00749, -14, 2, -1.280499, -3, 1
14.04914, -14, 2, -1.281088, -3, 1
14.09079, -14, 2, -1.281201, -3, 1
14.13244, -14, 2, -1.281797, -3, 1
14.17409, -14, 2, -1.281859, -3, 1
14.21574, -14, 2, -1.281258, -3, 1
14.25739, -14, 2, -1.279658, -3, 1
14.29904, -14, 2, -1.277932, -3, 1
14.34069, -14, 2, -1.275783, -3, 1
14.38234, -14, 2, -1.274599, -3, 1
14.42399, -14, 2, -1.272158, -3, 1
14.46564, -14, 2, -1.26901, -3, 1
14.50729, -14, 2, -1.265014, -3, 1
14.54893, -14, 2, -1.262996, -3, 1
14.59058, -14, 2, -1.258532, -3, 1
14.63223, -14, 2, -1.254241, -3, 1
14.67388, -14, 2, -1.249895, -3, 1
14.71553, -14, 2, -1.247752, -3, 1
14.75718, -14, 2, -1.243221, -3, 1
14.79883, -14, 2, -1.238207, -3, 1
14.84048, -14, 2, -1.233849, -3, 1
14.88213, -14, 2, -1.231461, -3, 1
