timestamp_sec,frame_id,game_played,yielding,player1discrete,player2discrete,player1yieldprob,player2yieldprob,player1_pose_x,player1_pose_y,player1_pose_z,player1_pose_orient_x,player1_pose_orient_y,player1_pose_orient_z,player1_pose_orient_w,player2_pose_x,player2_pose_y,player2_pose_z,player2_pose_orient_x,player2_pose_orient_y,player2_pose_orient_z,player2_pose_orient_w
1718032102.356757,map,True,True,3,3,0.6616527499769684,0.6616527499769684,2.370983362197876,-1.7785100936889648,0.0,0.0,0.0,0.03540618408883824,0.9993730009916638,3.6872921263110174,-4.748988527072715,0.6957216431472637,0.0,0.0,0.0,1.0
1718032102.456952,map,True,False,3,3,0.6616527499769684,0.6616527499769684,2.370983362197876,-1.7785100936889648,0.0,0.0,0.0,0.03540618408883824,0.9993730009916638,3.6872921263110174,-4.748988527072715,0.6957216431472637,0.0,0.0,0.0,1.0
1718032102.5068705,map,True,False,3,3,0.6616527499769684,0.6616527499769684,2.370983362197876,-1.7785100936889648,0.0,0.0,0.0,0.03540618408883824,0.9993730009916638,3.6872921263110174,-4.748988527072715,0.6957216431472637,0.0,0.0,0.0,1.0
1718032102.6061378,map,True,True,3,3,0.6616527499769684,0.6616527499769684,2.370983362197876,-1.7785100936889648,0.0,0.0,0.0,0.03540618408883824,0.9993730009916638,3.6872921263110174,-4.748988527072715,0.6957216431472637,0.0,0.0,0.0,1.0
1718032102.7072184,map,True,False,3,3,0.6616527499769684,0.6616527499769684,2.370983362197876,-1.7785100936889648,0.0,0.0,0.0,0.03540618408883824,0.9993730009916638,3.7891200552273094,-4.492653200702924,0.7146158132718197,0.0,0.0,0.0,1.0
1718032102.757395,map,True,False,3,3,0.6616527499769684,0.6616527499769684,2.370983362197876,-1.7785100936889648,0.0,0.0,0.0,0.03540618408883824,0.9993730009916638,3.7891200552273094,-4.492653200702924,0.7146158132718197,0.0,0.0,0.0,1.0
1718032102.8073661,map,True,True,3,3,0.6616527499769684,0.6616527499769684,2.370983362197876,-1.7785100936889648,0.0,0.0,0.0,0.03540618408883824,0.9993730009916638,3.7891200552273094,-4.492653200702924,0.7146158132718197,0.0,0.0,0.0,1.0
1718032102.8598907,map,True,False,3,3,0.6616527499769684,0.6616527499769684,2.370983362197876,-1.7785100936889648,0.0,0.0,0.0,0.03540618408883824,0.9993730009916638,3.7891200552273094,-4.492653200702924,0.7146158132718197,0.0,0.0,0.0,1.0
1718032103.0572736,map,True,False,2,3,0.0,0.0,2.4726943969726562,-1.8079453706741333,0.0,0.0,0.0,0.03543604264676444,0.9993719423448881,3.8426683391507073,-4.336132401715793,0.7356912860937571,0.0,0.0,0.0,1.0
1718032103.1085603,map,True,False,2,3,0.0,0.0,2.4726943969726562,-1.8079453706741333,0.0,0.0,0.0,0.03543604264676444,0.9993719423448881,3.8426683391507073,-4.336132401715793,0.7356912860937571,0.0,0.0,0.0,1.0
1718032103.2128398,map,True,False,2,3,0.0,0.0,2.4726943969726562,-1.8079453706741333,0.0,0.0,0.0,0.03543604264676444,0.9993719423448881,3.8426683391507073,-4.336132401715793,0.7356912860937571,0.0,0.0,0.0,1.0
1718032103.2602236,map,True,False,2,3,0.0,0.0,2.4726943969726562,-1.8079453706741333,0.0,0.0,0.0,0.03543604264676444,0.9993719423448881,3.8426683391507073,-4.336132401715793,0.7356912860937571,0.0,0.0,0.0,1.0
1718032103.3611848,map,True,False,2,3,0.0,0.0,2.4726943969726562,-1.8079453706741333,0.0,0.0,0.0,0.03543604264676444,0.9993719423448881,3.821952540952055,-4.065016259367803,0.6509853216213348,0.0,0.0,0.0,1.0
1718032103.4107103,map,True,False,2,3,0.0,0.0,2.4726943969726562,-1.8079453706741333,0.0,0.0,0.0,0.03543604264676444,0.9993719423448881,3.821952540952055,-4.065016259367803,0.6509853216213348,0.0,0.0,0.0,1.0
1718032103.4609718,map,True,False,2,3,0.0,0.0,2.4726943969726562,-1.8079453706741333,0.0,0.0,0.0,0.03543604264676444,0.9993719423448881,3.821952540952055,-4.065016259367803,0.6509853216213348,0.0,0.0,0.0,1.0
1718032103.512148,map,True,False,2,3,0.0,0.0,2.4726943969726562,-1.8079453706741333,0.0,0.0,0.0,0.03543604264676444,0.9993719423448881,3.821952540952055,-4.065016259367803,0.6509853216213348,0.0,0.0,0.0,1.0
1718032103.6120899,map,True,False,2,3,0.0,0.0,2.5607810020446777,-1.8371176719665527,0.0,0.0,0.0,0.037513330065387374,0.9992961343561654,3.8492207159468883,-3.896925356617554,0.6659253425610857,0.0,0.0,0.0,1.0
1718032103.6624393,map,True,False,2,2,0.49874686716791977,0.49874686716791977,2.5607810020446777,-1.8371176719665527,0.0,0.0,0.0,0.037513330065387374,0.9992961343561654,3.8547130875343627,-3.847981628921135,0.6784323924464878,0.0,0.0,0.0,1.0
1718032103.7629828,map,True,True,2,2,0.49874686716791977,0.49874686716791977,2.5607810020446777,-1.8371176719665527,0.0,0.0,0.0,0.037513330065387374,0.9992961343561654,3.8547130875343627,-3.847981628921135,0.6784323924464878,0.0,0.0,0.0,1.0
1718032103.8636968,map,True,False,2,2,0.49874686716791977,0.49874686716791977,2.5607810020446777,-1.8371176719665527,0.0,0.0,0.0,0.037513330065387374,0.9992961343561654,3.8547130875343627,-3.847981628921135,0.6784323924464878,0.0,0.0,0.0,1.0
1718032103.964178,map,True,True,2,2,0.49874686716791977,0.49874686716791977,2.5607810020446777,-1.8371176719665527,0.0,0.0,0.0,0.037513330065387374,0.9992961343561654,3.9325794641778424,-3.6718515721558087,0.6841206009194509,0.0,0.0,0.0,1.0
1718032104.0137336,map,True,True,2,2,0.49874686716791977,0.49874686716791977,2.5607810020446777,-1.8371176719665527,0.0,0.0,0.0,0.037513330065387374,0.9992961343561654,3.9433128597184033,-3.6466730651577026,0.6868571455362682,0.0,0.0,0.0,1.0
1718032104.1122527,map,True,True,2,2,0.49874686716791977,0.49874686716791977,2.675447702407837,-1.8678191900253296,0.0,0.0,0.0,0.03871558875966897,0.9992502650465052,3.9433128597184033,-3.6466730651577026,0.6868571455362682,0.0,0.0,0.0,1.0
1718032104.2124746,map,True,False,2,2,0.49874686716791977,0.49874686716791977,2.675447702407837,-1.8678191900253296,0.0,0.0,0.0,0.03871558875966897,0.9992502650465052,3.9433128597184033,-3.6466730651577026,0.6868571455362682,0.0,0.0,0.0,1.0
1718032104.3192463,map,True,True,2,2,0.49874686716791977,0.49874686716791977,2.675447702407837,-1.8678191900253296,0.0,0.0,0.0,0.03871558875966897,0.9992502650465052,3.9272090862240994,-3.4705471678943978,0.708993987513367,0.0,0.0,0.0,1.0
1718032104.3703337,map,True,True,2,2,0.49874686716791977,0.49874686716791977,2.675447702407837,-1.8678191900253296,0.0,0.0,0.0,0.03871558875966897,0.9992502650465052,3.9272090862240994,-3.4705471678943978,0.708993987513367,0.0,0.0,0.0,1.0
1718032104.4689379,map,True,True,2,2,0.49874686716791977,0.49874686716791977,2.675447702407837,-1.8678191900253296,0.0,0.0,0.0,0.03871558875966897,0.9992502650465052,3.9272090862240994,-3.4705471678943978,0.708993987513367,0.0,0.0,0.0,1.0
1718032104.5191495,map,True,False,2,2,0.49874686716791977,0.49874686716791977,2.675447702407837,-1.8678191900253296,0.0,0.0,0.0,0.03871558875966897,0.9992502650465052,3.9272090862240994,-3.4705471678943978,0.708993987513367,0.0,0.0,0.0,1.0
1718032104.622893,map,True,False,2,2,0.49874686716791977,0.49874686716791977,2.675447702407837,-1.8678191900253296,0.0,0.0,0.0,0.03871558875966897,0.9992502650465052,3.9415719374226352,-3.3584520839020886,0.6881664828413949,0.0,0.0,0.0,1.0
1718032104.6701562,map,True,True,2,2,0.49874686716791977,0.49874686716791977,2.675447702407837,-1.8678191900253296,0.0,0.0,0.0,0.03871558875966897,0.9992502650465052,3.9385970884263544,-3.3544309416042486,0.6881481298651044,0.0,0.0,0.0,1.0
1718032104.7202857,map,True,False,2,2,0.49874686716791977,0.49874686716791977,2.776772975921631,-1.885880947113037,0.0,0.0,0.0,0.03927639960724157,0.999228388402055,3.9385970884263544,-3.3544309416042486,0.6881481298651044,0.0,0.0,0.0,1.0
1718032104.772258,map,True,False,2,2,0.49874686716791977,0.49874686716791977,2.776772975921631,-1.885880947113037,0.0,0.0,0.0,0.03927639960724157,0.999228388402055,3.9385970884263544,-3.3544309416042486,0.6881481298651044,0.0,0.0,0.0,1.0
1718032104.8212082,map,True,True,2,2,0.49874686716791977,0.49874686716791977,2.776772975921631,-1.885880947113037,0.0,0.0,0.0,0.03927639960724157,0.999228388402055,3.9385970884263544,-3.3544309416042486,0.6881481298651044,0.0,0.0,0.0,1.0
1718032104.9751613,map,True,True,2,2,0.49874686716791977,0.49874686716791977,2.776772975921631,-1.885880947113037,0.0,0.0,0.0,0.03927639960724157,0.999228388402055,3.9442747515767294,-3.237869184833279,0.6854094370907493,0.0,0.0,0.0,1.0
1718032105.024406,map,True,True,2,2,0.49874686716791977,0.49874686716791977,2.776772975921631,-1.885880947113037,0.0,0.0,0.0,0.03927639960724157,0.999228388402055,3.9442747515767294,-3.237869184833279,0.6854094370907493,0.0,0.0,0.0,1.0
1718032105.123217,map,True,False,2,2,0.49874686716791977,0.49874686716791977,2.776772975921631,-1.885880947113037,0.0,0.0,0.0,0.03927639960724157,0.999228388402055,3.9442747515767294,-3.237869184833279,0.6854094370907493,0.0,0.0,0.0,1.0
1718032105.1746414,map,True,False,2,2,0.49874686716791977,0.49874686716791977,2.776772975921631,-1.885880947113037,0.0,0.0,0.0,0.03927639960724157,0.999228388402055,3.9442747515767294,-3.237869184833279,0.6854094370907493,0.0,0.0,0.0,1.0
1718032105.2244174,map,True,True,2,2,0.49874686716791977,0.49874686716791977,2.776772975921631,-1.885880947113037,0.0,0.0,0.0,0.03927639960724157,0.999228388402055,3.9442747515767294,-3.237869184833279,0.6854094370907493,0.0,0.0,0.0,1.0
1718032105.324345,map,True,False,1,2,0.0,0.0,2.8479163646698,-1.8955062627792358,0.0,0.0,0.0,0.039264903001168104,0.9992288357819943,3.9897659127726226,-3.201671588476219,0.6852166035954451,0.0,0.0,0.0,1.0
1718032105.4252565,map,True,False,1,2,0.0,0.0,2.8479163646698,-1.8955062627792358,0.0,0.0,0.0,0.039264903001168104,0.9992288357819943,3.9897659127726226,-3.201671588476219,0.6852166035954451,0.0,0.0,0.0,1.0
1718032105.4765308,map,True,False,1,2,0.0,0.0,2.8479163646698,-1.8955062627792358,0.0,0.0,0.0,0.039264903001168104,0.9992288357819943,3.9897659127726226,-3.201671588476219,0.6852166035954451,0.0,0.0,0.0,1.0
1718032105.5258188,map,True,False,1,2,0.0,0.0,2.8479163646698,-1.8955062627792358,0.0,0.0,0.0,0.039264903001168104,0.9992288357819943,3.9897659127726226,-3.201671588476219,0.6852166035954451,0.0,0.0,0.0,1.0
1718032105.5766096,map,True,False,1,2,0.0,0.0,2.8479163646698,-1.8955062627792358,0.0,0.0,0.0,0.039264903001168104,0.9992288357819943,3.9897659127726226,-3.201671588476219,0.6852166035954451,0.0,0.0,0.0,1.0
1718032105.6768107,map,True,False,1,2,0.0,0.0,2.9133894443511963,-1.9052404165267944,0.0,0.0,0.0,0.039670514554162456,0.9992128194553928,4.026701368781737,-3.193572815590566,0.6912936024369126,0.0,0.0,0.0,1.0
1718032105.7292285,map,True,False,1,2,0.0,0.0,2.9133894443511963,-1.9052404165267944,0.0,0.0,0.0,0.039670514554162456,0.9992128194553928,4.026701368781737,-3.193572815590566,0.6912936024369126,0.0,0.0,0.0,1.0
1718032105.7782836,map,True,False,1,2,0.0,0.0,2.9133894443511963,-1.9052404165267944,0.0,0.0,0.0,0.039670514554162456,0.9992128194553928,4.026701368781737,-3.193572815590566,0.6912936024369126,0.0,0.0,0.0,1.0
1718032105.8291047,map,True,False,1,2,0.0,0.0,2.9133894443511963,-1.9052404165267944,0.0,0.0,0.0,0.039670514554162456,0.9992128194553928,4.026701368781737,-3.193572815590566,0.6912936024369126,0.0,0.0,0.0,1.0
1718032105.9789782,map,True,False,1,2,0.0,0.0,2.9133894443511963,-1.9052404165267944,0.0,0.0,0.0,0.039670514554162456,0.9992128194553928,4.0345330656444744,-3.1574653982985947,0.8108461727995439,0.0,0.0,0.0,1.0
1718032106.0302827,map,True,False,1,2,0.0,0.0,2.9133894443511963,-1.9052404165267944,0.0,0.0,0.0,0.039670514554162456,0.9992128194553928,4.0345330656444744,-3.1574653982985947,0.8108461727995439,0.0,0.0,0.0,1.0
1718032106.136982,map,True,False,1,2,0.0,0.0,2.953572988510132,-1.9157044887542725,0.0,0.0,0.0,0.04017675999872095,0.9991925824447033,4.0345330656444744,-3.1574653982985947,0.8108461727995439,0.0,0.0,0.0,1.0
1718032106.2284923,map,True,False,1,2,0.0,0.0,2.953572988510132,-1.9157044887542725,0.0,0.0,0.0,0.04017675999872095,0.9991925824447033,4.0345330656444744,-3.1574653982985947,0.8108461727995439,0.0,0.0,0.0,1.0
1718032106.280027,map,True,False,1,2,0.0,0.0,2.953572988510132,-1.9157044887542725,0.0,0.0,0.0,0.04017675999872095,0.9991925824447033,4.0345330656444744,-3.1574653982985947,0.8108461727995439,0.0,0.0,0.0,1.0
1718032106.3296876,map,True,False,1,2,0.0,0.0,2.953572988510132,-1.9157044887542725,0.0,0.0,0.0,0.04017675999872095,0.9991925824447033,4.085066470712122,-3.2755934464136844,0.8604513553723402,0.0,0.0,0.0,1.0
1718032106.3797088,map,True,False,1,2,0.0,0.0,2.953572988510132,-1.9157044887542725,0.0,0.0,0.0,0.04017675999872095,0.9991925824447033,4.085066470712122,-3.2755934464136844,0.8604513553723402,0.0,0.0,0.0,1.0
1718032106.429609,map,True,False,1,2,0.0,0.0,2.964841604232788,-1.9122064113616943,0.0,0.0,0.0,0.039877469368109805,0.9992045725874732,4.085066470712122,-3.2755934464136844,0.8604513553723402,0.0,0.0,0.0,1.0
1718032106.4797714,map,True,False,1,2,0.0,0.0,2.964841604232788,-1.9122064113616943,0.0,0.0,0.0,0.039877469368109805,0.9992045725874732,4.085066470712122,-3.2755934464136844,0.8604513553723402,0.0,0.0,0.0,1.0
1718032106.5794537,map,True,False,1,2,0.0,0.0,2.964841604232788,-1.9122064113616943,0.0,0.0,0.0,0.039877469368109805,0.9992045725874732,4.085066470712122,-3.2755934464136844,0.8604513553723402,0.0,0.0,0.0,1.0
1718032106.6796465,map,True,False,1,2,0.0,0.0,2.964841604232788,-1.9122064113616943,0.0,0.0,0.0,0.039877469368109805,0.9992045725874732,4.085066470712122,-3.2755934464136844,0.8604513553723402,0.0,0.0,0.0,1.0
1718032106.730414,map,True,False,1,2,0.0,0.0,2.964841604232788,-1.9122064113616943,0.0,0.0,0.0,0.039877469368109805,0.9992045725874732,4.085066470712122,-3.2755934464136844,0.8604513553723402,0.0,0.0,0.0,1.0
1718032106.8300784,map,True,False,1,2,0.0,0.0,2.964841604232788,-1.9122064113616943,0.0,0.0,0.0,0.039877469368109805,0.9992045725874732,4.085066470712122,-3.2755934464136844,0.8604513553723402,0.0,0.0,0.0,1.0
