timestamp_sec,frame_id,game_played,yielding,player1discrete,player2discrete,player1yieldprob,player2yieldprob,player1_pose_x,player1_pose_y,player1_pose_z,player1_pose_orient_x,player1_pose_orient_y,player1_pose_orient_z,player1_pose_orient_w,player2_pose_x,player2_pose_y,player2_pose_z,player2_pose_orient_x,player2_pose_orient_y,player2_pose_orient_z,player2_pose_orient_w
1718122981.1392794,map,True,False,6,8,0.0,0.0,0.915711522102356,-1.4600050449371338,0.0,0.0,0.0,0.038301946873322654,0.9992662062124104,2.8393092356700365,-9.290014089712223,0.8127171181137594,0.0,0.0,0.0,1.0
1718122981.2398126,map,True,False,6,8,0.0,0.0,0.915711522102356,-1.4600050449371338,0.0,0.0,0.0,0.038301946873322654,0.9992662062124104,2.8393092356700365,-9.290014089712223,0.8127171181137594,0.0,0.0,0.0,1.0
1718122981.4397755,map,True,False,6,8,0.0,0.0,0.9154338240623474,-1.4596490859985352,0.0,0.0,0.0,0.03828678880529534,0.9992667877842816,2.8088048336597686,-9.006625914867513,0.8080392094749214,0.0,0.0,0.0,1.0
1718122981.4934819,map,True,False,6,7,0.0,0.0,0.9154338240623474,-1.4596490859985352,0.0,0.0,0.0,0.03828678880529534,0.9992667877842816,2.787269617773586,-8.855294886706492,0.8055031978346379,0.0,0.0,0.0,1.0
1718122981.5437994,map,True,False,6,7,0.0,0.0,0.9154338240623474,-1.4596490859985352,0.0,0.0,0.0,0.03828678880529534,0.9992667877842816,2.787269617773586,-8.855294886706492,0.8055031978346379,0.0,0.0,0.0,1.0
1718122981.6426299,map,True,False,6,7,0.0,0.0,0.9154338240623474,-1.4596490859985352,0.0,0.0,0.0,0.03828678880529534,0.9992667877842816,2.787269617773586,-8.855294886706492,0.8055031978346379,0.0,0.0,0.0,1.0
1718122981.6930575,map,True,False,6,7,0.0,0.0,0.9154338240623474,-1.4596490859985352,0.0,0.0,0.0,0.03828678880529534,0.9992667877842816,2.787269617773586,-8.855294886706492,0.8055031978346379,0.0,0.0,0.0,1.0
1718122981.7429857,map,True,False,6,7,0.0,0.0,0.9154338240623474,-1.4596490859985352,0.0,0.0,0.0,0.03828678880529534,0.9992667877842816,2.787269617773586,-8.855294886706492,0.8055031978346379,0.0,0.0,0.0,1.0
1718122981.7964709,map,True,False,6,7,0.0,0.0,0.9154338240623474,-1.4596490859985352,0.0,0.0,0.0,0.03828678880529534,0.9992667877842816,2.758985670950555,-8.599176827316263,0.7907752630161594,0.0,0.0,0.0,1.0
1718122981.8932123,map,True,False,6,7,0.0,0.0,0.9154338240623474,-1.4596490859985352,0.0,0.0,0.0,0.03828678880529534,0.9992667877842816,2.758985670950555,-8.599176827316263,0.7907752630161594,0.0,0.0,0.0,1.0
1718122981.9450765,map,True,False,6,7,0.0,0.0,0.9154338240623474,-1.4596490859985352,0.0,0.0,0.0,0.03828678880529534,0.9992667877842816,2.758985670950555,-8.599176827316263,0.7907752630161594,0.0,0.0,0.0,1.0
1718122981.9547381,map,True,False,6,7,0.0,0.0,0.9154338240623474,-1.4596490859985352,0.0,0.0,0.0,0.03828678880529534,0.9992667877842816,2.758985670950555,-8.599176827316263,0.7907752630161594,0.0,0.0,0.0,1.0
1718122981.9578242,map,True,False,6,7,0.0,0.0,0.9154338240623474,-1.4596490859985352,0.0,0.0,0.0,0.03828678880529534,0.9992667877842816,2.758985670950555,-8.599176827316263,0.7907752630161594,0.0,0.0,0.0,1.0
1718122981.963204,map,True,False,6,7,0.0,0.0,0.9154338240623474,-1.4596490859985352,0.0,0.0,0.0,0.03828678880529534,0.9992667877842816,2.758985670950555,-8.599176827316263,0.7907752630161594,0.0,0.0,0.0,1.0
1718122981.965252,map,True,False,6,7,0.0,0.0,0.9154338240623474,-1.4596490859985352,0.0,0.0,0.0,0.03828678880529534,0.9992667877842816,2.758985670950555,-8.599176827316263,0.7907752630161594,0.0,0.0,0.0,1.0
1718122981.9701877,map,True,False,6,7,0.0,0.0,0.9154338240623474,-1.4596490859985352,0.0,0.0,0.0,0.03828678880529534,0.9992667877842816,2.758985670950555,-8.599176827316263,0.7907752630161594,0.0,0.0,0.0,1.0
1718122981.9739926,map,True,False,6,7,0.0,0.0,0.9154338240623474,-1.4596490859985352,0.0,0.0,0.0,0.03828678880529534,0.9992667877842816,2.758985670950555,-8.599176827316263,0.7907752630161594,0.0,0.0,0.0,1.0
1718122981.9793603,map,True,False,6,7,0.0,0.0,0.9154338240623474,-1.4596490859985352,0.0,0.0,0.0,0.03828678880529534,0.9992667877842816,2.758985670950555,-8.599176827316263,0.7907752630161594,0.0,0.0,0.0,1.0
1718122981.9829254,map,True,False,6,7,0.0,0.0,0.9154338240623474,-1.4596490859985352,0.0,0.0,0.0,0.03828678880529534,0.9992667877842816,2.758985670950555,-8.599176827316263,0.7907752630161594,0.0,0.0,0.0,1.0
1718122981.9851208,map,True,False,6,7,0.0,0.0,0.9154338240623474,-1.4596490859985352,0.0,0.0,0.0,0.03828678880529534,0.9992667877842816,2.758985670950555,-8.599176827316263,0.7907752630161594,0.0,0.0,0.0,1.0
1718122981.989482,map,True,False,6,7,0.0,0.0,0.9154338240623474,-1.4596490859985352,0.0,0.0,0.0,0.03828678880529534,0.9992667877842816,2.758985670950555,-8.599176827316263,0.7907752630161594,0.0,0.0,0.0,1.0
1718122981.994278,map,True,False,6,7,0.0,0.0,0.9154338240623474,-1.4596490859985352,0.0,0.0,0.0,0.03828678880529534,0.9992667877842816,2.758985670950555,-8.599176827316263,0.7907752630161594,0.0,0.0,0.0,1.0
1718122982.0449696,map,True,False,6,7,0.0,0.0,0.9158772826194763,-1.459689736366272,0.0,0.0,0.0,0.03826440245579587,0.9992676526854128,2.758985670950555,-8.599176827316263,0.7907752630161594,0.0,0.0,0.0,1.0
1718122982.145108,map,True,False,6,8,0.0,0.0,0.9158772826194763,-1.459689736366272,0.0,0.0,0.0,0.03826440245579587,0.9992676526854128,2.892380739180271,-9.16254195684276,0.8110567883564568,0.0,0.0,0.0,1.0
1718122982.2221808,map,True,False,6,8,0.0,0.0,0.9158772826194763,-1.459689736366272,0.0,0.0,0.0,0.03826440245579587,0.9992676526854128,2.8748024575001514,-9.045671565538518,0.79785859352948,0.0,0.0,0.0,1.0
1718122982.4966536,map,True,False,6,7,0.0,0.0,0.9158772826194763,-1.459689736366272,0.0,0.0,0.0,0.03826440245579587,0.9992676526854128,2.829484868067642,-8.553356519386192,0.779927742277334,0.0,0.0,0.0,1.0
1718122982.5946295,map,True,False,6,7,0.0,0.0,0.9158772826194763,-1.459689736366272,0.0,0.0,0.0,0.03826440245579587,0.9992676526854128,2.829484868067642,-8.553356519386192,0.779927742277334,0.0,0.0,0.0,1.0
1718122982.694925,map,True,False,6,7,0.0,0.0,0.9158772826194763,-1.459689736366272,0.0,0.0,0.0,0.03826440245579587,0.9992676526854128,2.829484868067642,-8.553356519386192,0.779927742277334,0.0,0.0,0.0,1.0
1718122982.7936985,map,True,True,6,6,0.5957621508060097,0.5957621508060098,0.9158772826194763,-1.459689736366272,0.0,0.0,0.0,0.03826440245579587,0.9992676526854128,2.6901118733419116,-7.205346169503425,0.7698111068673295,0.0,0.0,0.0,1.0
1718122982.8448412,map,True,False,6,6,0.5957621508060097,0.5957621508060098,0.9158772826194763,-1.459689736366272,0.0,0.0,0.0,0.03826440245579587,0.9992676526854128,2.6901118733419116,-7.205346169503425,0.7698111068673295,0.0,0.0,0.0,1.0
1718122982.8941934,map,True,False,6,6,0.5957621508060097,0.5957621508060098,0.9158751964569092,-1.4609100818634033,0.0,0.0,0.0,0.03827142141459233,0.9992673842679005,2.6901118733419116,-7.205346169503425,0.7698111068673295,0.0,0.0,0.0,1.0
1718122982.9451563,map,True,True,6,6,0.5957621508060097,0.5957621508060098,0.9158751964569092,-1.4609100818634033,0.0,0.0,0.0,0.03827142141459233,0.9992673842679005,2.6901118733419116,-7.205346169503425,0.7698111068673295,0.0,0.0,0.0,1.0
1718122982.9962711,map,True,False,6,6,0.5957621508060097,0.5957621508060098,0.9158751964569092,-1.4609100818634033,0.0,0.0,0.0,0.03827142141459233,0.9992673842679005,2.6901118733419116,-7.205346169503425,0.7698111068673295,0.0,0.0,0.0,1.0
1718122983.0551007,map,True,False,6,6,0.5957621508060097,0.5957621508060098,0.9158751964569092,-1.4609100818634033,0.0,0.0,0.0,0.03827142141459233,0.9992673842679005,2.6901118733419116,-7.205346169503425,0.7698111068673295,0.0,0.0,0.0,1.0
1718122983.1526008,map,True,True,6,6,0.5957621508060097,0.5957621508060098,0.9158751964569092,-1.4609100818634033,0.0,0.0,0.0,0.03827142141459233,0.9992673842679005,2.732945677333174,-7.261548995724057,0.7705795478260994,0.0,0.0,0.0,1.0
1718122983.501567,map,True,True,6,6,0.5957621508060097,0.5957621508060098,0.9158751964569092,-1.4609100818634033,0.0,0.0,0.0,0.03827142141459233,0.9992673842679005,2.8652843500562097,-7.644116155992439,0.7764646872053276,0.0,0.0,0.0,1.0
1718122983.6013224,map,True,True,6,6,0.5957621508060097,0.5957621508060098,0.9158751964569092,-1.4609100818634033,0.0,0.0,0.0,0.03827142141459233,0.9992673842679005,2.8652843500562097,-7.644116155992439,0.7764646872053276,0.0,0.0,0.0,1.0
1718122983.7011123,map,True,True,6,6,0.5957621508060097,0.5957621508060098,0.9158751964569092,-1.4609100818634033,0.0,0.0,0.0,0.03827142141459233,0.9992673842679005,2.8652843500562097,-7.644116155992439,0.7764646872053276,0.0,0.0,0.0,1.0
1718122983.7525806,map,True,True,6,6,0.5957621508060097,0.5957621508060098,0.9816654324531555,-1.4750369787216187,0.0,0.0,0.0,0.03884777732739166,0.9992451351878624,2.8652843500562097,-7.644116155992439,0.7764646872053276,0.0,0.0,0.0,1.0
1718122983.8020372,map,True,True,6,6,0.5957621508060097,0.5957621508060098,0.9816654324531555,-1.4750369787216187,0.0,0.0,0.0,0.03884777732739166,0.9992451351878624,2.881048577608696,-7.084751640536899,0.7509318633559494,0.0,0.0,0.0,1.0
1718122983.8526914,map,True,False,6,5,0.0,0.0,0.9816654324531555,-1.4750369787216187,0.0,0.0,0.0,0.03884777732739166,0.9992451351878624,2.8519204383362173,-6.912844925866195,0.7487873164464607,0.0,0.0,0.0,1.0
1718122983.909014,map,True,False,6,5,0.0,0.0,0.9816654324531555,-1.4750369787216187,0.0,0.0,0.0,0.03884777732739166,0.9992451351878624,2.8519204383362173,-6.912844925866195,0.7487873164464607,0.0,0.0,0.0,1.0
1718122983.9558654,map,True,False,6,5,0.0,0.0,0.9816654324531555,-1.4750369787216187,0.0,0.0,0.0,0.03884777732739166,0.9992451351878624,2.8519204383362173,-6.912844925866195,0.7487873164464607,0.0,0.0,0.0,1.0
1718122984.0073848,map,True,False,6,5,0.0,0.0,0.9816654324531555,-1.4750369787216187,0.0,0.0,0.0,0.03884777732739166,0.9992451351878624,2.8519204383362173,-6.912844925866195,0.7487873164464607,0.0,0.0,0.0,1.0
1718122984.0587947,map,True,False,6,5,0.0,0.0,0.9816654324531555,-1.4750369787216187,0.0,0.0,0.0,0.03884777732739166,0.9992451351878624,2.8519204383362173,-6.912844925866195,0.7487873164464607,0.0,0.0,0.0,1.0
1718122984.108484,map,True,False,6,5,0.0,0.0,0.9816654324531555,-1.4750369787216187,0.0,0.0,0.0,0.03884777732739166,0.9992451351878624,2.8519204383362173,-6.912844925866195,0.7487873164464607,0.0,0.0,0.0,1.0
1718122984.1583455,map,True,False,6,5,0.0,0.0,0.9816654324531555,-1.4750369787216187,0.0,0.0,0.0,0.03884777732739166,0.9992451351878624,2.8300184244708704,-6.562324017952767,0.7291822706159377,0.0,0.0,0.0,1.0
1718122984.2080467,map,True,False,6,5,0.0,0.0,0.9816654324531555,-1.4750369787216187,0.0,0.0,0.0,0.03884777732739166,0.9992451351878624,2.8300184244708704,-6.562324017952767,0.7291822706159377,0.0,0.0,0.0,1.0
1718122984.558875,map,True,False,6,5,0.0,0.0,0.9816654324531555,-1.4750369787216187,0.0,0.0,0.0,0.03884777732739166,0.9992451351878624,2.8448053848899177,-6.483975934463693,0.7358959359483247,0.0,0.0,0.0,1.0
1718122984.6580682,map,True,False,6,5,0.0,0.0,1.1201722621917725,-1.5056085586547852,0.0,0.0,0.0,0.039746519267895346,0.9992097921320381,2.8448053848899177,-6.483975934463693,0.7358959359483247,0.0,0.0,0.0,1.0
1718122984.708774,map,True,False,6,5,0.0,0.0,1.1201722621917725,-1.5056085586547852,0.0,0.0,0.0,0.039746519267895346,0.9992097921320381,2.8448053848899177,-6.483975934463693,0.7358959359483247,0.0,0.0,0.0,1.0
1718122984.759596,map,True,False,6,5,0.0,0.0,1.1201722621917725,-1.5056085586547852,0.0,0.0,0.0,0.039746519267895346,0.9992097921320381,2.8448053848899177,-6.483975934463693,0.7358959359483247,0.0,0.0,0.0,1.0
1718122984.8096683,map,True,False,6,5,0.0,0.0,1.1201722621917725,-1.5056085586547852,0.0,0.0,0.0,0.039746519267895346,0.9992097921320381,2.9435367246543143,-6.401974473061928,0.7127761472740028,0.0,0.0,0.0,1.0
1718122984.8618686,map,True,False,6,5,0.0,0.0,1.1201722621917725,-1.5056085586547852,0.0,0.0,0.0,0.039746519267895346,0.9992097921320381,2.964834894005554,-6.4805515151685995,0.7207962880214878,0.0,0.0,0.0,1.0
1718122984.9158454,map,True,False,6,5,0.0,0.0,1.1201722621917725,-1.5056085586547852,0.0,0.0,0.0,0.039746519267895346,0.9992097921320381,2.964834894005554,-6.4805515151685995,0.7207962880214878,0.0,0.0,0.0,1.0
1718122984.9630773,map,True,False,6,5,0.0,0.0,1.1201722621917725,-1.5056085586547852,0.0,0.0,0.0,0.039746519267895346,0.9992097921320381,2.964834894005554,-6.4805515151685995,0.7207962880214878,0.0,0.0,0.0,1.0
1718122985.0142155,map,True,False,6,5,0.0,0.0,1.1201722621917725,-1.5056085586547852,0.0,0.0,0.0,0.039746519267895346,0.9992097921320381,2.964834894005554,-6.4805515151685995,0.7207962880214878,0.0,0.0,0.0,1.0
1718122985.064688,map,True,False,6,5,0.0,0.0,1.1201722621917725,-1.5056085586547852,0.0,0.0,0.0,0.039746519267895346,0.9992097921320381,2.964834894005554,-6.4805515151685995,0.7207962880214878,0.0,0.0,0.0,1.0
1718122985.1155283,map,True,False,6,5,0.0,0.0,1.1201722621917725,-1.5056085586547852,0.0,0.0,0.0,0.039746519267895346,0.9992097921320381,2.964834894005554,-6.4805515151685995,0.7207962880214878,0.0,0.0,0.0,1.0
1718122985.166319,map,True,False,6,4,0.0,0.0,1.1201722621917725,-1.5056085586547852,0.0,0.0,0.0,0.039746519267895346,0.9992097921320381,2.9022598602682184,-5.738712116556856,0.7275188536936192,0.0,0.0,0.0,1.0
1718122985.216641,map,True,False,6,4,0.0,0.0,1.1201722621917725,-1.5056085586547852,0.0,0.0,0.0,0.039746519267895346,0.9992097921320381,2.9022598602682184,-5.738712116556856,0.7275188536936192,0.0,0.0,0.0,1.0
1718122985.472292,map,True,False,6,4,0.0,0.0,1.2168694734573364,-1.5322356224060059,0.0,0.0,0.0,0.04118913440718391,0.9991513615030686,2.9474193555369137,-5.648287417014849,0.7076922600662876,0.0,0.0,0.0,1.0
1718122985.572544,map,True,False,6,4,0.0,0.0,1.2168694734573364,-1.5322356224060059,0.0,0.0,0.0,0.04118913440718391,0.9991513615030686,2.9474193555369137,-5.648287417014849,0.7076922600662876,0.0,0.0,0.0,1.0
1718122985.6716383,map,True,False,6,4,0.0,0.0,1.2168694734573364,-1.5322356224060059,0.0,0.0,0.0,0.04118913440718391,0.9991513615030686,2.9474193555369137,-5.648287417014849,0.7076922600662876,0.0,0.0,0.0,1.0
1718122985.7720108,map,True,False,6,4,0.0,0.0,1.2168694734573364,-1.5322356224060059,0.0,0.0,0.0,0.04118913440718391,0.9991513615030686,3.012947671018795,-5.685198750100949,0.7203743183779147,0.0,0.0,0.0,1.0
1718122985.823992,map,True,False,6,4,0.0,0.0,1.2168694734573364,-1.5322356224060059,0.0,0.0,0.0,0.04118913440718391,0.9991513615030686,3.016381088275449,-5.672958075112681,0.7140078721585333,0.0,0.0,0.0,1.0
1718122985.924413,map,True,False,5,4,0.0,0.0,1.22996985912323,-1.5388846397399902,0.0,0.0,0.0,0.041428041816623816,0.9991414885070157,3.016381088275449,-5.672958075112681,0.7140078721585333,0.0,0.0,0.0,1.0
1718122985.9767606,map,True,False,5,4,0.0,0.0,1.22996985912323,-1.5388846397399902,0.0,0.0,0.0,0.041428041816623816,0.9991414885070157,3.016381088275449,-5.672958075112681,0.7140078721585333,0.0,0.0,0.0,1.0
1718122986.0260715,map,True,False,5,4,0.0,0.0,1.22996985912323,-1.5388846397399902,0.0,0.0,0.0,0.041428041816623816,0.9991414885070157,3.016381088275449,-5.672958075112681,0.7140078721585333,0.0,0.0,0.0,1.0
1718122986.088864,map,True,False,5,4,0.0,0.0,1.22996985912323,-1.5388846397399902,0.0,0.0,0.0,0.041428041816623816,0.9991414885070157,3.016381088275449,-5.672958075112681,0.7140078721585333,0.0,0.0,0.0,1.0
1718122986.1389976,map,True,False,5,4,0.0,0.0,1.22996985912323,-1.5388846397399902,0.0,0.0,0.0,0.041428041816623816,0.9991414885070157,3.0807530147093862,-5.58374155452284,0.6948319727827513,0.0,0.0,0.0,1.0
1718122986.234058,map,True,False,5,4,0.0,0.0,1.22996985912323,-1.5388846397399902,0.0,0.0,0.0,0.041428041816623816,0.9991414885070157,3.0807530147093862,-5.58374155452284,0.6948319727827513,0.0,0.0,0.0,1.0
1718122986.429196,map,True,False,5,4,0.0,0.0,1.22996985912323,-1.5388846397399902,0.0,0.0,0.0,0.041428041816623816,0.9991414885070157,3.084942881776949,-5.179785877334948,0.6932974954690225,0.0,0.0,0.0,1.0
1718122986.5265925,map,True,False,5,4,0.0,0.0,1.22996985912323,-1.5388846397399902,0.0,0.0,0.0,0.041428041816623816,0.9991414885070157,3.0803181775445587,-5.108819185334407,0.6767490961111187,0.0,0.0,0.0,1.0
1718122986.577514,map,True,False,5,4,0.0,0.0,1.22996985912323,-1.5388846397399902,0.0,0.0,0.0,0.041428041816623816,0.9991414885070157,3.0803181775445587,-5.108819185334407,0.6767490961111187,0.0,0.0,0.0,1.0
1718122986.626931,map,True,False,5,4,0.0,0.0,1.22996985912323,-1.5388846397399902,0.0,0.0,0.0,0.041428041816623816,0.9991414885070157,3.0803181775445587,-5.108819185334407,0.6767490961111187,0.0,0.0,0.0,1.0
1718122986.6771097,map,True,False,5,4,0.0,0.0,1.4262866973876953,-1.5880968570709229,0.0,0.0,0.0,0.04359101341623877,0.9990494651051482,3.0803181775445587,-5.108819185334407,0.6767490961111187,0.0,0.0,0.0,1.0
1718122986.7776234,map,True,False,5,4,0.0,0.0,1.4262866973876953,-1.5880968570709229,0.0,0.0,0.0,0.04359101341623877,0.9990494651051482,3.1224048762528516,-5.006617458791439,0.6715113236678052,0.0,0.0,0.0,1.0
1718122986.8777914,map,True,False,5,4,0.0,0.0,1.4262866973876953,-1.5880968570709229,0.0,0.0,0.0,0.04359101341623877,0.9990494651051482,3.131461457700386,-5.025320675840812,0.6767361534366607,0.0,0.0,0.0,1.0
1718122986.9794714,map,True,False,5,4,0.0,0.0,1.4262866973876953,-1.5880968570709229,0.0,0.0,0.0,0.04359101341623877,0.9990494651051482,3.131461457700386,-5.025320675840812,0.6767361534366607,0.0,0.0,0.0,1.0
1718122987.0780144,map,True,False,5,4,0.0,0.0,1.4262866973876953,-1.5880968570709229,0.0,0.0,0.0,0.04359101341623877,0.9990494651051482,3.131461457700386,-5.025320675840812,0.6767361534366607,0.0,0.0,0.0,1.0
1718122987.1295278,map,True,False,5,3,0.0,0.0,1.4262866973876953,-1.5880968570709229,0.0,0.0,0.0,0.04359101341623877,0.9990494651051482,3.1551060647989218,-4.71705128394624,0.6914253488370556,0.0,0.0,0.0,1.0
1718122987.228745,map,True,False,5,3,0.0,0.0,1.4262866973876953,-1.5880968570709229,0.0,0.0,0.0,0.04359101341623877,0.9990494651051482,3.1551060647989218,-4.71705128394624,0.6914253488370556,0.0,0.0,0.0,1.0
1718122987.428971,map,True,False,5,3,0.0,0.0,1.5692799091339111,-1.622368574142456,0.0,0.0,0.0,0.04442196733027291,0.9990128621933471,3.2338021260996954,-4.684041210589106,0.6670551238609753,0.0,0.0,0.0,1.0
1718122987.5286093,map,True,False,5,3,0.0,0.0,1.5692799091339111,-1.622368574142456,0.0,0.0,0.0,0.04442196733027291,0.9990128621933471,3.2574020218853508,-4.704092944185007,0.6570868258198975,0.0,0.0,0.0,1.0
1718122987.6293175,map,True,False,5,3,0.0,0.0,1.5692799091339111,-1.622368574142456,0.0,0.0,0.0,0.04442196733027291,0.9990128621933471,3.2574020218853508,-4.704092944185007,0.6570868258198975,0.0,0.0,0.0,1.0
1718122987.6795278,map,True,False,5,3,0.0,0.0,1.5692799091339111,-1.622368574142456,0.0,0.0,0.0,0.04442196733027291,0.9990128621933471,3.2574020218853508,-4.704092944185007,0.6570868258198975,0.0,0.0,0.0,1.0
1718122987.7296712,map,True,False,5,3,0.0,0.0,1.5692799091339111,-1.622368574142456,0.0,0.0,0.0,0.04442196733027291,0.9990128621933471,3.2574020218853508,-4.704092944185007,0.6570868258198975,0.0,0.0,0.0,1.0
1718122987.7868247,map,True,False,5,3,0.0,0.0,1.5692799091339111,-1.622368574142456,0.0,0.0,0.0,0.04442196733027291,0.9990128621933471,3.2793185808606973,-4.394543448412464,0.6501213953051447,0.0,0.0,0.0,1.0
1718122987.8304162,map,True,False,5,3,0.0,0.0,1.5692799091339111,-1.622368574142456,0.0,0.0,0.0,0.04442196733027291,0.9990128621933471,3.278285407490147,-4.328299104980009,0.6419564506148637,0.0,0.0,0.0,1.0
1718122987.8804715,map,True,False,5,3,0.0,0.0,1.5692799091339111,-1.622368574142456,0.0,0.0,0.0,0.04442196733027291,0.9990128621933471,3.278285407490147,-4.328299104980009,0.6419564506148637,0.0,0.0,0.0,1.0
1718122987.9307168,map,True,False,5,3,0.0,0.0,1.589537262916565,-1.6295549869537354,0.0,0.0,0.0,0.044469075817707315,0.9990107590513162,3.278285407490147,-4.328299104980009,0.6419564506148637,0.0,0.0,0.0,1.0
1718122987.981525,map,True,False,5,3,0.0,0.0,1.589537262916565,-1.6295549869537354,0.0,0.0,0.0,0.044469075817707315,0.9990107590513162,3.278285407490147,-4.328299104980009,0.6419564506148637,0.0,0.0,0.0,1.0
1718122988.031192,map,True,False,5,3,0.0,0.0,1.589537262916565,-1.6295549869537354,0.0,0.0,0.0,0.044469075817707315,0.9990107590513162,3.278285407490147,-4.328299104980009,0.6419564506148637,0.0,0.0,0.0,1.0
1718122988.132339,map,True,False,5,3,0.0,0.0,1.589537262916565,-1.6295549869537354,0.0,0.0,0.0,0.044469075817707315,0.9990107590513162,3.278285407490147,-4.328299104980009,0.6419564506148637,0.0,0.0,0.0,1.0
1718122988.231665,map,True,False,5,3,0.0,0.0,1.589537262916565,-1.6295549869537354,0.0,0.0,0.0,0.044469075817707315,0.9990107590513162,3.2793825453038954,-4.057208257472867,0.6418671007473704,0.0,0.0,0.0,1.0
1718122988.5809264,map,True,False,5,2,0.0,0.0,1.589537262916565,-1.6295549869537354,0.0,0.0,0.0,0.044469075817707315,0.9990107590513162,3.4410758295973167,-3.9250347586390633,0.6690836150806646,0.0,0.0,0.0,1.0
1718122988.681778,map,True,False,4,2,0.0,0.0,1.7728601694107056,-1.6684329509735107,0.0,0.0,0.0,0.04488499537668991,0.998992158730122,3.4410758295973167,-3.9250347586390633,0.6690836150806646,0.0,0.0,0.0,1.0
1718122988.7317224,map,True,False,4,2,0.0,0.0,1.7728601694107056,-1.6684329509735107,0.0,0.0,0.0,0.04488499537668991,0.998992158730122,3.4410758295973167,-3.9250347586390633,0.6690836150806646,0.0,0.0,0.0,1.0
1718122988.7830722,map,True,False,4,2,0.0,0.0,1.7728601694107056,-1.6684329509735107,0.0,0.0,0.0,0.04488499537668991,0.998992158730122,3.4410758295973167,-3.9250347586390633,0.6690836150806646,0.0,0.0,0.0,1.0
1718122988.88241,map,True,False,4,2,0.0,0.0,1.7728601694107056,-1.6684329509735107,0.0,0.0,0.0,0.04488499537668991,0.998992158730122,3.447297440800072,-3.6237250313709635,0.6502436188093891,0.0,0.0,0.0,1.0
1718122988.9324794,map,True,False,4,2,0.0,0.0,1.7728601694107056,-1.6684329509735107,0.0,0.0,0.0,0.04488499537668991,0.998992158730122,3.447297440800072,-3.6237250313709635,0.6502436188093891,0.0,0.0,0.0,1.0
1718122988.983951,map,True,False,4,2,0.0,0.0,1.7728601694107056,-1.6684329509735107,0.0,0.0,0.0,0.04488499537668991,0.998992158730122,3.447297440800072,-3.6237250313709635,0.6502436188093891,0.0,0.0,0.0,1.0
1718122989.0828273,map,True,False,4,2,0.0,0.0,1.7728601694107056,-1.6684329509735107,0.0,0.0,0.0,0.04488499537668991,0.998992158730122,3.447297440800072,-3.6237250313709635,0.6502436188093891,0.0,0.0,0.0,1.0
1718122989.1329827,map,True,False,4,2,0.0,0.0,1.7728601694107056,-1.6684329509735107,0.0,0.0,0.0,0.04488499537668991,0.998992158730122,3.447297440800072,-3.6237250313709635,0.6502436188093891,0.0,0.0,0.0,1.0
1718122989.183587,map,True,False,4,2,0.0,0.0,1.7728601694107056,-1.6684329509735107,0.0,0.0,0.0,0.04488499537668991,0.998992158730122,3.4884502182855806,-3.554836862492065,0.6414851422511192,0.0,0.0,0.0,1.0
1718122989.2334986,map,True,False,4,2,0.0,0.0,1.7728601694107056,-1.6684329509735107,0.0,0.0,0.0,0.04488499537668991,0.998992158730122,3.4815477371495653,-3.511760632926845,0.6422127363822496,0.0,0.0,0.0,1.0
1718122989.5838428,map,True,False,4,2,0.0,0.0,1.8778537511825562,-1.7012300491333008,0.0,0.0,0.0,0.04576039235894804,0.9989524510316161,3.539629490300154,-3.214204672640614,0.6851536665028441,0.0,0.0,0.0,1.0
1718122989.6379187,map,True,False,4,2,0.0,0.0,1.8778537511825562,-1.7012300491333008,0.0,0.0,0.0,0.04576039235894804,0.9989524510316161,3.539629490300154,-3.214204672640614,0.6851536665028441,0.0,0.0,0.0,1.0
1718122989.685832,map,True,False,4,2,0.0,0.0,1.8778537511825562,-1.7012300491333008,0.0,0.0,0.0,0.04576039235894804,0.9989524510316161,3.539629490300154,-3.214204672640614,0.6851536665028441,0.0,0.0,0.0,1.0
1718122989.7856388,map,True,False,4,2,0.0,0.0,1.8778537511825562,-1.7012300491333008,0.0,0.0,0.0,0.04576039235894804,0.9989524510316161,3.539629490300154,-3.214204672640614,0.6851536665028441,0.0,0.0,0.0,1.0
1718122989.837091,map,True,False,4,2,0.0,0.0,1.8778537511825562,-1.7012300491333008,0.0,0.0,0.0,0.04576039235894804,0.9989524510316161,3.539629490300154,-3.214204672640614,0.6851536665028441,0.0,0.0,0.0,1.0
1718122989.937202,map,True,False,4,2,0.0,0.0,1.8778537511825562,-1.7012300491333008,0.0,0.0,0.0,0.04576039235894804,0.9989524510316161,3.6274581613658556,-3.0189298082714426,0.6843116893257567,0.0,0.0,0.0,1.0
1718122989.9860675,map,True,False,4,2,0.0,0.0,1.8778537511825562,-1.7012300491333008,0.0,0.0,0.0,0.04576039235894804,0.9989524510316161,3.6274581613658556,-3.0189298082714426,0.6843116893257567,0.0,0.0,0.0,1.0
1718122990.087131,map,True,False,4,2,0.0,0.0,1.8778537511825562,-1.7012300491333008,0.0,0.0,0.0,0.04576039235894804,0.9989524510316161,3.6274581613658556,-3.0189298082714426,0.6843116893257567,0.0,0.0,0.0,1.0
1718122990.1367593,map,True,False,4,2,0.0,0.0,1.8778537511825562,-1.7012300491333008,0.0,0.0,0.0,0.04576039235894804,0.9989524510316161,3.6274581613658556,-3.0189298082714426,0.6843116893257567,0.0,0.0,0.0,1.0
1718122990.18698,map,True,False,3,2,0.0,0.0,1.9913334846496582,-1.7440993785858154,0.0,0.0,0.0,0.046484577461242814,0.9989190070347446,3.6274581613658556,-3.0189298082714426,0.6843116893257567,0.0,0.0,0.0,1.0
1718122990.238137,map,True,False,3,1,0.0,0.0,1.9913334846496582,-1.7440993785858154,0.0,0.0,0.0,0.046484577461242814,0.9989190070347446,3.7258750232055124,-2.7543242597471727,0.6832248149763125,0.0,0.0,0.0,1.0
1718122990.3361154,map,True,False,3,1,0.0,0.0,1.9913334846496582,-1.7440993785858154,0.0,0.0,0.0,0.046484577461242814,0.9989190070347446,3.75356052410232,-2.672754288697661,0.680785347245338,0.0,0.0,0.0,1.0
1718122990.386733,map,True,False,3,1,0.0,0.0,1.9913334846496582,-1.7440993785858154,0.0,0.0,0.0,0.046484577461242814,0.9989190070347446,3.75356052410232,-2.672754288697661,0.680785347245338,0.0,0.0,0.0,1.0
1718122990.4866261,map,True,False,3,1,0.0,0.0,1.9913334846496582,-1.7440993785858154,0.0,0.0,0.0,0.046484577461242814,0.9989190070347446,3.75356052410232,-2.672754288697661,0.680785347245338,0.0,0.0,0.0,1.0
1718122990.5887413,map,True,False,3,1,0.0,0.0,1.9913334846496582,-1.7440993785858154,0.0,0.0,0.0,0.046484577461242814,0.9989190070347446,3.791559379915652,-2.4850689982507568,0.6821252839300439,0.0,0.0,0.0,1.0
1718122990.6866448,map,True,False,3,1,0.0,0.0,1.9913334846496582,-1.7440993785858154,0.0,0.0,0.0,0.046484577461242814,0.9989190070347446,3.7834857843326444,-2.373888837560955,0.6817056265736369,0.0,0.0,0.0,1.0
1718122990.7923646,map,True,False,3,1,0.0,0.0,1.9913334846496582,-1.7440993785858154,0.0,0.0,0.0,0.046484577461242814,0.9989190070347446,3.7834857843326444,-2.373888837560955,0.6817056265736369,0.0,0.0,0.0,1.0
1718122990.8424351,map,True,False,3,1,0.0,0.0,2.146653890609741,-1.7684372663497925,0.0,0.0,0.0,0.04610077042684071,0.9989367882822047,3.7834857843326444,-2.373888837560955,0.6817056265736369,0.0,0.0,0.0,1.0
1718122990.9433627,map,True,False,3,1,0.0,0.0,2.146653890609741,-1.7684372663497925,0.0,0.0,0.0,0.04610077042684071,0.9989367882822047,3.7550629468183505,-2.26159235851154,0.681368073278988,0.0,0.0,0.0,1.0
1718122990.994562,map,True,False,3,1,0.0,0.0,2.146653890609741,-1.7684372663497925,0.0,0.0,0.0,0.04610077042684071,0.9989367882822047,3.7584471336141223,-2.2276981816981345,0.6798833336099634,0.0,0.0,0.0,1.0
1718122991.092764,map,True,False,3,1,0.0,0.0,2.146653890609741,-1.7684372663497925,0.0,0.0,0.0,0.04610077042684071,0.9989367882822047,3.7584471336141223,-2.2276981816981345,0.6798833336099634,0.0,0.0,0.0,1.0
1718122991.1961925,map,True,False,3,1,0.0,0.0,2.146653890609741,-1.7684372663497925,0.0,0.0,0.0,0.04610077042684071,0.9989367882822047,3.7584471336141223,-2.2276981816981345,0.6798833336099634,0.0,0.0,0.0,1.0
1718122991.2465081,map,True,False,3,1,0.0,0.0,2.146653890609741,-1.7684372663497925,0.0,0.0,0.0,0.04610077042684071,0.9989367882822047,3.7584471336141223,-2.2276981816981345,0.6798833336099634,0.0,0.0,0.0,1.0
1718122991.34364,map,True,False,3,8,0.0,0.0,2.146653890609741,-1.7684372663497925,0.0,0.0,0.0,0.04610077042684071,0.9989367882822047,9.584534019972967,-5.826258278203821,0.6852155322311827,0.0,0.0,0.0,1.0
1718122991.3938627,map,True,False,3,8,0.0,0.0,2.146653890609741,-1.7684372663497925,0.0,0.0,0.0,0.04610077042684071,0.9989367882822047,9.584534019972967,-5.826258278203821,0.6852155322311827,0.0,0.0,0.0,1.0
1718122991.444464,map,True,False,3,8,0.0,0.0,2.146653890609741,-1.7684372663497925,0.0,0.0,0.0,0.04610077042684071,0.9989367882822047,9.584534019972967,-5.826258278203821,0.6852155322311827,0.0,0.0,0.0,1.0
1718122991.4941158,map,True,False,3,8,0.0,0.0,2.146653890609741,-1.7684372663497925,0.0,0.0,0.0,0.04610077042684071,0.9989367882822047,9.584534019972967,-5.826258278203821,0.6852155322311827,0.0,0.0,0.0,1.0
1718122991.594427,map,True,False,3,8,0.0,0.0,2.282449960708618,-1.8021471500396729,0.0,0.0,0.0,0.04635447942109545,0.9989250485175788,9.584534019972967,-5.826258278203821,0.6852155322311827,0.0,0.0,0.0,1.0
1718122991.6956651,map,True,False,3,8,0.0,0.0,2.282449960708618,-1.8021471500396729,0.0,0.0,0.0,0.04635447942109545,0.9989250485175788,9.584534019972967,-5.826258278203821,0.6852155322311827,0.0,0.0,0.0,1.0
1718122991.7462912,map,True,False,3,8,0.0,0.0,2.282449960708618,-1.8021471500396729,0.0,0.0,0.0,0.04635447942109545,0.9989250485175788,9.584534019972967,-5.826258278203821,0.6852155322311827,0.0,0.0,0.0,1.0
1718122991.847403,map,True,False,3,8,0.0,0.0,2.282449960708618,-1.8021471500396729,0.0,0.0,0.0,0.04635447942109545,0.9989250485175788,9.584534019972967,-5.826258278203821,0.6852155322311827,0.0,0.0,0.0,1.0
1718122991.900879,map,True,False,3,8,0.0,0.0,2.282449960708618,-1.8021471500396729,0.0,0.0,0.0,0.04635447942109545,0.9989250485175788,9.584534019972967,-5.826258278203821,0.6852155322311827,0.0,0.0,0.0,1.0
1718122991.950882,map,True,False,3,8,0.0,0.0,2.282449960708618,-1.8021471500396729,0.0,0.0,0.0,0.04635447942109545,0.9989250485175788,9.584534019972967,-5.826258278203821,0.6852155322311827,0.0,0.0,0.0,1.0
1718122991.998336,map,True,False,3,8,0.0,0.0,2.282449960708618,-1.8021471500396729,0.0,0.0,0.0,0.04635447942109545,0.9989250485175788,9.584534019972967,-5.826258278203821,0.6852155322311827,0.0,0.0,0.0,1.0
1718122992.0984674,map,True,False,3,8,0.0,0.0,2.282449960708618,-1.8021471500396729,0.0,0.0,0.0,0.04635447942109545,0.9989250485175788,9.584534019972967,-5.826258278203821,0.6852155322311827,0.0,0.0,0.0,1.0
1718122992.1483796,map,True,False,3,8,0.0,0.0,2.282449960708618,-1.8021471500396729,0.0,0.0,0.0,0.04635447942109545,0.9989250485175788,9.584534019972967,-5.826258278203821,0.6852155322311827,0.0,0.0,0.0,1.0
1718122992.1992135,map,True,False,3,8,0.0,0.0,2.282449960708618,-1.8021471500396729,0.0,0.0,0.0,0.04635447942109545,0.9989250485175788,9.584534019972967,-5.826258278203821,0.6852155322311827,0.0,0.0,0.0,1.0
1718122992.250018,map,True,False,3,8,0.0,0.0,2.282449960708618,-1.8021471500396729,0.0,0.0,0.0,0.04635447942109545,0.9989250485175788,9.584534019972967,-5.826258278203821,0.6852155322311827,0.0,0.0,0.0,1.0
