car_pos_meter , car_pos_cell, car_speed, ped_pos_meter, ped_pos_cell, ped_speed
-5.125, 5, 2, 4.099874, 5, 1
-5.104175, 5, 2, 4.086423, 5, 1
-5.08335, 5, 2, 4.073792, 5, 1
-5.062525, 5, 1, 4.061168, 5, 1
-5.039526, 5, 1, 3.984456, 5, 1
-4.967655, 4, 2, 3.783211, 4, 1
-4.447032, 4, 1, 3.612538, 4, 1
-4.375161, 4, 1, 3.506579, 4, 1
-4.30329, 4, 1, 3.479795, 4, 1
-4.231419, 4, 2, 3.46881, 4, 1
-3.710796, 3, 2, 3.430018, 4, 1
-3.190173, 3, 2, 3.429477, 4, 1
-2.66955, 2, 2, 3.420935, 4, 1
-2.148928, 2, 2, 3.405773, 4, 1
-1.628303, 1, 2, 3.397179, 4, 1
-1.107677, 1, 2, 3.349829, 4, 1
-0.5870513, 0, 2, 3.160436, 4, 1
-0.08725122, 0, 2, 2.991568, 3, 1
0.4333737, 0, 2, 3.014141, 3, 1
0.9539994, 0, 2, 2.966044, 3, 1
1.474625, -1, 2, 2.906063, 3, 1
1.995251, -1, 2, 2.812241, 3, 1
2.515873, -2, 2, 2.534766, 3, 1
3.036496, -3, 2, 2.084274, 2, 1
3.557119, -3, 2, 1.532157, 1, 1
4.077742, -4, 2, 0.9382908, 1, 1
4.598364, -4, 2, 0.3361807, 0, 1
5.118987, -5, 2, -0.2180417, 0, 1
5.63961, -5, 2, -0.6949916, 0, 1
6.160233, -6, 2, -0.9793181, -1, 1
6.680855, -6, 2, -1.136575, -1, 1
7.201478, -7, 2, -1.153823, -1, 1
7.722101, -7, 2, -1.041576, -1, 1
8.242729, -8, 2, -1.036638, -1, 1
