car_pos_meter , car_pos_cell, car_speed, ped_pos_meter, ped_pos_cell, ped_speed
-3.727273, 3, 1, 3.99579, 3, 1
-3.719727, 3, 1, 3.983788, 3, 1
-3.712182, 3, 2, 3.972392, 3, 1
-3.575873, 3, 2, 3.887555, 3, 1
-3.197239, 3, 2, 3.511249, 3, 1
-2.818604, 2, 1, 3.13661, 2, 1
-2.629967, 2, 1, 2.77772, 2, 1
-2.44133, 2, 2, 2.486999, 2, 1
-2.062696, 2, 2, 2.233999, 2, 1
-1.684061, 1, 2, 2.166288, 1, 1
-1.305425, 1, 2, 2.230801, 2, 1
-0.9267884, 0, 2, 2.409451, 2, 1
-0.5481516, 0, 2, 2.544242, 2, 1
-0.1846604, 0, 2, 2.576416, 2, 1
0.1939759, 0, 2, 2.531139, 2, 1
0.5726126, 0, 2, 2.29288, 2, 1
0.9512495, 0, 2, 1.943437, 1, 1
1.329886, -1, 2, 1.587229, 1, 1
1.708522, -1, 2, 1.200289, 1, 1
2.087157, -2, 2, 0.7803671, 0, 1
2.465791, -2, 2, 0.3730936, 0, 1
2.844426, -2, 2, 0.009376049, 0, 1
3.223061, -3, 2, -0.3397207, 0, 1
3.601695, -3, 2, -0.6875086, 0, 1
3.98033, -3, 2, -0.8814354, 0, 1
4.358965, -4, 2, -1.044347, 0, 1
4.737599, -4, 2, -0.9997926, 0, 1
5.116234, -5, 2, -0.6598711, 0, 1
5.494869, -5, 2, -0.3334713, 0, 1
5.873505, -5, 2, -0.01647806, 0, 1
