timestamp_sec,frame_id,game_played,yielding,player1discrete,player2discrete,player1yieldprob,player2yieldprob,player1_pose_x,player1_pose_y,player1_pose_z,player1_pose_orient_x,player1_pose_orient_y,player1_pose_orient_z,player1_pose_orient_w,player2_pose_x,player2_pose_y,player2_pose_z,player2_pose_orient_x,player2_pose_orient_y,player2_pose_orient_z,player2_pose_orient_w
1717759079.7614036,map,True,False,6,8,0.0,0.0,1.9327292442321777,-2.3236939907073975,0.0,0.0,0.0,0.02718080858504574,0.9996305319606885,3.7909163405388107,-10.745495183420392,0.7974464335661314,0.0,0.0,0.0,1.0
1717759079.8110814,map,True,False,6,8,0.0,0.0,1.9327292442321777,-2.3236939907073975,0.0,0.0,0.0,0.02718080858504574,0.9996305319606885,3.770379616882032,-10.758154128736528,0.7975375979798137,0.0,0.0,0.0,1.0
1717759079.9141161,map,True,False,6,8,0.0,0.0,1.9327292442321777,-2.3236939907073975,0.0,0.0,0.0,0.02718080858504574,0.9996305319606885,3.7268699905806515,-10.487576777126527,0.7937553504373763,0.0,0.0,0.0,1.0
1717759079.9631488,map,True,False,6,8,0.0,0.0,1.9327292442321777,-2.3236939907073975,0.0,0.0,0.0,0.02718080858504574,0.9996305319606885,3.7268699905806515,-10.487576777126527,0.7937553504373763,0.0,0.0,0.0,1.0
1717759080.0126114,map,True,False,6,8,0.0,0.0,1.9327292442321777,-2.3236939907073975,0.0,0.0,0.0,0.02718080858504574,0.9996305319606885,3.7268699905806515,-10.487576777126527,0.7937553504373763,0.0,0.0,0.0,1.0
1717759080.1108792,map,True,False,6,8,0.0,0.0,1.9327292442321777,-2.3236939907073975,0.0,0.0,0.0,0.02718080858504574,0.9996305319606885,3.7268699905806515,-10.487576777126527,0.7937553504373763,0.0,0.0,0.0,1.0
1717759080.2114246,map,True,False,6,8,0.0,0.0,1.9327292442321777,-2.3236939907073975,0.0,0.0,0.0,0.02718080858504574,0.9996305319606885,3.737916975206739,-10.575669815701362,0.7950057236821321,0.0,0.0,0.0,1.0
1717759080.2617865,map,True,False,6,8,0.0,0.0,1.9327292442321777,-2.3236939907073975,0.0,0.0,0.0,0.02718080858504574,0.9996305319606885,3.737916975206739,-10.575669815701362,0.7950057236821321,0.0,0.0,0.0,1.0
1717759080.3618767,map,True,False,6,8,0.0,0.0,1.9327292442321777,-2.3236939907073975,0.0,0.0,0.0,0.02718080858504574,0.9996305319606885,3.737916975206739,-10.575669815701362,0.7950057236821321,0.0,0.0,0.0,1.0
1717759080.4632487,map,True,False,6,8,0.0,0.0,1.9344487190246582,-2.3245744705200195,0.0,0.0,0.0,0.027045104867659948,0.9996342139010843,3.737916975206739,-10.575669815701362,0.7950057236821321,0.0,0.0,0.0,1.0
1717759080.5123243,map,True,False,6,9,0.0,0.0,1.9344487190246582,-2.3245744705200195,0.0,0.0,0.0,0.027045104867659948,0.9996342139010843,3.784813096064418,-10.961307763942536,0.8002833727152086,0.0,0.0,0.0,1.0
1717759080.612305,map,True,False,6,9,0.0,0.0,1.9344487190246582,-2.3245744705200195,0.0,0.0,0.0,0.027045104867659948,0.9996342139010843,3.784813096064418,-10.961307763942536,0.8002833727152086,0.0,0.0,0.0,1.0
1717759080.6692219,map,True,False,6,9,0.0,0.0,1.9344487190246582,-2.3245744705200195,0.0,0.0,0.0,0.027045104867659948,0.9996342139010843,3.784813096064418,-10.961307763942536,0.8002833727152086,0.0,0.0,0.0,1.0
1717759080.716578,map,True,False,6,9,0.0,0.0,1.9344487190246582,-2.3245744705200195,0.0,0.0,0.0,0.027045104867659948,0.9996342139010843,3.784813096064418,-10.961307763942536,0.8002833727152086,0.0,0.0,0.0,1.0
1717759080.768577,map,True,False,6,9,0.0,0.0,1.9344487190246582,-2.3245744705200195,0.0,0.0,0.0,0.027045104867659948,0.9996342139010843,3.784813096064418,-10.961307763942536,0.8002833727152086,0.0,0.0,0.0,1.0
1717759080.866582,map,True,False,6,9,0.0,0.0,1.9344487190246582,-2.3245744705200195,0.0,0.0,0.0,0.027045104867659948,0.9996342139010843,3.7973970934533603,-11.062240796685828,0.8016794949884921,0.0,0.0,0.0,1.0
1717759080.966887,map,True,False,6,8,0.0,0.0,1.9344487190246582,-2.3245744705200195,0.0,0.0,0.0,0.027045104867659948,0.9996342139010843,3.761789495774115,-10.765371962637175,0.7975831801866572,0.0,0.0,0.0,1.0
1717759081.0187037,map,True,False,6,8,0.0,0.0,1.9344487190246582,-2.3245744705200195,0.0,0.0,0.0,0.027045104867659948,0.9996342139010843,3.761789495774115,-10.765371962637175,0.7975831801866572,0.0,0.0,0.0,1.0
1717759081.1181188,map,True,False,6,8,0.0,0.0,1.9344487190246582,-2.3245744705200195,0.0,0.0,0.0,0.027045104867659948,0.9996342139010843,3.761789495774115,-10.765371962637175,0.7975831801866572,0.0,0.0,0.0,1.0
1717759081.170648,map,True,False,6,8,0.0,0.0,1.9344487190246582,-2.3245744705200195,0.0,0.0,0.0,0.027045104867659948,0.9996342139010843,3.761789495774115,-10.765371962637175,0.7975831801866572,0.0,0.0,0.0,1.0
1717759081.2185237,map,True,False,6,8,0.0,0.0,1.9329633712768555,-2.3246374130249023,0.0,0.0,0.0,0.027241087391394025,0.9996288922257831,3.7394265454381896,-10.579460688207252,0.7950057236821284,0.0,0.0,0.0,1.0
1717759081.2700772,map,True,False,6,8,0.0,0.0,1.9329633712768555,-2.3246374130249023,0.0,0.0,0.0,0.027241087391394025,0.9996288922257831,3.7394265454381896,-10.579460688207252,0.7950057236821284,0.0,0.0,0.0,1.0
1717759081.319414,map,True,False,6,8,0.0,0.0,1.9329633712768555,-2.3246374130249023,0.0,0.0,0.0,0.027241087391394025,0.9996288922257831,3.7394265454381896,-10.579460688207252,0.7950057236821284,0.0,0.0,0.0,1.0
1717759081.372313,map,True,False,6,8,0.0,0.0,1.9329633712768555,-2.3246374130249023,0.0,0.0,0.0,0.027241087391394025,0.9996288922257831,3.7394265454381896,-10.579460688207252,0.7950057236821284,0.0,0.0,0.0,1.0
1717759081.4207568,map,True,False,6,8,0.0,0.0,1.9329633712768555,-2.3246374130249023,0.0,0.0,0.0,0.027241087391394025,0.9996288922257831,3.7394265454381896,-10.579460688207252,0.7950057236821284,0.0,0.0,0.0,1.0
1717759081.4733212,map,True,False,6,8,0.0,0.0,1.9329633712768555,-2.3246374130249023,0.0,0.0,0.0,0.027241087391394025,0.9996288922257831,3.7394265454381896,-10.579460688207252,0.7950057236821284,0.0,0.0,0.0,1.0
1717759081.5220327,map,True,False,6,8,0.0,0.0,1.9329633712768555,-2.3246374130249023,0.0,0.0,0.0,0.027241087391394025,0.9996288922257831,3.7394265454381896,-10.579460688207252,0.7950057236821284,0.0,0.0,0.0,1.0
1717759081.5749803,map,True,False,6,8,0.0,0.0,1.9329633712768555,-2.3246374130249023,0.0,0.0,0.0,0.027241087391394025,0.9996288922257831,3.749069525105397,-10.669662048614668,0.7962791099313906,0.0,0.0,0.0,1.0
1717759081.622801,map,True,False,6,8,0.0,0.0,1.9329633712768555,-2.3246374130249023,0.0,0.0,0.0,0.027241087391394025,0.9996288922257831,3.749069525105397,-10.669662048614668,0.7962791099313906,0.0,0.0,0.0,1.0
1717759081.672242,map,True,False,6,8,0.0,0.0,1.9329633712768555,-2.3246374130249023,0.0,0.0,0.0,0.027241087391394025,0.9996288922257831,3.749069525105397,-10.669662048614668,0.7962791099313906,0.0,0.0,0.0,1.0
1717759081.7231395,map,True,False,6,8,0.0,0.0,1.9329633712768555,-2.3246374130249023,0.0,0.0,0.0,0.027241087391394025,0.9996288922257831,3.749069525105397,-10.669662048614668,0.7962791099313906,0.0,0.0,0.0,1.0
1717759081.9233313,map,True,False,6,8,0.0,0.0,1.9329633712768555,-2.3246374130249023,0.0,0.0,0.0,0.027241087391394025,0.9996288922257831,3.7398906983984492,-10.580234540544007,0.7950057236821328,0.0,0.0,0.0,1.0
1717759081.9764316,map,True,False,6,8,0.0,0.0,1.9329633712768555,-2.3246374130249023,0.0,0.0,0.0,0.027241087391394025,0.9996288922257831,3.7398906983984492,-10.580234540544007,0.7950057236821328,0.0,0.0,0.0,1.0
1717759082.0725439,map,True,False,6,8,0.0,0.0,1.9349098205566406,-2.322885751724243,0.0,0.0,0.0,0.026999048741440487,0.9996354660558615,3.7398906983984492,-10.580234540544007,0.7950057236821328,0.0,0.0,0.0,1.0
1717759082.1736066,map,True,False,6,8,0.0,0.0,1.9349098205566406,-2.322885751724243,0.0,0.0,0.0,0.026999048741440487,0.9996354660558615,3.7398906983984492,-10.580234540544007,0.7950057236821328,0.0,0.0,0.0,1.0
1717759082.2244303,map,True,False,6,8,0.0,0.0,1.9349098205566406,-2.322885751724243,0.0,0.0,0.0,0.026999048741440487,0.9996354660558615,3.728137262528619,-10.488712609766537,0.7937553504373762,0.0,0.0,0.0,1.0
1717759082.2743444,map,True,False,6,8,0.0,0.0,1.9349098205566406,-2.322885751724243,0.0,0.0,0.0,0.026999048741440487,0.9996354660558615,3.728137262528619,-10.488712609766537,0.7937553504373762,0.0,0.0,0.0,1.0
1717759082.3305762,map,True,False,6,8,0.0,0.0,1.9349098205566406,-2.322885751724243,0.0,0.0,0.0,0.026999048741440487,0.9996354660558615,3.728137262528619,-10.488712609766537,0.7937553504373762,0.0,0.0,0.0,1.0
1717759082.3790524,map,True,False,6,8,0.0,0.0,1.9349098205566406,-2.322885751724243,0.0,0.0,0.0,0.026999048741440487,0.9996354660558615,3.728137262528619,-10.488712609766537,0.7937553504373762,0.0,0.0,0.0,1.0
1717759082.4267943,map,True,False,6,8,0.0,0.0,1.9349098205566406,-2.322885751724243,0.0,0.0,0.0,0.026999048741440487,0.9996354660558615,3.728137262528619,-10.488712609766537,0.7937553504373762,0.0,0.0,0.0,1.0
1717759082.4766285,map,True,False,6,8,0.0,0.0,1.9349098205566406,-2.322885751724243,0.0,0.0,0.0,0.026999048741440487,0.9996354660558615,3.728137262528619,-10.488712609766537,0.7937553504373762,0.0,0.0,0.0,1.0
1717759082.5277112,map,True,False,6,8,0.0,0.0,1.9349098205566406,-2.322885751724243,0.0,0.0,0.0,0.026999048741440487,0.9996354660558615,3.746929699925863,-10.473143806592663,0.781708670019466,0.0,0.0,0.0,1.0
1717759082.5789304,map,True,False,6,8,0.0,0.0,1.9349098205566406,-2.322885751724243,0.0,0.0,0.0,0.026999048741440487,0.9996354660558615,3.6672998629868596,-9.90364002471865,0.7857595226589302,0.0,0.0,0.0,1.0
1717759082.6301067,map,True,False,6,8,0.0,0.0,1.9349098205566406,-2.322885751724243,0.0,0.0,0.0,0.026999048741440487,0.9996354660558615,3.6672998629868596,-9.90364002471865,0.7857595226589302,0.0,0.0,0.0,1.0
1717759082.6725647,map,True,False,6,8,0.0,0.0,1.9349098205566406,-2.322885751724243,0.0,0.0,0.0,0.026999048741440487,0.9996354660558615,3.6672998629868596,-9.90364002471865,0.7857595226589302,0.0,0.0,0.0,1.0
1717759082.6773179,map,True,False,6,8,0.0,0.0,1.9349098205566406,-2.322885751724243,0.0,0.0,0.0,0.026999048741440487,0.9996354660558615,3.6672998629868596,-9.90364002471865,0.7857595226589302,0.0,0.0,0.0,1.0
1717759082.6812673,map,True,False,6,8,0.0,0.0,1.9349098205566406,-2.322885751724243,0.0,0.0,0.0,0.026999048741440487,0.9996354660558615,3.6672998629868596,-9.90364002471865,0.7857595226589302,0.0,0.0,0.0,1.0
1717759082.6848197,map,True,False,6,8,0.0,0.0,1.9349098205566406,-2.322885751724243,0.0,0.0,0.0,0.026999048741440487,0.9996354660558615,3.6672998629868596,-9.90364002471865,0.7857595226589302,0.0,0.0,0.0,1.0
1717759082.7358682,map,True,False,6,8,0.0,0.0,1.9349098205566406,-2.322885751724243,0.0,0.0,0.0,0.026999048741440487,0.9996354660558615,3.6672998629868596,-9.90364002471865,0.7857595226589302,0.0,0.0,0.0,1.0
1717759082.886502,map,True,False,6,8,0.0,0.0,1.9337491989135742,-2.324369192123413,0.0,0.0,0.0,0.02713947185285943,0.9996316499602181,3.711911434073836,-10.088727423545148,0.776970380501939,0.0,0.0,0.0,1.0
1717759082.9875777,map,True,False,6,8,0.0,0.0,1.9337491989135742,-2.324369192123413,0.0,0.0,0.0,0.02713947185285943,0.9996316499602181,3.778921504093338,-10.455379695937516,0.7815763900195896,0.0,0.0,0.0,1.0
1717759083.039007,map,True,False,6,8,0.0,0.0,1.9337491989135742,-2.324369192123413,0.0,0.0,0.0,0.02713947185285943,0.9996316499602181,3.778921504093338,-10.455379695937516,0.7815763900195896,0.0,0.0,0.0,1.0
1717759083.0882103,map,True,False,6,8,0.0,0.0,1.9337491989135742,-2.324369192123413,0.0,0.0,0.0,0.02713947185285943,0.9996316499602181,3.778921504093338,-10.455379695937516,0.7815763900195896,0.0,0.0,0.0,1.0
1717759083.1384559,map,True,False,6,8,0.0,0.0,1.9337491989135742,-2.324369192123413,0.0,0.0,0.0,0.02713947185285943,0.9996316499602181,3.778921504093338,-10.455379695937516,0.7815763900195896,0.0,0.0,0.0,1.0
1717759083.1941605,map,True,False,6,8,0.0,0.0,1.9337491989135742,-2.324369192123413,0.0,0.0,0.0,0.02713947185285943,0.9996316499602181,3.778921504093338,-10.455379695937516,0.7815763900195896,0.0,0.0,0.0,1.0
1717759083.2404747,map,True,False,6,8,0.0,0.0,1.9337491989135742,-2.324369192123413,0.0,0.0,0.0,0.02713947185285943,0.9996316499602181,3.7472454095866494,-10.248839734075613,0.7673242587414875,0.0,0.0,0.0,1.0
1717759083.3407557,map,True,False,6,8,0.0,0.0,1.9337491989135742,-2.324369192123413,0.0,0.0,0.0,0.02713947185285943,0.9996316499602181,3.7472454095866494,-10.248839734075613,0.7673242587414875,0.0,0.0,0.0,1.0
1717759083.3883293,map,True,False,6,8,0.0,0.0,1.9337491989135742,-2.324369192123413,0.0,0.0,0.0,0.02713947185285943,0.9996316499602181,3.7472454095866494,-10.248839734075613,0.7673242587414875,0.0,0.0,0.0,1.0
1717759083.409001,map,True,False,6,8,0.0,0.0,1.9337491989135742,-2.324369192123413,0.0,0.0,0.0,0.02713947185285943,0.9996316499602181,3.7472454095866494,-10.248839734075613,0.7673242587414875,0.0,0.0,0.0,1.0
1717759083.420657,map,True,False,6,8,0.0,0.0,1.9337491989135742,-2.324369192123413,0.0,0.0,0.0,0.02713947185285943,0.9996316499602181,3.7472454095866494,-10.248839734075613,0.7673242587414875,0.0,0.0,0.0,1.0
1717759083.425187,map,True,False,6,8,0.0,0.0,1.9337491989135742,-2.324369192123413,0.0,0.0,0.0,0.02713947185285943,0.9996316499602181,3.7472454095866494,-10.248839734075613,0.7673242587414875,0.0,0.0,0.0,1.0
1717759083.4281952,map,True,False,6,8,0.0,0.0,1.9337491989135742,-2.324369192123413,0.0,0.0,0.0,0.02713947185285943,0.9996316499602181,3.7472454095866494,-10.248839734075613,0.7673242587414875,0.0,0.0,0.0,1.0
1717759083.432573,map,True,False,6,8,0.0,0.0,1.9337491989135742,-2.324369192123413,0.0,0.0,0.0,0.02713947185285943,0.9996316499602181,3.7472454095866494,-10.248839734075613,0.7673242587414875,0.0,0.0,0.0,1.0
1717759083.4390254,map,True,False,6,8,0.0,0.0,1.9337491989135742,-2.324369192123413,0.0,0.0,0.0,0.02713947185285943,0.9996316499602181,3.7472454095866494,-10.248839734075613,0.7673242587414875,0.0,0.0,0.0,1.0
1717759083.4449847,map,True,False,6,8,0.0,0.0,1.9337491989135742,-2.324369192123413,0.0,0.0,0.0,0.02713947185285943,0.9996316499602181,3.7472454095866494,-10.248839734075613,0.7673242587414875,0.0,0.0,0.0,1.0
1717759083.450517,map,True,False,6,8,0.0,0.0,1.9337491989135742,-2.324369192123413,0.0,0.0,0.0,0.02713947185285943,0.9996316499602181,3.7472454095866494,-10.248839734075613,0.7673242587414875,0.0,0.0,0.0,1.0
1717759083.4527512,map,True,False,6,8,0.0,0.0,1.9337491989135742,-2.324369192123413,0.0,0.0,0.0,0.02713947185285943,0.9996316499602181,3.7472454095866494,-10.248839734075613,0.7673242587414875,0.0,0.0,0.0,1.0
1717759083.459272,map,True,False,6,8,0.0,0.0,1.9337491989135742,-2.324369192123413,0.0,0.0,0.0,0.02713947185285943,0.9996316499602181,3.7472454095866494,-10.248839734075613,0.7673242587414875,0.0,0.0,0.0,1.0
1717759083.4636028,map,True,False,6,8,0.0,0.0,1.9337491989135742,-2.324369192123413,0.0,0.0,0.0,0.02713947185285943,0.9996316499602181,3.7472454095866494,-10.248839734075613,0.7673242587414875,0.0,0.0,0.0,1.0
1717759083.4695985,map,True,False,6,8,0.0,0.0,1.9337491989135742,-2.324369192123413,0.0,0.0,0.0,0.02713947185285943,0.9996316499602181,3.7472454095866494,-10.248839734075613,0.7673242587414875,0.0,0.0,0.0,1.0
1717759083.4800425,map,True,False,6,8,0.0,0.0,1.9337491989135742,-2.324369192123413,0.0,0.0,0.0,0.02713947185285943,0.9996316499602181,3.7472454095866494,-10.248839734075613,0.7673242587414875,0.0,0.0,0.0,1.0
1717759083.484681,map,True,False,6,8,0.0,0.0,1.9337491989135742,-2.324369192123413,0.0,0.0,0.0,0.02713947185285943,0.9996316499602181,3.7472454095866494,-10.248839734075613,0.7673242587414875,0.0,0.0,0.0,1.0
1717759083.4895144,map,True,False,6,8,0.0,0.0,1.9337491989135742,-2.324369192123413,0.0,0.0,0.0,0.02713947185285943,0.9996316499602181,3.7472454095866494,-10.248839734075613,0.7673242587414875,0.0,0.0,0.0,1.0
1717759083.4972875,map,True,False,6,8,0.0,0.0,1.9337491989135742,-2.324369192123413,0.0,0.0,0.0,0.02713947185285943,0.9996316499602181,3.7472454095866494,-10.248839734075613,0.7673242587414875,0.0,0.0,0.0,1.0
1717759083.5012422,map,True,False,6,8,0.0,0.0,1.9337491989135742,-2.324369192123413,0.0,0.0,0.0,0.02713947185285943,0.9996316499602181,3.7472454095866494,-10.248839734075613,0.7673242587414875,0.0,0.0,0.0,1.0
1717759083.5071383,map,True,False,6,8,0.0,0.0,1.9337491989135742,-2.324369192123413,0.0,0.0,0.0,0.02713947185285943,0.9996316499602181,3.7472454095866494,-10.248839734075613,0.7673242587414875,0.0,0.0,0.0,1.0
1717759083.5128531,map,True,False,6,8,0.0,0.0,1.9337491989135742,-2.324369192123413,0.0,0.0,0.0,0.02713947185285943,0.9996316499602181,3.7472454095866494,-10.248839734075613,0.7673242587414875,0.0,0.0,0.0,1.0
1717759083.5895634,map,True,False,6,8,0.0,0.0,1.9337491989135742,-2.324369192123413,0.0,0.0,0.0,0.02713947185285943,0.9996316499602181,3.8364872486905313,-10.555636197330932,0.7706020355822079,0.0,0.0,0.0,1.0
1717759083.6457758,map,True,False,6,8,0.0,0.0,1.9337491989135742,-2.324369192123413,0.0,0.0,0.0,0.02713947185285943,0.9996316499602181,3.8364872486905313,-10.555636197330932,0.7706020355822079,0.0,0.0,0.0,1.0
1717759083.6935596,map,True,False,6,8,0.0,0.0,1.9337491989135742,-2.324369192123413,0.0,0.0,0.0,0.02713947185285943,0.9996316499602181,3.8364872486905313,-10.555636197330932,0.7706020355822079,0.0,0.0,0.0,1.0
1717759083.696457,map,True,False,6,8,0.0,0.0,1.9337491989135742,-2.324369192123413,0.0,0.0,0.0,0.02713947185285943,0.9996316499602181,3.8364872486905313,-10.555636197330932,0.7706020355822079,0.0,0.0,0.0,1.0
1717759083.7012901,map,True,False,6,8,0.0,0.0,1.9337491989135742,-2.324369192123413,0.0,0.0,0.0,0.02713947185285943,0.9996316499602181,3.8364872486905313,-10.555636197330932,0.7706020355822079,0.0,0.0,0.0,1.0
1717759083.709482,map,True,False,6,8,0.0,0.0,1.9337491989135742,-2.324369192123413,0.0,0.0,0.0,0.02713947185285943,0.9996316499602181,3.8364872486905313,-10.555636197330932,0.7706020355822079,0.0,0.0,0.0,1.0
1717759083.7136748,map,True,False,6,8,0.0,0.0,1.9337491989135742,-2.324369192123413,0.0,0.0,0.0,0.02713947185285943,0.9996316499602181,3.8364872486905313,-10.555636197330932,0.7706020355822079,0.0,0.0,0.0,1.0
1717759083.7639112,map,True,False,6,8,0.0,0.0,1.9384050369262695,-2.325226068496704,0.0,0.0,0.0,0.026896361267468572,0.999638223772161,3.8364872486905313,-10.555636197330932,0.7706020355822079,0.0,0.0,0.0,1.0
1717759083.8892303,map,True,False,6,8,0.0,0.0,1.9384050369262695,-2.325226068496704,0.0,0.0,0.0,0.026896361267468572,0.999638223772161,3.8534226389837984,-10.243784342443552,0.7439047832624753,0.0,0.0,0.0,1.0
1717759083.8938162,map,True,False,6,8,0.0,0.0,1.9384050369262695,-2.325226068496704,0.0,0.0,0.0,0.026896361267468572,0.999638223772161,3.8534226389837984,-10.243784342443552,0.7439047832624753,0.0,0.0,0.0,1.0
1717759083.9491405,map,True,False,6,8,0.0,0.0,1.9384050369262695,-2.325226068496704,0.0,0.0,0.0,0.026896361267468572,0.999638223772161,3.860744913382514,-10.060046363845666,0.7538676631993647,0.0,0.0,0.0,1.0
1717759083.9532387,map,True,False,6,8,0.0,0.0,1.9384050369262695,-2.325226068496704,0.0,0.0,0.0,0.026896361267468572,0.999638223772161,3.860744913382514,-10.060046363845666,0.7538676631993647,0.0,0.0,0.0,1.0
1717759083.9844766,map,True,False,6,8,0.0,0.0,1.9384050369262695,-2.325226068496704,0.0,0.0,0.0,0.026896361267468572,0.999638223772161,3.860744913382514,-10.060046363845666,0.7538676631993647,0.0,0.0,0.0,1.0
1717759083.9935071,map,True,False,6,8,0.0,0.0,1.9384050369262695,-2.325226068496704,0.0,0.0,0.0,0.026896361267468572,0.999638223772161,3.860744913382514,-10.060046363845666,0.7538676631993647,0.0,0.0,0.0,1.0
1717759083.9965112,map,True,False,6,8,0.0,0.0,1.9384050369262695,-2.325226068496704,0.0,0.0,0.0,0.026896361267468572,0.999638223772161,3.860744913382514,-10.060046363845666,0.7538676631993647,0.0,0.0,0.0,1.0
1717759084.0010078,map,True,False,6,8,0.0,0.0,1.9384050369262695,-2.325226068496704,0.0,0.0,0.0,0.026896361267468572,0.999638223772161,3.860744913382514,-10.060046363845666,0.7538676631993647,0.0,0.0,0.0,1.0
1717759084.008284,map,True,False,6,8,0.0,0.0,1.9384050369262695,-2.325226068496704,0.0,0.0,0.0,0.026896361267468572,0.999638223772161,3.860744913382514,-10.060046363845666,0.7538676631993647,0.0,0.0,0.0,1.0
1717759084.0172086,map,True,False,6,8,0.0,0.0,1.9384050369262695,-2.325226068496704,0.0,0.0,0.0,0.026896361267468572,0.999638223772161,3.860744913382514,-10.060046363845666,0.7538676631993647,0.0,0.0,0.0,1.0
1717759084.020954,map,True,False,6,8,0.0,0.0,1.9384050369262695,-2.325226068496704,0.0,0.0,0.0,0.026896361267468572,0.999638223772161,3.860744913382514,-10.060046363845666,0.7538676631993647,0.0,0.0,0.0,1.0
1717759084.1010392,map,True,False,6,8,0.0,0.0,1.9384050369262695,-2.325226068496704,0.0,0.0,0.0,0.026896361267468572,0.999638223772161,3.860744913382514,-10.060046363845666,0.7538676631993647,0.0,0.0,0.0,1.0
1717759084.1050866,map,True,False,6,8,0.0,0.0,1.9384050369262695,-2.325226068496704,0.0,0.0,0.0,0.026896361267468572,0.999638223772161,3.860744913382514,-10.060046363845666,0.7538676631993647,0.0,0.0,0.0,1.0
1717759084.1142538,map,True,False,6,8,0.0,0.0,1.9384050369262695,-2.325226068496704,0.0,0.0,0.0,0.026896361267468572,0.999638223772161,3.860744913382514,-10.060046363845666,0.7538676631993647,0.0,0.0,0.0,1.0
1717759084.1195257,map,True,False,6,8,0.0,0.0,1.9384050369262695,-2.325226068496704,0.0,0.0,0.0,0.026896361267468572,0.999638223772161,3.860744913382514,-10.060046363845666,0.7538676631993647,0.0,0.0,0.0,1.0
1717759084.1396403,map,True,False,6,8,0.0,0.0,1.9384050369262695,-2.325226068496704,0.0,0.0,0.0,0.026896361267468572,0.999638223772161,3.860744913382514,-10.060046363845666,0.7538676631993647,0.0,0.0,0.0,1.0
1717759084.14264,map,True,False,6,8,0.0,0.0,1.9384050369262695,-2.325226068496704,0.0,0.0,0.0,0.026896361267468572,0.999638223772161,3.860744913382514,-10.060046363845666,0.7538676631993647,0.0,0.0,0.0,1.0
1717759084.1457992,map,True,False,6,8,0.0,0.0,1.9384050369262695,-2.325226068496704,0.0,0.0,0.0,0.026896361267468572,0.999638223772161,3.860744913382514,-10.060046363845666,0.7538676631993647,0.0,0.0,0.0,1.0
1717759084.157189,map,True,False,6,8,0.0,0.0,1.9384050369262695,-2.325226068496704,0.0,0.0,0.0,0.026896361267468572,0.999638223772161,3.860744913382514,-10.060046363845666,0.7538676631993647,0.0,0.0,0.0,1.0
1717759084.1622972,map,True,False,6,8,0.0,0.0,1.9384050369262695,-2.325226068496704,0.0,0.0,0.0,0.026896361267468572,0.999638223772161,3.860744913382514,-10.060046363845666,0.7538676631993647,0.0,0.0,0.0,1.0
1717759084.1698298,map,True,False,6,8,0.0,0.0,1.9384050369262695,-2.325226068496704,0.0,0.0,0.0,0.026896361267468572,0.999638223772161,3.860744913382514,-10.060046363845666,0.7538676631993647,0.0,0.0,0.0,1.0
1717759084.1767504,map,True,False,6,8,0.0,0.0,1.9384050369262695,-2.325226068496704,0.0,0.0,0.0,0.026896361267468572,0.999638223772161,3.860744913382514,-10.060046363845666,0.7538676631993647,0.0,0.0,0.0,1.0
1717759084.186382,map,True,False,6,8,0.0,0.0,1.9384050369262695,-2.325226068496704,0.0,0.0,0.0,0.026896361267468572,0.999638223772161,3.860744913382514,-10.060046363845666,0.7538676631993647,0.0,0.0,0.0,1.0
1717759084.1887782,map,True,False,6,8,0.0,0.0,1.9384050369262695,-2.325226068496704,0.0,0.0,0.0,0.026896361267468572,0.999638223772161,3.860744913382514,-10.060046363845666,0.7538676631993647,0.0,0.0,0.0,1.0
1717759084.1911242,map,True,False,6,8,0.0,0.0,1.9384050369262695,-2.325226068496704,0.0,0.0,0.0,0.026896361267468572,0.999638223772161,3.860744913382514,-10.060046363845666,0.7538676631993647,0.0,0.0,0.0,1.0
1717759084.1933398,map,True,False,6,8,0.0,0.0,1.9384050369262695,-2.325226068496704,0.0,0.0,0.0,0.026896361267468572,0.999638223772161,3.860744913382514,-10.060046363845666,0.7538676631993647,0.0,0.0,0.0,1.0
1717759084.199652,map,True,False,6,8,0.0,0.0,1.9384050369262695,-2.325226068496704,0.0,0.0,0.0,0.026896361267468572,0.999638223772161,3.860744913382514,-10.060046363845666,0.7538676631993647,0.0,0.0,0.0,1.0
1717759084.202097,map,True,False,6,8,0.0,0.0,1.9384050369262695,-2.325226068496704,0.0,0.0,0.0,0.026896361267468572,0.999638223772161,3.860744913382514,-10.060046363845666,0.7538676631993647,0.0,0.0,0.0,1.0
1717759084.2054653,map,True,False,6,8,0.0,0.0,1.9384050369262695,-2.325226068496704,0.0,0.0,0.0,0.026896361267468572,0.999638223772161,3.860744913382514,-10.060046363845666,0.7538676631993647,0.0,0.0,0.0,1.0
1717759084.2160745,map,True,False,6,7,0.0,0.0,1.9384050369262695,-2.325226068496704,0.0,0.0,0.0,0.026896361267468572,0.999638223772161,3.9126058345965804,-9.717721945760584,0.7396304037345927,0.0,0.0,0.0,1.0
1717759084.2267554,map,True,False,6,7,0.0,0.0,1.9384050369262695,-2.325226068496704,0.0,0.0,0.0,0.026896361267468572,0.999638223772161,3.913513502193998,-9.798144445711872,0.7402647698134113,0.0,0.0,0.0,1.0
1717759084.278239,map,True,False,6,7,0.0,0.0,1.9384050369262695,-2.325226068496704,0.0,0.0,0.0,0.026896361267468572,0.999638223772161,3.893664459707439,-9.650523437897549,0.7282944048210658,0.0,0.0,0.0,1.0
1717759084.3703852,map,True,False,6,7,0.0,0.0,1.9384050369262695,-2.325226068496704,0.0,0.0,0.0,0.026896361267468572,0.999638223772161,3.893664459707439,-9.650523437897549,0.7282944048210658,0.0,0.0,0.0,1.0
1717759084.3857472,map,True,False,6,7,0.0,0.0,1.9384050369262695,-2.325226068496704,0.0,0.0,0.0,0.026896361267468572,0.999638223772161,3.893664459707439,-9.650523437897549,0.7282944048210658,0.0,0.0,0.0,1.0
1717759084.389416,map,True,False,6,7,0.0,0.0,1.9384050369262695,-2.325226068496704,0.0,0.0,0.0,0.026896361267468572,0.999638223772161,3.893664459707439,-9.650523437897549,0.7282944048210658,0.0,0.0,0.0,1.0
1717759084.3944287,map,True,False,6,7,0.0,0.0,1.9384050369262695,-2.325226068496704,0.0,0.0,0.0,0.026896361267468572,0.999638223772161,3.893664459707439,-9.650523437897549,0.7282944048210658,0.0,0.0,0.0,1.0
1717759084.3972094,map,True,False,6,7,0.0,0.0,1.9384050369262695,-2.325226068496704,0.0,0.0,0.0,0.026896361267468572,0.999638223772161,3.893664459707439,-9.650523437897549,0.7282944048210658,0.0,0.0,0.0,1.0
1717759084.401163,map,True,False,6,7,0.0,0.0,1.9384050369262695,-2.325226068496704,0.0,0.0,0.0,0.026896361267468572,0.999638223772161,3.893664459707439,-9.650523437897549,0.7282944048210658,0.0,0.0,0.0,1.0
1717759084.42912,map,True,False,6,7,0.0,0.0,1.9384050369262695,-2.325226068496704,0.0,0.0,0.0,0.026896361267468572,0.999638223772161,3.893664459707439,-9.650523437897549,0.7282944048210658,0.0,0.0,0.0,1.0
1717759084.4378738,map,True,False,6,7,0.0,0.0,1.9384050369262695,-2.325226068496704,0.0,0.0,0.0,0.026896361267468572,0.999638223772161,3.893664459707439,-9.650523437897549,0.7282944048210658,0.0,0.0,0.0,1.0
1717759084.4493618,map,True,False,6,7,0.0,0.0,1.9384050369262695,-2.325226068496704,0.0,0.0,0.0,0.026896361267468572,0.999638223772161,3.893664459707439,-9.650523437897549,0.7282944048210658,0.0,0.0,0.0,1.0
1717759084.452494,map,True,False,6,7,0.0,0.0,1.9384050369262695,-2.325226068496704,0.0,0.0,0.0,0.026896361267468572,0.999638223772161,3.893664459707439,-9.650523437897549,0.7282944048210658,0.0,0.0,0.0,1.0
1717759084.457601,map,True,False,6,7,0.0,0.0,1.9384050369262695,-2.325226068496704,0.0,0.0,0.0,0.026896361267468572,0.999638223772161,3.893664459707439,-9.650523437897549,0.7282944048210658,0.0,0.0,0.0,1.0
1717759084.4649923,map,True,False,6,7,0.0,0.0,1.9384050369262695,-2.325226068496704,0.0,0.0,0.0,0.026896361267468572,0.999638223772161,3.893664459707439,-9.650523437897549,0.7282944048210658,0.0,0.0,0.0,1.0
1717759084.4705994,map,True,False,6,7,0.0,0.0,1.9384050369262695,-2.325226068496704,0.0,0.0,0.0,0.026896361267468572,0.999638223772161,3.893664459707439,-9.650523437897549,0.7282944048210658,0.0,0.0,0.0,1.0
1717759084.4789143,map,True,False,6,7,0.0,0.0,1.9384050369262695,-2.325226068496704,0.0,0.0,0.0,0.026896361267468572,0.999638223772161,3.893664459707439,-9.650523437897549,0.7282944048210658,0.0,0.0,0.0,1.0
1717759084.4894493,map,True,False,6,7,0.0,0.0,1.9384050369262695,-2.325226068496704,0.0,0.0,0.0,0.026896361267468572,0.999638223772161,3.893664459707439,-9.650523437897549,0.7282944048210658,0.0,0.0,0.0,1.0
1717759084.4939687,map,True,False,6,7,0.0,0.0,1.9384050369262695,-2.325226068496704,0.0,0.0,0.0,0.026896361267468572,0.999638223772161,3.893664459707439,-9.650523437897549,0.7282944048210658,0.0,0.0,0.0,1.0
1717759084.497691,map,True,False,6,7,0.0,0.0,1.9384050369262695,-2.325226068496704,0.0,0.0,0.0,0.026896361267468572,0.999638223772161,3.893664459707439,-9.650523437897549,0.7282944048210658,0.0,0.0,0.0,1.0
1717759084.503755,map,True,False,6,7,0.0,0.0,1.9384050369262695,-2.325226068496704,0.0,0.0,0.0,0.026896361267468572,0.999638223772161,3.893664459707439,-9.650523437897549,0.7282944048210658,0.0,0.0,0.0,1.0
1717759084.5068104,map,True,False,6,7,0.0,0.0,1.9384050369262695,-2.325226068496704,0.0,0.0,0.0,0.026896361267468572,0.999638223772161,3.893664459707439,-9.650523437897549,0.7282944048210658,0.0,0.0,0.0,1.0
1717759084.514047,map,True,False,6,7,0.0,0.0,1.9384050369262695,-2.325226068496704,0.0,0.0,0.0,0.026896361267468572,0.999638223772161,3.893664459707439,-9.650523437897549,0.7282944048210658,0.0,0.0,0.0,1.0
1717759084.5167165,map,True,False,6,7,0.0,0.0,1.9384050369262695,-2.325226068496704,0.0,0.0,0.0,0.026896361267468572,0.999638223772161,3.893664459707439,-9.650523437897549,0.7282944048210658,0.0,0.0,0.0,1.0
1717759084.5256152,map,True,False,6,7,0.0,0.0,1.9384050369262695,-2.325226068496704,0.0,0.0,0.0,0.026896361267468572,0.999638223772161,3.893664459707439,-9.650523437897549,0.7282944048210658,0.0,0.0,0.0,1.0
1717759084.5289075,map,True,False,6,7,0.0,0.0,1.9384050369262695,-2.325226068496704,0.0,0.0,0.0,0.026896361267468572,0.999638223772161,3.893664459707439,-9.650523437897549,0.7282944048210658,0.0,0.0,0.0,1.0
1717759084.533346,map,True,False,6,7,0.0,0.0,1.9384050369262695,-2.325226068496704,0.0,0.0,0.0,0.026896361267468572,0.999638223772161,3.893664459707439,-9.650523437897549,0.7282944048210658,0.0,0.0,0.0,1.0
1717759084.5379524,map,True,False,6,7,0.0,0.0,1.9384050369262695,-2.325226068496704,0.0,0.0,0.0,0.026896361267468572,0.999638223772161,3.893664459707439,-9.650523437897549,0.7282944048210658,0.0,0.0,0.0,1.0
1717759084.5469031,map,True,False,6,7,0.0,0.0,1.9384050369262695,-2.325226068496704,0.0,0.0,0.0,0.026896361267468572,0.999638223772161,3.893664459707439,-9.650523437897549,0.7282944048210658,0.0,0.0,0.0,1.0
1717759084.553067,map,True,False,6,7,0.0,0.0,1.9384050369262695,-2.325226068496704,0.0,0.0,0.0,0.026896361267468572,0.999638223772161,3.8847163084861576,-9.230561894848746,0.7356521583032862,0.0,0.0,0.0,1.0
1717759084.5576587,map,True,False,6,7,0.0,0.0,1.9384050369262695,-2.325226068496704,0.0,0.0,0.0,0.026896361267468572,0.999638223772161,3.8933939453501134,-9.295624435050197,0.7464135728281616,0.0,0.0,0.0,1.0
1717759084.5730586,map,True,False,6,7,0.0,0.0,1.9384050369262695,-2.325226068496704,0.0,0.0,0.0,0.026896361267468572,0.999638223772161,3.933730780997074,-9.598518976703218,0.7599630502041521,0.0,0.0,0.0,1.0
1717759084.5815353,map,True,False,6,7,0.0,0.0,1.9384050369262695,-2.325226068496704,0.0,0.0,0.0,0.026896361267468572,0.999638223772161,3.884736444132047,-9.230457255518097,0.7559438885312091,0.0,0.0,0.0,1.0
1717759084.587716,map,True,False,6,7,0.0,0.0,1.9384050369262695,-2.325226068496704,0.0,0.0,0.0,0.026896361267468572,0.999638223772161,3.9432691943233884,-9.670310789707326,0.7499555902011397,0.0,0.0,0.0,1.0
1717759084.6163614,map,True,False,6,7,0.0,0.0,1.9384050369262695,-2.325226068496704,0.0,0.0,0.0,0.026896361267468572,0.999638223772161,3.9432691943233884,-9.670310789707326,0.7499555902011397,0.0,0.0,0.0,1.0
1717759084.6298795,map,True,False,6,7,0.0,0.0,1.9384050369262695,-2.325226068496704,0.0,0.0,0.0,0.026896361267468572,0.999638223772161,3.9432691943233884,-9.670310789707326,0.7499555902011397,0.0,0.0,0.0,1.0
1717759084.6419544,map,True,False,6,7,0.0,0.0,1.9384050369262695,-2.325226068496704,0.0,0.0,0.0,0.026896361267468572,0.999638223772161,3.9432691943233884,-9.670310789707326,0.7499555902011397,0.0,0.0,0.0,1.0
1717759084.6446848,map,True,False,6,7,0.0,0.0,1.9384050369262695,-2.325226068496704,0.0,0.0,0.0,0.026896361267468572,0.999638223772161,3.9432691943233884,-9.670310789707326,0.7499555902011397,0.0,0.0,0.0,1.0
1717759084.675172,map,True,False,6,7,0.0,0.0,1.9384050369262695,-2.325226068496704,0.0,0.0,0.0,0.026896361267468572,0.999638223772161,3.9432691943233884,-9.670310789707326,0.7499555902011397,0.0,0.0,0.0,1.0
1717759084.6781294,map,True,False,6,7,0.0,0.0,1.9384050369262695,-2.325226068496704,0.0,0.0,0.0,0.026896361267468572,0.999638223772161,3.9432691943233884,-9.670310789707326,0.7499555902011397,0.0,0.0,0.0,1.0
1717759084.7131693,map,True,False,6,7,0.0,0.0,1.9384050369262695,-2.325226068496704,0.0,0.0,0.0,0.026896361267468572,0.999638223772161,3.9432691943233884,-9.670310789707326,0.7499555902011397,0.0,0.0,0.0,1.0
1717759084.7172,map,True,False,6,7,0.0,0.0,1.9384050369262695,-2.325226068496704,0.0,0.0,0.0,0.026896361267468572,0.999638223772161,3.9432691943233884,-9.670310789707326,0.7499555902011397,0.0,0.0,0.0,1.0
1717759084.767866,map,True,False,6,7,0.0,0.0,1.9384050369262695,-2.325226068496704,0.0,0.0,0.0,0.026896361267468572,0.999638223772161,3.9432691943233884,-9.670310789707326,0.7499555902011397,0.0,0.0,0.0,1.0
1717759084.777476,map,True,False,6,7,0.0,0.0,1.9384050369262695,-2.325226068496704,0.0,0.0,0.0,0.026896361267468572,0.999638223772161,3.9432691943233884,-9.670310789707326,0.7499555902011397,0.0,0.0,0.0,1.0
1717759084.877459,map,True,False,6,7,0.0,0.0,2.051637887954712,-2.3436431884765625,0.0,0.0,0.0,0.02709337636030627,0.9996329021182069,3.982112022208402,-9.234630780632127,0.7356147484905373,0.0,0.0,0.0,1.0
1717759084.900598,map,True,False,6,7,0.0,0.0,2.051637887954712,-2.3436431884765625,0.0,0.0,0.0,0.02709337636030627,0.9996329021182069,3.9779164507645515,-9.137558005877572,0.7348467156087601,0.0,0.0,0.0,1.0
1717759084.9067357,map,True,False,6,7,0.0,0.0,2.051637887954712,-2.3436431884765625,0.0,0.0,0.0,0.02709337636030627,0.9996329021182069,3.9528798364816446,-8.956361454352649,0.7333986735020741,0.0,0.0,0.0,1.0
1717759084.9097335,map,True,False,6,7,0.0,0.0,2.051637887954712,-2.3436431884765625,0.0,0.0,0.0,0.02709337636030627,0.9996329021182069,3.9528798364816446,-8.956361454352649,0.7333986735020741,0.0,0.0,0.0,1.0
1717759084.9166305,map,True,False,6,7,0.0,0.0,2.051637887954712,-2.3436431884765625,0.0,0.0,0.0,0.02709337636030627,0.9996329021182069,3.9528798364816446,-8.956361454352649,0.7333986735020741,0.0,0.0,0.0,1.0
1717759084.9268637,map,True,False,6,7,0.0,0.0,2.051637887954712,-2.3436431884765625,0.0,0.0,0.0,0.02709337636030627,0.9996329021182069,3.9528798364816446,-8.956361454352649,0.7333986735020741,0.0,0.0,0.0,1.0
1717759084.9313798,map,True,False,6,7,0.0,0.0,2.051637887954712,-2.3436431884765625,0.0,0.0,0.0,0.02709337636030627,0.9996329021182069,3.9528798364816446,-8.956361454352649,0.7333986735020741,0.0,0.0,0.0,1.0
1717759084.9387019,map,True,False,6,7,0.0,0.0,2.051637887954712,-2.3436431884765625,0.0,0.0,0.0,0.02709337636030627,0.9996329021182069,3.9528798364816446,-8.956361454352649,0.7333986735020741,0.0,0.0,0.0,1.0
1717759084.9430907,map,True,False,6,7,0.0,0.0,2.051637887954712,-2.3436431884765625,0.0,0.0,0.0,0.02709337636030627,0.9996329021182069,3.9528798364816446,-8.956361454352649,0.7333986735020741,0.0,0.0,0.0,1.0
1717759084.945287,map,True,False,6,7,0.0,0.0,2.051637887954712,-2.3436431884765625,0.0,0.0,0.0,0.02709337636030627,0.9996329021182069,3.9528798364816446,-8.956361454352649,0.7333986735020741,0.0,0.0,0.0,1.0
1717759084.9579272,map,True,False,6,7,0.0,0.0,2.051637887954712,-2.3436431884765625,0.0,0.0,0.0,0.02709337636030627,0.9996329021182069,3.9528798364816446,-8.956361454352649,0.7333986735020741,0.0,0.0,0.0,1.0
1717759084.960645,map,True,False,6,7,0.0,0.0,2.051637887954712,-2.3436431884765625,0.0,0.0,0.0,0.02709337636030627,0.9996329021182069,3.9528798364816446,-8.956361454352649,0.7333986735020741,0.0,0.0,0.0,1.0
1717759084.9694445,map,True,False,6,7,0.0,0.0,2.051637887954712,-2.3436431884765625,0.0,0.0,0.0,0.02709337636030627,0.9996329021182069,3.9528798364816446,-8.956361454352649,0.7333986735020741,0.0,0.0,0.0,1.0
1717759084.9747925,map,True,False,6,7,0.0,0.0,2.051637887954712,-2.3436431884765625,0.0,0.0,0.0,0.02709337636030627,0.9996329021182069,3.9528798364816446,-8.956361454352649,0.7333986735020741,0.0,0.0,0.0,1.0
1717759084.9765441,map,True,False,6,7,0.0,0.0,2.051637887954712,-2.3436431884765625,0.0,0.0,0.0,0.02709337636030627,0.9996329021182069,3.9528798364816446,-8.956361454352649,0.7333986735020741,0.0,0.0,0.0,1.0
1717759084.981638,map,True,False,6,7,0.0,0.0,2.051637887954712,-2.3436431884765625,0.0,0.0,0.0,0.02709337636030627,0.9996329021182069,3.9528798364816446,-8.956361454352649,0.7333986735020741,0.0,0.0,0.0,1.0
1717759085.0336618,map,True,False,6,7,0.0,0.0,2.051637887954712,-2.3436431884765625,0.0,0.0,0.0,0.02709337636030627,0.9996329021182069,3.9528798364816446,-8.956361454352649,0.7333986735020741,0.0,0.0,0.0,1.0
1717759085.0852528,map,True,False,6,7,0.0,0.0,2.051637887954712,-2.3436431884765625,0.0,0.0,0.0,0.02709337636030627,0.9996329021182069,3.9528798364816446,-8.956361454352649,0.7333986735020741,0.0,0.0,0.0,1.0
1717759085.0939631,map,True,False,6,7,0.0,0.0,2.051637887954712,-2.3436431884765625,0.0,0.0,0.0,0.02709337636030627,0.9996329021182069,3.9528798364816446,-8.956361454352649,0.7333986735020741,0.0,0.0,0.0,1.0
1717759085.0977972,map,True,False,6,7,0.0,0.0,2.051637887954712,-2.3436431884765625,0.0,0.0,0.0,0.02709337636030627,0.9996329021182069,3.9528798364816446,-8.956361454352649,0.7333986735020741,0.0,0.0,0.0,1.0
1717759085.1090293,map,True,False,6,7,0.0,0.0,2.051637887954712,-2.3436431884765625,0.0,0.0,0.0,0.02709337636030627,0.9996329021182069,3.9528798364816446,-8.956361454352649,0.7333986735020741,0.0,0.0,0.0,1.0
1717759085.1173139,map,True,False,6,7,0.0,0.0,2.051637887954712,-2.3436431884765625,0.0,0.0,0.0,0.02709337636030627,0.9996329021182069,3.9528798364816446,-8.956361454352649,0.7333986735020741,0.0,0.0,0.0,1.0
1717759085.1252508,map,True,False,6,7,0.0,0.0,2.051637887954712,-2.3436431884765625,0.0,0.0,0.0,0.02709337636030627,0.9996329021182069,3.9528798364816446,-8.956361454352649,0.7333986735020741,0.0,0.0,0.0,1.0
1717759085.1460521,map,True,False,6,7,0.0,0.0,2.051637887954712,-2.3436431884765625,0.0,0.0,0.0,0.02709337636030627,0.9996329021182069,3.9528798364816446,-8.956361454352649,0.7333986735020741,0.0,0.0,0.0,1.0
1717759085.1542692,map,True,False,6,7,0.0,0.0,2.051637887954712,-2.3436431884765625,0.0,0.0,0.0,0.02709337636030627,0.9996329021182069,3.9528798364816446,-8.956361454352649,0.7333986735020741,0.0,0.0,0.0,1.0
1717759085.16386,map,True,False,6,7,0.0,0.0,2.051637887954712,-2.3436431884765625,0.0,0.0,0.0,0.02709337636030627,0.9996329021182069,3.9528798364816446,-8.956361454352649,0.7333986735020741,0.0,0.0,0.0,1.0
1717759085.1765382,map,True,False,6,7,0.0,0.0,2.051637887954712,-2.3436431884765625,0.0,0.0,0.0,0.02709337636030627,0.9996329021182069,3.9528798364816446,-8.956361454352649,0.7333986735020741,0.0,0.0,0.0,1.0
1717759085.1800916,map,True,False,6,7,0.0,0.0,2.051637887954712,-2.3436431884765625,0.0,0.0,0.0,0.02709337636030627,0.9996329021182069,3.9528798364816446,-8.956361454352649,0.7333986735020741,0.0,0.0,0.0,1.0
1717759085.1839774,map,True,False,6,7,0.0,0.0,2.051637887954712,-2.3436431884765625,0.0,0.0,0.0,0.02709337636030627,0.9996329021182069,3.9528798364816446,-8.956361454352649,0.7333986735020741,0.0,0.0,0.0,1.0
1717759085.232808,map,True,True,6,6,0.5957621508060097,0.5957621508060098,2.051637887954712,-2.3436431884765625,0.0,0.0,0.0,0.02709337636030627,0.9996329021182069,3.967503694296055,-8.28608511262804,0.7280183771509121,0.0,0.0,0.0,1.0
1717759085.2372334,map,True,True,6,6,0.5957621508060097,0.5957621508060098,2.051637887954712,-2.3436431884765625,0.0,0.0,0.0,0.02709337636030627,0.9996329021182069,3.967503694296055,-8.28608511262804,0.7280183771509121,0.0,0.0,0.0,1.0
1717759085.309099,map,True,True,6,6,0.5957621508060097,0.5957621508060098,2.051637887954712,-2.3436431884765625,0.0,0.0,0.0,0.02709337636030627,0.9996329021182069,3.954240645357421,-8.14195694631362,0.7182974710211438,0.0,0.0,0.0,1.0
1717759085.3586357,map,True,True,6,6,0.5957621508060097,0.5957621508060098,2.051637887954712,-2.3436431884765625,0.0,0.0,0.0,0.02709337636030627,0.9996329021182069,3.954240645357421,-8.14195694631362,0.7182974710211438,0.0,0.0,0.0,1.0
1717759085.4087017,map,True,False,6,6,0.5957621508060097,0.5957621508060098,2.051637887954712,-2.3436431884765625,0.0,0.0,0.0,0.02709337636030627,0.9996329021182069,3.954240645357421,-8.14195694631362,0.7182974710211438,0.0,0.0,0.0,1.0
1717759085.4368703,map,True,False,6,6,0.5957621508060097,0.5957621508060098,2.051637887954712,-2.3436431884765625,0.0,0.0,0.0,0.02709337636030627,0.9996329021182069,3.954240645357421,-8.14195694631362,0.7182974710211438,0.0,0.0,0.0,1.0
1717759085.441409,map,True,True,6,6,0.5957621508060097,0.5957621508060098,2.051637887954712,-2.3436431884765625,0.0,0.0,0.0,0.02709337636030627,0.9996329021182069,3.954240645357421,-8.14195694631362,0.7182974710211438,0.0,0.0,0.0,1.0
1717759085.4785423,map,True,True,6,6,0.5957621508060097,0.5957621508060098,2.051637887954712,-2.3436431884765625,0.0,0.0,0.0,0.02709337636030627,0.9996329021182069,3.954240645357421,-8.14195694631362,0.7182974710211438,0.0,0.0,0.0,1.0
1717759085.481053,map,True,True,6,6,0.5957621508060097,0.5957621508060098,2.051637887954712,-2.3436431884765625,0.0,0.0,0.0,0.02709337636030627,0.9996329021182069,3.954240645357421,-8.14195694631362,0.7182974710211438,0.0,0.0,0.0,1.0
1717759085.557848,map,True,False,6,6,0.5957621508060097,0.5957621508060098,2.051637887954712,-2.3436431884765625,0.0,0.0,0.0,0.02709337636030627,0.9996329021182069,4.010917975351856,-8.014224706531131,0.7006883919462584,0.0,0.0,0.0,1.0
1717759085.563621,map,True,False,6,6,0.5957621508060097,0.5957621508060098,2.051637887954712,-2.3436431884765625,0.0,0.0,0.0,0.02709337636030627,0.9996329021182069,4.0235380949477495,-8.098078337426069,0.7009880879755931,0.0,0.0,0.0,1.0
1717759085.571552,map,True,True,6,6,0.5957621508060097,0.5957621508060098,2.051637887954712,-2.3436431884765625,0.0,0.0,0.0,0.02709337636030627,0.9996329021182069,3.9968619393089506,-7.971166785030969,0.7088624466955705,0.0,0.0,0.0,1.0
1717759085.5764747,map,True,True,6,6,0.5957621508060097,0.5957621508060098,2.051637887954712,-2.3436431884765625,0.0,0.0,0.0,0.02709337636030627,0.9996329021182069,3.9968619393089506,-7.971166785030969,0.7088624466955705,0.0,0.0,0.0,1.0
1717759085.6728075,map,True,True,6,6,0.5957621508060097,0.5957621508060098,2.051637887954712,-2.3436431884765625,0.0,0.0,0.0,0.02709337636030627,0.9996329021182069,4.01281582550407,-8.078126814538809,0.7094027898440419,0.0,0.0,0.0,1.0
1717759085.7128947,map,True,False,6,6,0.5957621508060097,0.5957621508060098,2.051637887954712,-2.3436431884765625,0.0,0.0,0.0,0.02709337636030627,0.9996329021182069,4.01281582550407,-8.078126814538809,0.7094027898440419,0.0,0.0,0.0,1.0
1717759085.7300365,map,True,False,6,6,0.5957621508060097,0.5957621508060098,2.051637887954712,-2.3436431884765625,0.0,0.0,0.0,0.02709337636030627,0.9996329021182069,4.01281582550407,-8.078126814538809,0.7094027898440419,0.0,0.0,0.0,1.0
1717759085.7649567,map,True,True,6,6,0.5957621508060097,0.5957621508060098,2.051637887954712,-2.3436431884765625,0.0,0.0,0.0,0.02709337636030627,0.9996329021182069,4.01281582550407,-8.078126814538809,0.7094027898440419,0.0,0.0,0.0,1.0
1717759085.7690854,map,True,False,6,6,0.5957621508060097,0.5957621508060098,2.051637887954712,-2.3436431884765625,0.0,0.0,0.0,0.02709337636030627,0.9996329021182069,4.01281582550407,-8.078126814538809,0.7094027898440419,0.0,0.0,0.0,1.0
1717759085.9652147,map,True,True,5,5,0.612995793784914,0.612995793784914,2.249527931213379,-2.3760335445404053,0.0,0.0,0.0,0.03006203371529015,0.9995480350518006,4.082517356821444,-7.709422074883505,0.7153991406481368,0.0,0.0,0.0,1.0
1717759086.0164938,map,True,True,5,5,0.612995793784914,0.612995793784914,2.249527931213379,-2.3760335445404053,0.0,0.0,0.0,0.03006203371529015,0.9995480350518006,4.082517356821444,-7.709422074883505,0.7153991406481368,0.0,0.0,0.0,1.0
1717759086.097583,map,True,True,5,5,0.612995793784914,0.612995793784914,2.249527931213379,-2.3760335445404053,0.0,0.0,0.0,0.03006203371529015,0.9995480350518006,4.082517356821444,-7.709422074883505,0.7153991406481368,0.0,0.0,0.0,1.0
1717759086.1642463,map,True,False,5,5,0.612995793784914,0.612995793784914,2.249527931213379,-2.3760335445404053,0.0,0.0,0.0,0.03006203371529015,0.9995480350518006,4.082517356821444,-7.709422074883505,0.7153991406481368,0.0,0.0,0.0,1.0
1717759086.1672792,map,True,True,5,5,0.612995793784914,0.612995793784914,2.249527931213379,-2.3760335445404053,0.0,0.0,0.0,0.03006203371529015,0.9995480350518006,4.082517356821444,-7.709422074883505,0.7153991406481368,0.0,0.0,0.0,1.0
1717759086.1690636,map,True,True,5,5,0.612995793784914,0.612995793784914,2.249527931213379,-2.3760335445404053,0.0,0.0,0.0,0.03006203371529015,0.9995480350518006,4.082517356821444,-7.709422074883505,0.7153991406481368,0.0,0.0,0.0,1.0
1717759086.1978283,map,True,True,5,5,0.612995793784914,0.612995793784914,2.249527931213379,-2.3760335445404053,0.0,0.0,0.0,0.03006203371529015,0.9995480350518006,4.082517356821444,-7.709422074883505,0.7153991406481368,0.0,0.0,0.0,1.0
1717759086.2007198,map,True,False,5,5,0.612995793784914,0.612995793784914,2.249527931213379,-2.3760335445404053,0.0,0.0,0.0,0.03006203371529015,0.9995480350518006,4.082517356821444,-7.709422074883505,0.7153991406481368,0.0,0.0,0.0,1.0
1717759086.2048345,map,True,True,5,5,0.612995793784914,0.612995793784914,2.249527931213379,-2.3760335445404053,0.0,0.0,0.0,0.03006203371529015,0.9995480350518006,4.082517356821444,-7.709422074883505,0.7153991406481368,0.0,0.0,0.0,1.0
1717759086.2125072,map,True,False,5,5,0.612995793784914,0.612995793784914,2.249527931213379,-2.3760335445404053,0.0,0.0,0.0,0.03006203371529015,0.9995480350518006,4.082517356821444,-7.709422074883505,0.7153991406481368,0.0,0.0,0.0,1.0
1717759086.2269664,map,True,True,5,5,0.612995793784914,0.612995793784914,2.249527931213379,-2.3760335445404053,0.0,0.0,0.0,0.03006203371529015,0.9995480350518006,4.082517356821444,-7.709422074883505,0.7153991406481368,0.0,0.0,0.0,1.0
1717759086.2430933,map,True,True,5,5,0.612995793784914,0.612995793784914,2.249527931213379,-2.3760335445404053,0.0,0.0,0.0,0.03006203371529015,0.9995480350518006,4.082517356821444,-7.709422074883505,0.7153991406481368,0.0,0.0,0.0,1.0
1717759086.302928,map,True,False,5,5,0.612995793784914,0.612995793784914,2.249527931213379,-2.3760335445404053,0.0,0.0,0.0,0.03006203371529015,0.9995480350518006,4.1125247001467,-7.191903244790524,0.711988596724248,0.0,0.0,0.0,1.0
1717759086.3537147,map,True,False,5,5,0.612995793784914,0.612995793784914,2.249527931213379,-2.3760335445404053,0.0,0.0,0.0,0.03006203371529015,0.9995480350518006,4.1125247001467,-7.191903244790524,0.711988596724248,0.0,0.0,0.0,1.0
1717759086.4052303,map,True,False,5,5,0.612995793784914,0.612995793784914,2.249527931213379,-2.3760335445404053,0.0,0.0,0.0,0.03006203371529015,0.9995480350518006,4.1125247001467,-7.191903244790524,0.711988596724248,0.0,0.0,0.0,1.0
1717759086.4373233,map,True,True,5,5,0.612995793784914,0.612995793784914,2.249527931213379,-2.3760335445404053,0.0,0.0,0.0,0.03006203371529015,0.9995480350518006,4.1125247001467,-7.191903244790524,0.711988596724248,0.0,0.0,0.0,1.0
1717759086.4424255,map,True,True,5,5,0.612995793784914,0.612995793784914,2.249527931213379,-2.3760335445404053,0.0,0.0,0.0,0.03006203371529015,0.9995480350518006,4.1125247001467,-7.191903244790524,0.711988596724248,0.0,0.0,0.0,1.0
1717759086.490996,map,True,True,5,5,0.612995793784914,0.612995793784914,2.249527931213379,-2.3760335445404053,0.0,0.0,0.0,0.03006203371529015,0.9995480350518006,4.1125247001467,-7.191903244790524,0.711988596724248,0.0,0.0,0.0,1.0
1717759086.521115,map,True,False,5,5,0.612995793784914,0.612995793784914,2.249527931213379,-2.3760335445404053,0.0,0.0,0.0,0.03006203371529015,0.9995480350518006,4.1125247001467,-7.191903244790524,0.711988596724248,0.0,0.0,0.0,1.0
1717759086.5247207,map,True,False,5,5,0.612995793784914,0.612995793784914,2.249527931213379,-2.3760335445404053,0.0,0.0,0.0,0.03006203371529015,0.9995480350518006,4.1125247001467,-7.191903244790524,0.711988596724248,0.0,0.0,0.0,1.0
1717759086.530691,map,True,True,5,5,0.612995793784914,0.612995793784914,2.249527931213379,-2.3760335445404053,0.0,0.0,0.0,0.03006203371529015,0.9995480350518006,4.1125247001467,-7.191903244790524,0.711988596724248,0.0,0.0,0.0,1.0
1717759086.534167,map,True,True,5,5,0.612995793784914,0.612995793784914,2.249527931213379,-2.3760335445404053,0.0,0.0,0.0,0.03006203371529015,0.9995480350518006,4.1125247001467,-7.191903244790524,0.711988596724248,0.0,0.0,0.0,1.0
1717759086.5409453,map,True,False,5,5,0.612995793784914,0.612995793784914,2.249527931213379,-2.3760335445404053,0.0,0.0,0.0,0.03006203371529015,0.9995480350518006,4.1125247001467,-7.191903244790524,0.711988596724248,0.0,0.0,0.0,1.0
1717759086.5448031,map,True,True,5,5,0.612995793784914,0.612995793784914,2.249527931213379,-2.3760335445404053,0.0,0.0,0.0,0.03006203371529015,0.9995480350518006,4.1125247001467,-7.191903244790524,0.711988596724248,0.0,0.0,0.0,1.0
1717759086.5500152,map,True,True,5,5,0.612995793784914,0.612995793784914,2.249527931213379,-2.3760335445404053,0.0,0.0,0.0,0.03006203371529015,0.9995480350518006,4.1125247001467,-7.191903244790524,0.711988596724248,0.0,0.0,0.0,1.0
1717759086.5573523,map,True,True,5,5,0.612995793784914,0.612995793784914,2.249527931213379,-2.3760335445404053,0.0,0.0,0.0,0.03006203371529015,0.9995480350518006,4.1125247001467,-7.191903244790524,0.711988596724248,0.0,0.0,0.0,1.0
1717759086.5616179,map,True,True,5,5,0.612995793784914,0.612995793784914,2.249527931213379,-2.3760335445404053,0.0,0.0,0.0,0.03006203371529015,0.9995480350518006,4.1125247001467,-7.191903244790524,0.711988596724248,0.0,0.0,0.0,1.0
1717759086.5711222,map,True,True,5,5,0.612995793784914,0.612995793784914,2.249527931213379,-2.3760335445404053,0.0,0.0,0.0,0.03006203371529015,0.9995480350518006,4.1125247001467,-7.191903244790524,0.711988596724248,0.0,0.0,0.0,1.0
1717759086.572921,map,True,False,5,5,0.612995793784914,0.612995793784914,2.249527931213379,-2.3760335445404053,0.0,0.0,0.0,0.03006203371529015,0.9995480350518006,4.1125247001467,-7.191903244790524,0.711988596724248,0.0,0.0,0.0,1.0
1717759086.5770588,map,True,True,5,5,0.612995793784914,0.612995793784914,2.249527931213379,-2.3760335445404053,0.0,0.0,0.0,0.03006203371529015,0.9995480350518006,4.1125247001467,-7.191903244790524,0.711988596724248,0.0,0.0,0.0,1.0
1717759086.585775,map,True,True,5,5,0.612995793784914,0.612995793784914,2.249527931213379,-2.3760335445404053,0.0,0.0,0.0,0.03006203371529015,0.9995480350518006,4.20245514756633,-7.040546953292351,0.7039237975303679,0.0,0.0,0.0,1.0
1717759086.5893207,map,True,True,5,5,0.612995793784914,0.612995793784914,2.249527931213379,-2.3760335445404053,0.0,0.0,0.0,0.03006203371529015,0.9995480350518006,4.20245514756633,-7.040546953292351,0.7039237975303679,0.0,0.0,0.0,1.0
1717759086.6423333,map,True,False,5,5,0.612995793784914,0.612995793784914,2.249527931213379,-2.3760335445404053,0.0,0.0,0.0,0.03006203371529015,0.9995480350518006,4.200856630622258,-6.963437894390459,0.696574840332492,0.0,0.0,0.0,1.0
1717759086.742471,map,True,True,5,5,0.612995793784914,0.612995793784914,2.249527931213379,-2.3760335445404053,0.0,0.0,0.0,0.03006203371529015,0.9995480350518006,4.200856630622258,-6.963437894390459,0.696574840332492,0.0,0.0,0.0,1.0
1717759086.9420996,map,True,False,5,4,0.0,0.0,2.4040257930755615,-2.4139182567596436,0.0,0.0,0.0,0.03278611422062857,0.999462385502225,4.266390847793406,-6.876293544324856,0.7098757255170035,0.0,0.0,0.0,1.0
1717759086.9929285,map,True,False,5,4,0.0,0.0,2.4040257930755615,-2.4139182567596436,0.0,0.0,0.0,0.03278611422062857,0.999462385502225,4.288641777961709,-6.797959664435375,0.6958162944691461,0.0,0.0,0.0,1.0
1717759087.0512657,map,True,False,5,4,0.0,0.0,2.4040257930755615,-2.4139182567596436,0.0,0.0,0.0,0.03278611422062857,0.999462385502225,4.288641777961709,-6.797959664435375,0.6958162944691461,0.0,0.0,0.0,1.0
1717759087.145989,map,True,False,5,4,0.0,0.0,2.4040257930755615,-2.4139182567596436,0.0,0.0,0.0,0.03278611422062857,0.999462385502225,4.288641777961709,-6.797959664435375,0.6958162944691461,0.0,0.0,0.0,1.0
1717759087.1940358,map,True,False,5,4,0.0,0.0,2.4040257930755615,-2.4139182567596436,0.0,0.0,0.0,0.03278611422062857,0.999462385502225,4.288641777961709,-6.797959664435375,0.6958162944691461,0.0,0.0,0.0,1.0
1717759087.244753,map,True,False,5,4,0.0,0.0,2.4040257930755615,-2.4139182567596436,0.0,0.0,0.0,0.03278611422062857,0.999462385502225,4.288641777961709,-6.797959664435375,0.6958162944691461,0.0,0.0,0.0,1.0
1717759087.294991,map,True,False,5,4,0.0,0.0,2.4040257930755615,-2.4139182567596436,0.0,0.0,0.0,0.03278611422062857,0.999462385502225,4.321358195584771,-6.487479443804731,0.6880473758813348,0.0,0.0,0.0,1.0
1717759087.3951633,map,True,False,5,4,0.0,0.0,2.4040257930755615,-2.4139182567596436,0.0,0.0,0.0,0.03278611422062857,0.999462385502225,4.321358195584771,-6.487479443804731,0.6880473758813348,0.0,0.0,0.0,1.0
1717759087.4456923,map,True,False,5,4,0.0,0.0,2.4040257930755615,-2.4139182567596436,0.0,0.0,0.0,0.03278611422062857,0.999462385502225,4.321358195584771,-6.487479443804731,0.6880473758813348,0.0,0.0,0.0,1.0
1717759087.544888,map,True,False,5,4,0.0,0.0,2.4040257930755615,-2.4139182567596436,0.0,0.0,0.0,0.03278611422062857,0.999462385502225,4.321358195584771,-6.487479443804731,0.6880473758813348,0.0,0.0,0.0,1.0
1717759087.596092,map,True,False,5,4,0.0,0.0,2.4040257930755615,-2.4139182567596436,0.0,0.0,0.0,0.03278611422062857,0.999462385502225,4.299737034257828,-6.039150759144224,0.6812468828099425,0.0,0.0,0.0,1.0
1717759087.6959758,map,True,False,5,4,0.0,0.0,2.514336585998535,-2.4243366718292236,0.0,0.0,0.0,0.03398574191282752,0.9994223237418416,4.251140614642888,-5.937647035434135,0.6869681410564674,0.0,0.0,0.0,1.0
1717759087.7463803,map,True,False,5,4,0.0,0.0,2.514336585998535,-2.4243366718292236,0.0,0.0,0.0,0.03398574191282752,0.9994223237418416,4.251140614642888,-5.937647035434135,0.6869681410564674,0.0,0.0,0.0,1.0
1717759087.9981554,map,True,False,5,4,0.0,0.0,2.514336585998535,-2.4243366718292236,0.0,0.0,0.0,0.03398574191282752,0.9994223237418416,4.405564708973759,-5.908083546115536,0.6978261105304289,0.0,0.0,0.0,1.0
1717759088.0490851,map,True,False,5,4,0.0,0.0,2.514336585998535,-2.4243366718292236,0.0,0.0,0.0,0.03398574191282752,0.9994223237418416,4.405564708973759,-5.908083546115536,0.6978261105304289,0.0,0.0,0.0,1.0
1717759088.1488256,map,True,False,5,4,0.0,0.0,2.514336585998535,-2.4243366718292236,0.0,0.0,0.0,0.03398574191282752,0.9994223237418416,4.405564708973759,-5.908083546115536,0.6978261105304289,0.0,0.0,0.0,1.0
1717759088.2486408,map,True,False,5,4,0.0,0.0,2.514336585998535,-2.4243366718292236,0.0,0.0,0.0,0.03398574191282752,0.9994223237418416,4.405564708973759,-5.908083546115536,0.6978261105304289,0.0,0.0,0.0,1.0
1717759088.30034,map,True,False,5,3,0.0,0.0,2.514336585998535,-2.4243366718292236,0.0,0.0,0.0,0.03398574191282752,0.9994223237418416,4.449914249252114,-5.405794291737321,0.6952415333351823,0.0,0.0,0.0,1.0
1717759088.3499517,map,True,False,5,3,0.0,0.0,2.514336585998535,-2.4243366718292236,0.0,0.0,0.0,0.03398574191282752,0.9994223237418416,4.452587682685981,-5.3681400939710535,0.6950434188882925,0.0,0.0,0.0,1.0
1717759088.4005842,map,True,False,5,3,0.0,0.0,2.514336585998535,-2.4243366718292236,0.0,0.0,0.0,0.03398574191282752,0.9994223237418416,4.452587682685981,-5.3681400939710535,0.6950434188882925,0.0,0.0,0.0,1.0
1717759088.4508748,map,True,False,5,3,0.0,0.0,2.514336585998535,-2.4243366718292236,0.0,0.0,0.0,0.03398574191282752,0.9994223237418416,4.452587682685981,-5.3681400939710535,0.6950434188882925,0.0,0.0,0.0,1.0
1717759088.501125,map,True,False,4,3,0.0,0.0,2.59611177444458,-2.4365434646606445,0.0,0.0,0.0,0.03481648572013059,0.9993937263857537,4.452587682685981,-5.3681400939710535,0.6950434188882925,0.0,0.0,0.0,1.0
1717759088.6009102,map,True,False,4,3,0.0,0.0,2.59611177444458,-2.4365434646606445,0.0,0.0,0.0,0.03481648572013059,0.9993937263857537,4.452587682685981,-5.3681400939710535,0.6950434188882925,0.0,0.0,0.0,1.0
1717759088.6514235,map,True,False,4,3,0.0,0.0,2.59611177444458,-2.4365434646606445,0.0,0.0,0.0,0.03481648572013059,0.9993937263857537,4.548546085060581,-5.081967091467881,0.6578418732331749,0.0,0.0,0.0,1.0
1717759088.7508945,map,True,False,4,3,0.0,0.0,2.59611177444458,-2.4365434646606445,0.0,0.0,0.0,0.03481648572013059,0.9993937263857537,4.548546085060581,-5.081967091467881,0.6578418732331749,0.0,0.0,0.0,1.0
1717759088.9530199,map,True,False,4,3,0.0,0.0,2.59611177444458,-2.4365434646606445,0.0,0.0,0.0,0.03481648572013059,0.9993937263857537,4.612860009939488,-5.026510087855661,0.6757217023321156,0.0,0.0,0.0,1.0
1717759089.0038428,map,True,False,4,3,0.0,0.0,2.59611177444458,-2.4365434646606445,0.0,0.0,0.0,0.03481648572013059,0.9993937263857537,4.614743378292561,-4.947846903807809,0.6884698209430289,0.0,0.0,0.0,1.0
1717759089.1025493,map,True,False,4,3,0.0,0.0,2.59611177444458,-2.4365434646606445,0.0,0.0,0.0,0.03481648572013059,0.9993937263857537,4.614743378292561,-4.947846903807809,0.6884698209430289,0.0,0.0,0.0,1.0
1717759089.2023776,map,True,False,4,3,0.0,0.0,2.59611177444458,-2.4365434646606445,0.0,0.0,0.0,0.03481648572013059,0.9993937263857537,4.614743378292561,-4.947846903807809,0.6884698209430289,0.0,0.0,0.0,1.0
1717759089.252548,map,True,False,4,3,0.0,0.0,2.59611177444458,-2.4365434646606445,0.0,0.0,0.0,0.03481648572013059,0.9993937263857537,4.614743378292561,-4.947846903807809,0.6884698209430289,0.0,0.0,0.0,1.0
1717759089.3031409,map,True,False,4,2,0.0,0.0,2.718468189239502,-2.4642152786254883,0.0,0.0,0.0,0.03554685231144605,0.9993680059583077,4.7144625461299885,-4.696917176110598,0.6874246764726445,0.0,0.0,0.0,1.0
1717759089.4019315,map,True,False,4,2,0.0,0.0,2.718468189239502,-2.4642152786254883,0.0,0.0,0.0,0.03554685231144605,0.9993680059583077,4.7144625461299885,-4.696917176110598,0.6874246764726445,0.0,0.0,0.0,1.0
1717759089.4594378,map,True,False,4,2,0.0,0.0,2.718468189239502,-2.4642152786254883,0.0,0.0,0.0,0.03554685231144605,0.9993680059583077,4.7144625461299885,-4.696917176110598,0.6874246764726445,0.0,0.0,0.0,1.0
1717759089.5049753,map,True,False,4,2,0.0,0.0,2.718468189239502,-2.4642152786254883,0.0,0.0,0.0,0.03554685231144605,0.9993680059583077,4.7144625461299885,-4.696917176110598,0.6874246764726445,0.0,0.0,0.0,1.0
1717759089.5542889,map,True,False,4,2,0.0,0.0,2.718468189239502,-2.4642152786254883,0.0,0.0,0.0,0.03554685231144605,0.9993680059583077,4.7144625461299885,-4.696917176110598,0.6874246764726445,0.0,0.0,0.0,1.0
1717759089.6043625,map,True,False,4,2,0.0,0.0,2.718468189239502,-2.4642152786254883,0.0,0.0,0.0,0.03554685231144605,0.9993680059583077,4.734473401329142,-4.358445326920731,0.6861253543491993,0.0,0.0,0.0,1.0
1717759089.703674,map,True,False,4,2,0.0,0.0,2.718468189239502,-2.4642152786254883,0.0,0.0,0.0,0.03554685231144605,0.9993680059583077,4.725841999998696,-4.2894636622204425,0.6858733556500013,0.0,0.0,0.0,1.0
1717759089.753609,map,True,False,4,2,0.0,0.0,2.718468189239502,-2.4642152786254883,0.0,0.0,0.0,0.03554685231144605,0.9993680059583077,4.725841999998696,-4.2894636622204425,0.6858733556500013,0.0,0.0,0.0,1.0
1717759089.9529939,map,True,False,4,2,0.0,0.0,2.718468189239502,-2.4642152786254883,0.0,0.0,0.0,0.03554685231144605,0.9993680059583077,4.727839925999338,-4.059391959106707,0.6849815906819291,0.0,0.0,0.0,1.0
1717759090.004078,map,True,False,4,2,0.0,0.0,2.89764404296875,-2.500931978225708,0.0,0.0,0.0,0.0379083239829161,0.9992812225879097,4.727839925999338,-4.059391959106707,0.6849815906819291,0.0,0.0,0.0,1.0
1717759090.0541692,map,True,False,4,2,0.0,0.0,2.89764404296875,-2.500931978225708,0.0,0.0,0.0,0.0379083239829161,0.9992812225879097,4.727839925999338,-4.059391959106707,0.6849815906819291,0.0,0.0,0.0,1.0
1717759090.1549456,map,True,False,4,2,0.0,0.0,2.89764404296875,-2.500931978225708,0.0,0.0,0.0,0.0379083239829161,0.9992812225879097,4.727839925999338,-4.059391959106707,0.6849815906819291,0.0,0.0,0.0,1.0
1717759090.258282,map,True,False,4,2,0.0,0.0,2.89764404296875,-2.500931978225708,0.0,0.0,0.0,0.0379083239829161,0.9992812225879097,4.727839925999338,-4.059391959106707,0.6849815906819291,0.0,0.0,0.0,1.0
1717759090.3048284,map,True,False,4,2,0.0,0.0,2.89764404296875,-2.500931978225708,0.0,0.0,0.0,0.0379083239829161,0.9992812225879097,4.759553371646876,-3.678190286121411,0.6835213604783241,0.0,0.0,0.0,1.0
1717759090.3547902,map,True,False,4,2,0.0,0.0,2.89764404296875,-2.500931978225708,0.0,0.0,0.0,0.0379083239829161,0.9992812225879097,4.759553371646876,-3.678190286121411,0.6835213604783241,0.0,0.0,0.0,1.0
1717759090.454152,map,True,False,4,2,0.0,0.0,2.89764404296875,-2.500931978225708,0.0,0.0,0.0,0.0379083239829161,0.9992812225879097,4.759553371646876,-3.678190286121411,0.6835213604783241,0.0,0.0,0.0,1.0
1717759090.5045748,map,True,False,4,2,0.0,0.0,2.89764404296875,-2.500931978225708,0.0,0.0,0.0,0.0379083239829161,0.9992812225879097,4.759553371646876,-3.678190286121411,0.6835213604783241,0.0,0.0,0.0,1.0
1717759090.6047397,map,True,False,4,1,0.0,0.0,2.89764404296875,-2.500931978225708,0.0,0.0,0.0,0.0379083239829161,0.9992812225879097,4.927888203258888,-3.3736801704001307,0.6820915274609816,0.0,0.0,0.0,1.0
1717759090.6543083,map,True,False,3,1,0.0,0.0,3.067598342895508,-2.5264763832092285,0.0,0.0,0.0,0.03799136913430053,0.9992780612644518,4.93908073690455,-3.3426034685861437,0.6819510187948239,0.0,0.0,0.0,1.0
1717759090.7539074,map,True,False,3,1,0.0,0.0,3.067598342895508,-2.5264763832092285,0.0,0.0,0.0,0.03799136913430053,0.9992780612644518,4.93908073690455,-3.3426034685861437,0.6819510187948239,0.0,0.0,0.0,1.0
1717759091.0096455,map,True,False,3,1,0.0,0.0,3.067598342895508,-2.5264763832092285,0.0,0.0,0.0,0.03799136913430053,0.9992780612644518,4.876279481710056,-3.004959883293088,0.6808559173590724,0.0,0.0,0.0,1.0
1717759091.110735,map,True,False,3,1,0.0,0.0,3.067598342895508,-2.5264763832092285,0.0,0.0,0.0,0.03799136913430053,0.9992780612644518,4.876279481710056,-3.004959883293088,0.6808559173590724,0.0,0.0,0.0,1.0
1717759091.2096267,map,True,False,3,1,0.0,0.0,3.067598342895508,-2.5264763832092285,0.0,0.0,0.0,0.03799136913430053,0.9992780612644518,4.876279481710056,-3.004959883293088,0.6808559173590724,0.0,0.0,0.0,1.0
1717759091.3113897,map,True,False,3,1,0.0,0.0,3.067598342895508,-2.5264763832092285,0.0,0.0,0.0,0.03799136913430053,0.9992780612644518,4.876279481710056,-3.004959883293088,0.6808559173590724,0.0,0.0,0.0,1.0
1717759091.3626654,map,True,False,3,1,0.0,0.0,3.067598342895508,-2.5264763832092285,0.0,0.0,0.0,0.03799136913430053,0.9992780612644518,4.876279481710056,-3.004959883293088,0.6808559173590724,0.0,0.0,0.0,1.0
1717759091.411061,map,True,False,3,1,0.0,0.0,3.067598342895508,-2.5264763832092285,0.0,0.0,0.0,0.03799136913430053,0.9992780612644518,4.876279481710056,-3.004959883293088,0.6808559173590724,0.0,0.0,0.0,1.0
1717759091.5122447,map,True,False,3,1,0.0,0.0,3.203972578048706,-2.5672268867492676,0.0,0.0,0.0,0.042458178382450085,0.999098251986967,4.876279481710056,-3.004959883293088,0.6808559173590724,0.0,0.0,0.0,1.0
1717759091.5616386,map,True,False,3,1,0.0,0.0,3.203972578048706,-2.5672268867492676,0.0,0.0,0.0,0.042458178382450085,0.999098251986967,4.876279481710056,-3.004959883293088,0.6808559173590724,0.0,0.0,0.0,1.0
1717759091.6622968,map,True,False,3,1,0.0,0.0,3.203972578048706,-2.5672268867492676,0.0,0.0,0.0,0.042458178382450085,0.999098251986967,4.876279481710056,-3.004959883293088,0.6808559173590724,0.0,0.0,0.0,1.0
1717759091.7246153,map,True,False,3,1,0.0,0.0,3.203972578048706,-2.5672268867492676,0.0,0.0,0.0,0.042458178382450085,0.999098251986967,4.876279481710056,-3.004959883293088,0.6808559173590724,0.0,0.0,0.0,1.0
1717759091.7633479,map,True,False,3,1,0.0,0.0,3.203972578048706,-2.5672268867492676,0.0,0.0,0.0,0.042458178382450085,0.999098251986967,4.876279481710056,-3.004959883293088,0.6808559173590724,0.0,0.0,0.0,1.0
