car_pos_meter , car_pos_cell, car_speed, ped_pos_meter, ped_pos_cell, ped_speed
-5.125, 5, 1, 3.99846, 5, 1
-5.114625, 5, 2, 3.987702, 5, 1
-5.0938, 5, 1, 3.977265, 5, 1
-5.083425, 5, 1, 3.967463, 5, 1
-5.07305, 5, 2, 3.958162, 5, 1
-5.052225, 5, 1, 3.953657, 5, 1
-5.04185, 5, 2, 3.944985, 5, 1
-5.021025, 5, 1, 3.936627, 5, 1
-5.01065, 5, 1, 3.928326, 5, 1
-5.000275, 5, 1, 3.92012, 5, 1
-4.9899, 4, 2, 3.916146, 5, 1
-4.969075, 4, 2, 3.90827, 5, 1
-4.94825, 4, 2, 3.900985, 5, 1
-4.927425, 4, 2, 3.893959, 5, 1
-4.9066, 4, 2, 3.887368, 5, 1
-4.885776, 4, 2, 3.884164, 5, 1
-4.864951, 4, 2, 3.877455, 5, 1
-4.844126, 4, 2, 3.870859, 5, 1
-4.823301, 4, 2, 3.863885, 5, 1
-4.802476, 4, 2, 3.856833, 5, 1
-4.781651, 4, 2, 3.853349, 5, 1
-4.760826, 4, 2, 3.846141, 4, 1
-4.740001, 4, 1, 3.838653, 4, 1
-4.729626, 4, 1, 3.830535, 4, 1
-4.719251, 4, 2, 3.821978, 4, 1
-4.698426, 4, 2, 3.817388, 4, 1
-4.677601, 4, 2, 3.807955, 4, 1
-4.656776, 4, 1, 3.798259, 4, 1
-4.646401, 4, 1, 3.78831, 4, 1
-4.636026, 4, 2, 3.778135, 4, 1
-4.615201, 4, 2, 3.772841, 4, 1
-4.594377, 4, 2, 3.762026, 4, 1
-4.573552, 4, 1, 3.751307, 4, 1
-4.563177, 4, 2, 3.739942, 4, 1
-4.542352, 4, 1, 3.734186, 4, 1
-4.531977, 4, 2, 3.722372, 4, 1
-4.511152, 4, 1, 3.710134, 4, 1
-4.500777, 4, 1, 3.697574, 4, 1
-4.490402, 4, 1, 3.684717, 4, 1
-4.480027, 4, 2, 3.671451, 4, 1
-4.459202, 4, 2, 3.66457, 4, 1
-4.438377, 4, 1, 3.650384, 4, 1
-4.428002, 4, 1, 3.635801, 4, 1
-4.417627, 4, 2, 3.620364, 4, 1
-4.396802, 4, 2, 3.604364, 4, 1
-4.375977, 4, 2, 3.596432, 4, 1
-4.355152, 4, 1, 3.579732, 4, 1
-4.344777, 4, 1, 3.562566, 4, 1
-4.334402, 4, 2, 3.545238, 4, 1
-4.313577, 4, 2, 3.527493, 4, 1
-4.292752, 4, 2, 3.518631, 4, 1
-4.271927, 4, 1, 3.501076, 4, 1
-4.261552, 4, 1, 3.483959, 4, 1
-4.251177, 4, 2, 3.467099, 4, 1
-4.230352, 4, 1, 3.450802, 4, 1
-4.219977, 4, 2, 3.442635, 4, 1
-4.199152, 4, 1, 3.42722, 4, 1
-4.188777, 4, 1, 3.411906, 4, 1
-4.178402, 4, 2, 3.397265, 4, 1
-4.157578, 4, 1, 3.383067, 4, 1
-4.147202, 4, 1, 3.376287, 4, 1
-4.136827, 4, 1, 3.363182, 4, 1
-4.126452, 4, 1, 3.350042, 4, 1
-4.116077, 4, 2, 3.337514, 4, 1
-4.095253, 4, 1, 3.325175, 4, 1
-4.084877, 4, 2, 3.319027, 4, 1
-4.064053, 4, 1, 3.306864, 4, 1
-4.053678, 4, 1, 3.294521, 4, 1
-4.043303, 4, 2, 3.282342, 4, 1
-4.022478, 4, 1, 3.270202, 4, 1
-4.012103, 4, 1, 3.264324, 4, 1
-4.001728, 4, 1, 3.252252, 4, 1
-3.991353, 3, 2, 3.23988, 4, 1
-3.970528, 3, 2, 3.227199, 4, 1
-3.949703, 3, 2, 3.214273, 4, 1
-3.928878, 3, 2, 3.207852, 4, 1
-3.908053, 3, 2, 3.194524, 4, 1
-3.887228, 3, 2, 3.180521, 4, 1
-3.866403, 3, 2, 3.166423, 4, 1
-3.845578, 3, 2, 3.151773, 4, 1
-3.824753, 3, 2, 3.143935, 4, 1
-3.803928, 3, 2, 3.128441, 4, 1
-3.783103, 3, 2, 3.11263, 4, 1
-3.762279, 3, 2, 3.096311, 4, 1
-3.741454, 3, 2, 3.079143, 4, 1
-3.720629, 3, 1, 3.070071, 3, 1
-3.710254, 3, 1, 3.05228, 3, 1
-3.699879, 3, 2, 3.03353, 3, 1
-3.679054, 3, 2, 3.014411, 3, 1
-3.658229, 3, 1, 2.995339, 3, 1
-3.647854, 3, 1, 2.984928, 3, 1
-3.637479, 3, 1, 2.965149, 3, 1
-3.627104, 3, 2, 2.944757, 3, 1
-3.606279, 3, 1, 2.924272, 3, 1
-3.595904, 3, 1, 2.903798, 3, 1
-3.585529, 3, 1, 2.893133, 3, 1
-3.575154, 3, 1, 2.872388, 3, 1
-3.564779, 3, 2, 2.851458, 3, 1
-3.543954, 3, 1, 2.83105, 3, 1
-3.533579, 3, 1, 2.812191, 3, 1
-3.523204, 3, 1, 2.802952, 3, 1
-3.512829, 3, 1, 2.786136, 3, 1
-3.502454, 3, 2, 2.769607, 3, 1
-3.481629, 3, 1, 2.753482, 3, 1
-3.471254, 3, 1, 2.737705, 3, 1
-3.460879, 3, 2, 2.721853, 3, 1
-3.440054, 3, 1, 2.714121, 3, 1
-3.429679, 3, 2, 2.697877, 3, 1
-3.408854, 3, 1, 2.68209, 3, 1
-3.398479, 3, 1, 2.666739, 3, 1
-3.388104, 3, 1, 2.658799, 3, 1
-3.377729, 3, 1, 2.643147, 3, 1
-3.367354, 3, 1, 2.626702, 3, 1
-3.356979, 3, 1, 2.610058, 3, 1
-3.346604, 3, 1, 2.593511, 3, 1
-3.336229, 3, 2, 2.57644, 3, 1
-3.315404, 3, 2, 2.567811, 3, 1
-3.294579, 3, 2, 2.549457, 3, 1
-3.273754, 3, 1, 2.530925, 3, 1
-3.263379, 3, 1, 2.5119, 3, 1
-3.253004, 3, 2, 2.492289, 3, 1
-3.232179, 3, 2, 2.482333, 3, 1
-3.211354, 3, 1, 2.461738, 3, 1
-3.200979, 3, 1, 2.440229, 3, 1
-3.190604, 3, 1, 2.418361, 3, 1
-3.180229, 3, 1, 2.395584, 3, 1
-3.169854, 3, 2, 2.384207, 3, 1
-3.149029, 3, 1, 2.361482, 3, 1
-3.138654, 3, 1, 2.338612, 3, 1
-3.128279, 3, 2, 2.315658, 3, 1
-3.107454, 3, 2, 2.303969, 2, 1
-3.086629, 3, 2, 2.28058, 2, 1
-3.065804, 3, 2, 2.256581, 2, 1
-3.04498, 3, 2, 2.233167, 2, 1
-3.024155, 3, 2, 2.210203, 2, 1
-3.00333, 3, 2, 2.186793, 2, 1
-2.982505, 2, 2, 2.175581, 2, 1
-2.96168, 2, 1, 2.153298, 2, 1
-2.951305, 2, 1, 2.131654, 2, 1
-2.94093, 2, 2, 2.111265, 2, 1
-2.920105, 2, 2, 2.101187, 2, 1
-2.89928, 2, 2, 2.082, 2, 1
-2.878455, 2, 1, 2.063534, 2, 1
-2.86808, 2, 2, 2.045268, 2, 1
-2.847255, 2, 2, 2.027475, 2, 1
-2.82643, 2, 1, 2.009538, 2, 1
-2.816055, 2, 2, 2.000894, 2, 1
-2.79523, 2, 1, 1.983516, 2, 1
-2.784855, 2, 2, 1.966995, 2, 1
-2.76403, 2, 2, 1.950588, 2, 1
-2.743206, 2, 2, 1.933675, 2, 1
-2.722381, 2, 1, 1.925289, 2, 1
-2.712006, 2, 1, 1.908093, 2, 1
-2.701631, 2, 2, 1.890589, 2, 1
-2.680806, 2, 2, 1.873099, 2, 1
-2.659981, 2, 1, 1.854415, 2, 1
-2.649606, 2, 1, 1.845346, 2, 1
-2.639231, 2, 1, 1.826208, 2, 1
-2.628856, 2, 2, 1.806804, 2, 1
-2.608031, 2, 2, 1.787492, 2, 1
-2.587206, 2, 1, 1.766875, 2, 1
-2.576831, 2, 1, 1.756647, 2, 1
-2.566456, 2, 1, 1.735499, 2, 1
-2.556081, 2, 2, 1.714253, 2, 1
-2.535256, 2, 2, 1.693347, 2, 1
-2.514431, 2, 1, 1.671807, 2, 1
-2.504056, 2, 1, 1.661316, 2, 1
-2.493681, 2, 1, 1.639772, 2, 1
-2.483306, 2, 2, 1.618834, 2, 1
-2.462481, 2, 2, 1.598069, 2, 1
-2.441656, 2, 1, 1.576684, 2, 1
-2.431281, 2, 1, 1.5663, 2, 1
-2.420906, 2, 1, 1.54608, 2, 1
-2.410531, 2, 2, 1.527129, 1, 1
-2.389706, 2, 2, 1.508381, 1, 1
-2.368881, 2, 2, 1.489512, 1, 1
-2.348056, 2, 2, 1.480051, 1, 1
-2.327231, 2, 2, 1.460998, 1, 1
-2.306406, 2, 2, 1.442477, 1, 1
-2.285582, 2, 2, 1.423647, 1, 1
-2.264757, 2, 2, 1.405226, 1, 1
-2.243932, 2, 2, 1.395719, 1, 1
-2.223107, 2, 2, 1.377649, 1, 1
-2.202282, 2, 2, 1.359682, 1, 1
-2.181457, 2, 2, 1.341911, 1, 1
-2.160632, 2, 2, 1.323933, 1, 1
-2.139807, 2, 2, 1.314248, 1, 1
-2.118982, 2, 2, 1.295345, 1, 1
-2.098157, 2, 2, 1.275424, 1, 1
-2.077332, 2, 2, 1.255534, 1, 1
-2.056508, 2, 2, 1.234602, 1, 1
-2.035683, 2, 2, 1.224435, 1, 1
-2.014858, 2, 2, 1.203507, 1, 1
-1.994033, 1, 2, 1.182766, 1, 1
-1.973208, 1, 2, 1.161475, 1, 1
-1.952383, 1, 2, 1.150811, 1, 1
-1.931558, 1, 2, 1.129011, 1, 1
-1.910733, 1, 2, 1.106625, 1, 1
-1.889908, 1, 2, 1.08345, 1, 1
-1.869083, 1, 2, 1.060337, 1, 1
-1.848258, 1, 2, 1.036637, 1, 1
-1.827433, 1, 2, 1.024423, 1, 1
-1.806607, 1, 2, 1.000417, 1, 1
-1.785782, 1, 2, 0.9757996, 1, 1
-1.764957, 1, 2, 0.9518869, 1, 1
-1.744132, 1, 2, 0.9271424, 1, 1
-1.723307, 1, 2, 0.9146345, 1, 1
-1.702482, 1, 2, 0.8911526, 1, 1
-1.681657, 1, 2, 0.8682795, 1, 1
-1.660832, 1, 2, 0.8470435, 1, 1
-1.640007, 1, 2, 0.8271179, 1, 1
-1.619182, 1, 2, 0.8177352, 1, 1
-1.598357, 1, 2, 0.7992978, 1, 1
-1.577532, 1, 2, 0.7813041, 1, 1
-1.556707, 1, 2, 0.7635241, 0, 1
-1.535882, 1, 2, 0.7457101, 0, 1
-1.515057, 1, 2, 0.7367361, 0, 1
-1.494232, 1, 2, 0.718549, 0, 1
-1.473407, 1, 2, 0.700808, 0, 1
-1.452582, 1, 2, 0.6830854, 0, 1
-1.431757, 1, 2, 0.6654642, 0, 1
-1.410932, 1, 2, 0.656697, 0, 1
-1.390107, 1, 2, 0.6390409, 0, 1
-1.369282, 1, 2, 0.6216388, 0, 1
-1.348457, 1, 2, 0.6039228, 0, 1
-1.327632, 1, 2, 0.5859613, 0, 1
-1.306807, 1, 2, 0.5769598, 0, 1
-1.285982, 1, 2, 0.5586393, 0, 1
-1.265157, 1, 2, 0.5398178, 0, 1
-1.244332, 1, 2, 0.5209622, 0, 1
-1.223507, 1, 2, 0.5020194, 0, 1
-1.202682, 1, 2, 0.4927135, 0, 1
-1.181857, 1, 2, 0.4739399, 0, 1
-1.161032, 1, 2, 0.455081, 0, 1
-1.140207, 1, 2, 0.4362552, 0, 1
-1.119382, 1, 2, 0.4178648, 0, 1
-1.098557, 1, 2, 0.4093733, 0, 1
-1.077731, 1, 2, 0.3914592, 0, 1
-1.056906, 1, 2, 0.3734846, 0, 1
-1.036081, 1, 2, 0.3558452, 0, 1
-1.015256, 1, 2, 0.3384585, 0, 1
-0.9944314, 0, 2, 0.3303692, 0, 1
-0.9736063, 0, 2, 0.3144004, 0, 1
-0.9527813, 0, 2, 0.2990189, 0, 1
-0.9319563, 0, 2, 0.284133, 0, 1
-0.9111313, 0, 2, 0.2694445, 0, 1
-0.8903062, 0, 2, 0.2617693, 0, 1
-0.8694812, 0, 2, 0.2470818, 0, 1
-0.8486562, 0, 2, 0.2327356, 0, 1
-0.8278311, 0, 2, 0.2180636, 0, 1
-0.8070061, 0, 2, 0.2035136, 0, 1
-0.7861811, 0, 2, 0.1962297, 0, 1
-0.7653561, 0, 2, 0.1821046, 0, 1
-0.744531, 0, 2, 0.1679688, 0, 1
-0.723706, 0, 2, 0.1539669, 0, 1
-0.702881, 0, 2, 0.1402104, 0, 1
-0.682056, 0, 2, 0.1332195, 0, 1
-0.6612309, 0, 2, 0.1192226, 0, 1
-0.6404059, 0, 2, 0.1046317, 0, 1
-0.6195809, 0, 2, 0.08994484, 0, 1
-0.5987558, 0, 2, 0.07488489, 0, 1
-0.5779308, 0, 2, 0.06738877, 0, 1
-0.5571058, 0, 2, 0.05226374, 0, 1
-0.5362808, 0, 2, 0.0366385, 0, 1
-0.5154557, 0, 2, 0.02083755, 0, 1
-0.4946307, 0, 2, 0.004671097, 0, 1
-0.4738057, 0, 2, -0.003460884, 0, 1
-0.4529807, 0, 2, -0.0206337, 0, 1
-0.4321557, 0, 2, -0.0381031, 0, 1
-0.4113307, 0, 2, -0.05627537, 0, 1
-0.3905057, 0, 2, -0.07448292, 0, 1
-0.3696807, 0, 2, -0.08373976, 0, 1
-0.3488557, 0, 2, -0.1024427, 0, 1
-0.3280307, 0, 2, -0.1217403, 0, 1
-0.3072057, 0, 2, -0.1413932, 0, 1
-0.2863807, 0, 2, -0.1614084, 0, 1
-0.2655557, 0, 2, -0.1716084, 0, 1
-0.2447307, 0, 2, -0.1925974, 0, 1
-0.2239057, 0, 2, -0.2139063, 0, 1
-0.2030807, 0, 2, -0.235816, 0, 1
-0.1822557, 0, 2, -0.2576246, 0, 1
-0.1614307, 0, 2, -0.268477, 0, 1
-0.1406057, 0, 2, -0.2898169, 0, 1
-0.1197807, 0, 2, -0.3111844, 0, 1
-0.09895575, 0, 2, -0.3324795, 0, 1
-0.07813075, 0, 2, -0.3529124, 0, 1
-0.05730575, 0, 2, -0.3631377, 0, 1
-0.03648075, 0, 2, -0.3831329, 0, 1
-0.01565576, 0, 2, -0.4031525, 0, 1
0.005169243, 0, 2, -0.4228163, 0, 1
0.02599424, 0, 2, -0.4423132, 0, 1
0.04681924, 0, 2, -0.4519863, 0, 1
0.06764424, 0, 2, -0.4702129, 0, 1
0.08846924, 0, 2, -0.4879503, 0, 1
0.1092942, 0, 2, -0.5051069, 0, 1
0.1301192, 0, 2, -0.5216308, 0, 1
0.1509442, 0, 2, -0.5299025, 0, 1
0.1717692, 0, 2, -0.5455132, 0, 1
0.1925942, 0, 2, -0.5603104, 0, 1
0.2134192, 0, 2, -0.574688, 0, 1
0.2342442, 0, 2, -0.589551, 0, 1
0.2550692, 0, 2, -0.5964003, 0, 1
0.2758942, 0, 2, -0.6104765, 0, 1
0.2967192, 0, 2, -0.6246047, 0, 1
0.3175442, 0, 2, -0.6381168, 0, 1
0.3383692, 0, 2, -0.6515589, 0, 1
0.3591942, 0, 2, -0.6583385, 0, 1
0.3800192, 0, 2, -0.6713667, 0, 1
0.4008442, 0, 2, -0.6842985, 0, 1
0.4216692, 0, 2, -0.6968255, 0, 1
0.4424942, 0, 2, -0.7090793, 0, 1
0.4633192, 0, 2, -0.7150173, 0, 1
0.4841442, 0, 2, -0.7268233, 0, 1
0.5049692, 0, 2, -0.7381845, 0, 1
0.5257943, 0, 2, -0.7492976, 0, 1
0.5466193, 0, 2, -0.7602706, 0, 1
0.5674443, 0, 2, -0.7655668, 0, 1
0.5882694, 0, 2, -0.7765121, -1, 1
0.6090944, 0, 2, -0.786952, -1, 1
0.6299194, 0, 2, -0.7963209, -1, 1
0.6507444, 0, 2, -0.8051891, -1, 1
0.6715695, 0, 2, -0.8090463, -1, 1
0.6923945, 0, 2, -0.8166251, -1, 1
0.7132195, 0, 2, -0.8237581, -1, 1
0.7340446, 0, 2, -0.8302622, -1, 1
0.7548696, 0, 2, -0.8366065, -1, 1
0.7756946, 0, 2, -0.8392653, -1, 1
0.7965196, 0, 2, -0.8445215, -1, 1
0.8173447, 0, 2, -0.8496971, -1, 1
0.8381697, 0, 2, -0.8546014, -1, 1
0.8589947, 0, 2, -0.8598108, -1, 1
0.8798198, 0, 2, -0.8650198, -1, 1
0.9006448, 0, 2, -0.867631, -1, 1
0.9214698, 0, 2, -0.8730001, -1, 1
0.9422948, 0, 2, -0.8781466, -1, 1
0.9631199, 0, 2, -0.8826671, -1, 1
0.9839449, 0, 2, -0.8849988, -1, 1
1.00477, -1, 2, -0.8897748, -1, 1
1.025595, -1, 2, -0.8948593, -1, 1
1.04642, -1, 2, -0.8996029, -1, 1
1.067245, -1, 2, -0.9047909, -1, 1
1.08807, -1, 2, -0.9099565, -1, 1
1.108895, -1, 2, -0.9124699, -1, 1
1.12972, -1, 2, -0.917697, -1, 1
1.150545, -1, 2, -0.9224987, -1, 1
1.17137, -1, 2, -0.9274063, -1, 1
1.192195, -1, 2, -0.9324608, -1, 1
1.21302, -1, 2, -0.9350252, -1, 1
1.233845, -1, 2, -0.9401851, -1, 1
1.25467, -1, 2, -0.9452376, -1, 1
1.275495, -1, 2, -0.9505315, -1, 1
1.29632, -1, 2, -0.9557281, -1, 1
1.317145, -1, 2, -0.9582992, -1, 1
1.33797, -1, 2, -0.963274, -1, 1
1.358795, -1, 2, -0.9681807, -1, 1
1.37962, -1, 2, -0.9730344, -1, 1
1.400445, -1, 2, -0.977725, -1, 1
1.42127, -1, 2, -0.980289, -1, 1
1.442096, -1, 2, -0.9854746, -1, 1
1.462921, -1, 2, -0.9909096, -1, 1
1.483746, -1, 2, -0.9966221, -1, 1
1.504571, -1, 2, -1.002426, -1, 1
1.525396, -1, 2, -1.005446, -1, 1
1.546221, -1, 2, -1.011749, -1, 1
1.567046, -1, 2, -1.017868, -1, 1
1.587871, -1, 2, -1.023927, -1, 1
1.608696, -1, 2, -1.029701, -1, 1
1.629521, -1, 2, -1.032429, -1, 1
1.650346, -1, 2, -1.037698, -1, 1
1.671171, -1, 2, -1.042448, -1, 1
1.691996, -1, 2, -1.046632, -1, 1
1.712821, -1, 2, -1.050515, -1, 1
1.733646, -1, 2, -1.052217, -1, 1
1.754471, -1, 2, -1.055241, -1, 1
1.775296, -1, 2, -1.057843, -1, 1
1.796121, -1, 2, -1.059802, -1, 1
1.816946, -1, 2, -1.059624, -1, 1
1.837771, -1, 2, -1.06, -1, 1
1.858596, -1, 2, -1.059796, -1, 1
1.879421, -1, 2, -1.059408, -1, 1
1.900246, -1, 2, -1.057817, -1, 1
1.921071, -1, 2, -1.056346, -1, 1
1.941896, -1, 2, -1.055442, -1, 1
1.962721, -1, 2, -1.05365, -1, 1
1.983546, -1, 2, -1.051622, -1, 1
2.004371, -2, 2, -1.049708, -1, 1
2.025196, -2, 2, -1.047746, -1, 1
2.046021, -2, 2, -1.046805, -1, 1
2.066846, -2, 2, -1.044623, -1, 1
2.087671, -2, 2, -1.041391, -1, 1
2.108496, -2, 2, -1.037355, -1, 1
2.129321, -2, 2, -1.032197, -1, 1
2.150146, -2, 2, -1.029221, -1, 1
2.17097, -2, 2, -1.0228, -1, 1
2.191795, -2, 2, -1.016198, -1, 1
2.21262, -2, 2, -1.008623, -1, 1
2.233445, -2, 2, -1.001465, -1, 1
2.25427, -2, 2, -0.997551, -1, 1
2.275095, -2, 2, -0.9894052, -1, 1
2.29592, -2, 2, -0.9809694, -1, 1
2.316745, -2, 2, -0.9721699, -1, 1
2.33757, -2, 2, -0.9625626, -1, 1
2.358395, -2, 2, -0.9577522, -1, 1
2.37922, -2, 2, -0.9475107, -1, 1
2.400044, -2, 2, -0.9371777, -1, 1
2.420869, -2, 2, -0.9266167, -1, 1
2.441694, -2, 2, -0.9152865, -1, 1
2.462519, -2, 2, -0.9096498, -1, 1
2.483344, -2, 2, -0.8978834, -1, 1
2.504169, -2, 2, -0.8860636, -1, 1
2.524994, -2, 2, -0.874332, -1, 1
2.545819, -2, 2, -0.8618765, -1, 1
2.566644, -2, 2, -0.8557215, -1, 1
2.587469, -2, 2, -0.8426704, -1, 1
2.608294, -2, 2, -0.8286266, -1, 1
2.629118, -2, 2, -0.8141427, -1, 1
