timestamp_sec,frame_id,game_played,yielding,player1discrete,player2discrete,player1yieldprob,player2yieldprob,player1_pose_x,player1_pose_y,player1_pose_z,player1_pose_orient_x,player1_pose_orient_y,player1_pose_orient_z,player1_pose_orient_w,player2_pose_x,player2_pose_y,player2_pose_z,player2_pose_orient_x,player2_pose_orient_y,player2_pose_orient_z,player2_pose_orient_w
1717758328.2841666,map,True,False,4,5,0.0,0.0,2.6168863773345947,-2.4201769828796387,0.0,0.0,0.0,0.031259392327942746,0.999511301313573,4.254443453433556,-7.828650155365534,0.9865775060672981,0.0,0.0,0.0,1.0
1717758328.3341606,map,True,False,4,5,0.0,0.0,2.6168863773345947,-2.4201769828796387,0.0,0.0,0.0,0.031259392327942746,0.999511301313573,4.254443453433556,-7.828650155365534,0.9865775060672981,0.0,0.0,0.0,1.0
1717758328.3849037,map,True,False,4,5,0.0,0.0,2.6168863773345947,-2.4201769828796387,0.0,0.0,0.0,0.031259392327942746,0.999511301313573,4.254443453433556,-7.828650155365534,0.9865775060672981,0.0,0.0,0.0,1.0
1717758328.4350438,map,True,False,4,5,0.0,0.0,2.6168863773345947,-2.4201769828796387,0.0,0.0,0.0,0.031259392327942746,0.999511301313573,4.254443453433556,-7.828650155365534,0.9865775060672981,0.0,0.0,0.0,1.0
1717758328.4856288,map,True,False,4,5,0.0,0.0,2.6168863773345947,-2.4201769828796387,0.0,0.0,0.0,0.031259392327942746,0.999511301313573,4.254443453433556,-7.828650155365534,0.9865775060672981,0.0,0.0,0.0,1.0
1717758328.536114,map,True,False,4,5,0.0,0.0,2.7175114154815674,-2.4385862350463867,0.0,0.0,0.0,0.031501146465758675,0.9995037128852783,4.305289780646028,-7.690627919162807,0.8001213186616902,0.0,0.0,0.0,1.0
1717758328.5878003,map,True,False,4,5,0.0,0.0,2.7175114154815674,-2.4385862350463867,0.0,0.0,0.0,0.031501146465758675,0.9995037128852783,4.302311353814965,-7.774935632747686,0.7704810079520557,0.0,0.0,0.0,1.0
1717758328.6360054,map,True,False,4,5,0.0,0.0,2.7175114154815674,-2.4385862350463867,0.0,0.0,0.0,0.031501146465758675,0.9995037128852783,4.302311353814965,-7.774935632747686,0.7704810079520557,0.0,0.0,0.0,1.0
1717758328.688711,map,True,False,4,5,0.0,0.0,2.7175114154815674,-2.4385862350463867,0.0,0.0,0.0,0.031501146465758675,0.9995037128852783,4.302311353814965,-7.774935632747686,0.7704810079520557,0.0,0.0,0.0,1.0
1717758328.739224,map,True,False,4,5,0.0,0.0,2.7175114154815674,-2.4385862350463867,0.0,0.0,0.0,0.031501146465758675,0.9995037128852783,4.302311353814965,-7.774935632747686,0.7704810079520557,0.0,0.0,0.0,1.0
1717758328.8881507,map,True,False,4,5,0.0,0.0,2.7175114154815674,-2.4385862350463867,0.0,0.0,0.0,0.031501146465758675,0.9995037128852783,4.3522869661742885,-7.346627913700187,0.7705250690464296,0.0,0.0,0.0,1.0
1717758328.939173,map,True,False,4,5,0.0,0.0,2.7175114154815674,-2.4385862350463867,0.0,0.0,0.0,0.031501146465758675,0.9995037128852783,4.3522869661742885,-7.346627913700187,0.7705250690464296,0.0,0.0,0.0,1.0
1717758328.9900167,map,True,False,4,5,0.0,0.0,2.7175114154815674,-2.4385862350463867,0.0,0.0,0.0,0.031501146465758675,0.9995037128852783,4.3522869661742885,-7.346627913700187,0.7705250690464296,0.0,0.0,0.0,1.0
1717758329.0396369,map,True,False,4,5,0.0,0.0,2.7175114154815674,-2.4385862350463867,0.0,0.0,0.0,0.031501146465758675,0.9995037128852783,4.3522869661742885,-7.346627913700187,0.7705250690464296,0.0,0.0,0.0,1.0
1717758329.13843,map,True,False,4,5,0.0,0.0,2.824695348739624,-2.4598019123077393,0.0,0.0,0.0,0.03205724379553029,0.9994860311765769,4.3522869661742885,-7.346627913700187,0.7705250690464296,0.0,0.0,0.0,1.0
1717758329.1904495,map,True,False,4,5,0.0,0.0,2.824695348739624,-2.4598019123077393,0.0,0.0,0.0,0.03205724379553029,0.9994860311765769,4.3522869661742885,-7.346627913700187,0.7705250690464296,0.0,0.0,0.0,1.0
1717758329.2395022,map,True,False,4,5,0.0,0.0,2.824695348739624,-2.4598019123077393,0.0,0.0,0.0,0.03205724379553029,0.9994860311765769,4.488749784107302,-7.375384951072261,0.7421015766691063,0.0,0.0,0.0,1.0
1717758329.2894576,map,True,False,4,5,0.0,0.0,2.824695348739624,-2.4598019123077393,0.0,0.0,0.0,0.03205724379553029,0.9994860311765769,4.488749784107302,-7.375384951072261,0.7421015766691063,0.0,0.0,0.0,1.0
1717758329.3891513,map,True,False,4,5,0.0,0.0,2.824695348739624,-2.4598019123077393,0.0,0.0,0.0,0.03205724379553029,0.9994860311765769,4.488749784107302,-7.375384951072261,0.7421015766691063,0.0,0.0,0.0,1.0
1717758329.441866,map,True,False,4,5,0.0,0.0,2.824695348739624,-2.4598019123077393,0.0,0.0,0.0,0.03205724379553029,0.9994860311765769,4.488749784107302,-7.375384951072261,0.7421015766691063,0.0,0.0,0.0,1.0
1717758329.4927697,map,True,False,4,5,0.0,0.0,2.824695348739624,-2.4598019123077393,0.0,0.0,0.0,0.03205724379553029,0.9994860311765769,4.488749784107302,-7.375384951072261,0.7421015766691063,0.0,0.0,0.0,1.0
1717758329.5906346,map,True,False,4,5,0.0,0.0,2.824695348739624,-2.4598019123077393,0.0,0.0,0.0,0.03205724379553029,0.9994860311765769,4.456517993075401,-6.956166993067576,0.763346737913118,0.0,0.0,0.0,1.0
1717758329.6413035,map,True,False,4,5,0.0,0.0,2.824695348739624,-2.4598019123077393,0.0,0.0,0.0,0.03205724379553029,0.9994860311765769,4.456517993075401,-6.956166993067576,0.763346737913118,0.0,0.0,0.0,1.0
1717758329.691759,map,True,False,4,5,0.0,0.0,2.824695348739624,-2.4598019123077393,0.0,0.0,0.0,0.03205724379553029,0.9994860311765769,4.456517993075401,-6.956166993067576,0.763346737913118,0.0,0.0,0.0,1.0
1717758329.7416797,map,True,False,4,5,0.0,0.0,2.824695348739624,-2.4598019123077393,0.0,0.0,0.0,0.03205724379553029,0.9994860311765769,4.456517993075401,-6.956166993067576,0.763346737913118,0.0,0.0,0.0,1.0
1717758329.8939621,map,True,False,4,4,0.5922520728754596,0.5922520728754596,2.9329473972320557,-2.478285551071167,0.0,0.0,0.0,0.03244149596357388,0.9994736418671585,4.4878106543692935,-6.545064285612273,0.7315015875474298,0.0,0.0,0.0,1.0
1717758329.9434905,map,True,False,4,4,0.5922520728754596,0.5922520728754596,2.9329473972320557,-2.478285551071167,0.0,0.0,0.0,0.03244149596357388,0.9994736418671585,4.4878106543692935,-6.545064285612273,0.7315015875474298,0.0,0.0,0.0,1.0
1717758329.9940636,map,True,True,4,4,0.5922520728754596,0.5922520728754596,2.9329473972320557,-2.478285551071167,0.0,0.0,0.0,0.03244149596357388,0.9994736418671585,4.4878106543692935,-6.545064285612273,0.7315015875474298,0.0,0.0,0.0,1.0
1717758330.0452023,map,True,False,4,4,0.5922520728754596,0.5922520728754596,2.9329473972320557,-2.478285551071167,0.0,0.0,0.0,0.03244149596357388,0.9994736418671585,4.4878106543692935,-6.545064285612273,0.7315015875474298,0.0,0.0,0.0,1.0
1717758330.143825,map,True,False,4,4,0.5922520728754596,0.5922520728754596,2.9329473972320557,-2.478285551071167,0.0,0.0,0.0,0.03244149596357388,0.9994736418671585,4.4878106543692935,-6.545064285612273,0.7315015875474298,0.0,0.0,0.0,1.0
1717758330.1934466,map,True,False,4,3,0.0,0.0,2.9329473972320557,-2.478285551071167,0.0,0.0,0.0,0.03244149596357388,0.9994736418671585,4.473861484364465,-5.726684903131739,0.7213091129682965,0.0,0.0,0.0,1.0
1717758330.2956815,map,True,False,4,3,0.0,0.0,2.9329473972320557,-2.478285551071167,0.0,0.0,0.0,0.03244149596357388,0.9994736418671585,4.504161874036525,-5.7702613348335605,0.7020452539253264,0.0,0.0,0.0,1.0
1717758330.3446977,map,True,False,4,3,0.0,0.0,2.953624725341797,-2.484922170639038,0.0,0.0,0.0,0.03250387037850671,0.9994716142399224,4.504161874036525,-5.7702613348335605,0.7020452539253264,0.0,0.0,0.0,1.0
1717758330.3948877,map,True,False,4,3,0.0,0.0,2.953624725341797,-2.484922170639038,0.0,0.0,0.0,0.03250387037850671,0.9994716142399224,4.504161874036525,-5.7702613348335605,0.7020452539253264,0.0,0.0,0.0,1.0
1717758330.4465406,map,True,False,4,3,0.0,0.0,2.953624725341797,-2.484922170639038,0.0,0.0,0.0,0.03250387037850671,0.9994716142399224,4.504161874036525,-5.7702613348335605,0.7020452539253264,0.0,0.0,0.0,1.0
1717758330.5040863,map,True,False,4,3,0.0,0.0,2.953624725341797,-2.484922170639038,0.0,0.0,0.0,0.03250387037850671,0.9994716142399224,4.504161874036525,-5.7702613348335605,0.7020452539253264,0.0,0.0,0.0,1.0
1717758330.5993168,map,True,False,4,3,0.0,0.0,2.953624725341797,-2.484922170639038,0.0,0.0,0.0,0.03250387037850671,0.9994716142399224,4.497647627744341,-5.572944816927418,0.7517802085240538,0.0,0.0,0.0,1.0
1717758330.6494417,map,True,False,4,3,0.0,0.0,2.953624725341797,-2.484922170639038,0.0,0.0,0.0,0.03250387037850671,0.9994716142399224,4.497647627744341,-5.572944816927418,0.7517802085240538,0.0,0.0,0.0,1.0
1717758330.699859,map,True,False,4,3,0.0,0.0,2.953624725341797,-2.484922170639038,0.0,0.0,0.0,0.03250387037850671,0.9994716142399224,4.497647627744341,-5.572944816927418,0.7517802085240538,0.0,0.0,0.0,1.0
1717758330.8999174,map,True,False,4,3,0.0,0.0,2.953624725341797,-2.484922170639038,0.0,0.0,0.0,0.03250387037850671,0.9994716142399224,4.53071342011175,-5.343150340315583,0.7378458158288008,0.0,0.0,0.0,1.0
1717758330.9509032,map,True,False,4,3,0.0,0.0,2.953624725341797,-2.484922170639038,0.0,0.0,0.0,0.03250387037850671,0.9994716142399224,4.53071342011175,-5.343150340315583,0.7378458158288008,0.0,0.0,0.0,1.0
1717758331.000638,map,True,True,3,3,0.6616527499769684,0.6616527499769684,3.195103645324707,-2.519453525543213,0.0,0.0,0.0,0.036035816352214055,0.9993505007786813,4.53071342011175,-5.343150340315583,0.7378458158288008,0.0,0.0,0.0,1.0
1717758331.0508919,map,True,True,3,3,0.6616527499769684,0.6616527499769684,3.195103645324707,-2.519453525543213,0.0,0.0,0.0,0.036035816352214055,0.9993505007786813,4.53071342011175,-5.343150340315583,0.7378458158288008,0.0,0.0,0.0,1.0
1717758331.152684,map,True,True,3,3,0.6616527499769684,0.6616527499769684,3.195103645324707,-2.519453525543213,0.0,0.0,0.0,0.036035816352214055,0.9993505007786813,4.53071342011175,-5.343150340315583,0.7378458158288008,0.0,0.0,0.0,1.0
1717758331.2493277,map,True,False,3,3,0.6616527499769684,0.6616527499769684,3.195103645324707,-2.519453525543213,0.0,0.0,0.0,0.036035816352214055,0.9993505007786813,4.663703090689876,-5.083237447205319,0.6971900261997789,0.0,0.0,0.0,1.0
1717758331.2996228,map,True,True,3,3,0.6616527499769684,0.6616527499769684,3.195103645324707,-2.519453525543213,0.0,0.0,0.0,0.036035816352214055,0.9993505007786813,4.663703090689876,-5.083237447205319,0.6971900261997789,0.0,0.0,0.0,1.0
1717758331.349955,map,True,True,3,3,0.6616527499769684,0.6616527499769684,3.195103645324707,-2.519453525543213,0.0,0.0,0.0,0.036035816352214055,0.9993505007786813,4.663703090689876,-5.083237447205319,0.6971900261997789,0.0,0.0,0.0,1.0
1717758331.4494317,map,True,False,3,3,0.6616527499769684,0.6616527499769684,3.195103645324707,-2.519453525543213,0.0,0.0,0.0,0.036035816352214055,0.9993505007786813,4.663703090689876,-5.083237447205319,0.6971900261997789,0.0,0.0,0.0,1.0
1717758331.5032,map,True,False,3,2,0.0,0.0,3.195103645324707,-2.519453525543213,0.0,0.0,0.0,0.036035816352214055,0.9993505007786813,4.680994122746387,-4.750963998822571,0.6847250823925364,0.0,0.0,0.0,1.0
1717758331.550611,map,True,False,3,2,0.0,0.0,3.195103645324707,-2.519453525543213,0.0,0.0,0.0,0.036035816352214055,0.9993505007786813,4.688151327472773,-4.693872053573701,0.6879509012672391,0.0,0.0,0.0,1.0
1717758331.600663,map,True,False,3,2,0.0,0.0,3.2879068851470947,-2.5464117527008057,0.0,0.0,0.0,0.036719139977345334,0.9993256291784266,4.688151327472773,-4.693872053573701,0.6879509012672391,0.0,0.0,0.0,1.0
1717758331.700416,map,True,False,3,2,0.0,0.0,3.2879068851470947,-2.5464117527008057,0.0,0.0,0.0,0.036719139977345334,0.9993256291784266,4.688151327472773,-4.693872053573701,0.6879509012672391,0.0,0.0,0.0,1.0
1717758331.7535279,map,True,False,3,2,0.0,0.0,3.2879068851470947,-2.5464117527008057,0.0,0.0,0.0,0.036719139977345334,0.9993256291784266,4.688151327472773,-4.693872053573701,0.6879509012672391,0.0,0.0,0.0,1.0
1717758331.9001546,map,True,False,3,2,0.0,0.0,3.2879068851470947,-2.5464117527008057,0.0,0.0,0.0,0.036719139977345334,0.9993256291784266,4.669059360184866,-4.5038444763296654,0.6873128496818585,0.0,0.0,0.0,1.0
1717758331.9511716,map,True,False,3,2,0.0,0.0,3.2879068851470947,-2.5464117527008057,0.0,0.0,0.0,0.036719139977345334,0.9993256291784266,4.669059360184866,-4.5038444763296654,0.6873128496818585,0.0,0.0,0.0,1.0
1717758332.0019202,map,True,False,3,2,0.0,0.0,3.2879068851470947,-2.5464117527008057,0.0,0.0,0.0,0.036719139977345334,0.9993256291784266,4.669059360184866,-4.5038444763296654,0.6873128496818585,0.0,0.0,0.0,1.0
1717758332.1004512,map,True,False,2,2,0.49874686716791977,0.49874686716791977,3.3751220703125,-2.5843169689178467,0.0,0.0,0.0,0.03730927722528777,0.9993037690953827,4.669059360184866,-4.5038444763296654,0.6873128496818585,0.0,0.0,0.0,1.0
1717758332.1514106,map,True,False,2,2,0.49874686716791977,0.49874686716791977,3.3751220703125,-2.5843169689178467,0.0,0.0,0.0,0.03730927722528777,0.9993037690953827,4.669059360184866,-4.5038444763296654,0.6873128496818585,0.0,0.0,0.0,1.0
1717758332.250253,map,True,True,2,2,0.49874686716791977,0.49874686716791977,3.3751220703125,-2.5843169689178467,0.0,0.0,0.0,0.03730927722528777,0.9993037690953827,4.716668083544811,-4.320213898418297,0.683723573071432,0.0,0.0,0.0,1.0
1717758332.3016734,map,True,True,2,2,0.49874686716791977,0.49874686716791977,3.3751220703125,-2.5843169689178467,0.0,0.0,0.0,0.03730927722528777,0.9993037690953827,4.716668083544811,-4.320213898418297,0.683723573071432,0.0,0.0,0.0,1.0
1717758332.4014065,map,True,False,2,2,0.49874686716791977,0.49874686716791977,3.3751220703125,-2.5843169689178467,0.0,0.0,0.0,0.03730927722528777,0.9993037690953827,4.716668083544811,-4.320213898418297,0.683723573071432,0.0,0.0,0.0,1.0
1717758332.5006778,map,True,True,2,2,0.49874686716791977,0.49874686716791977,3.3751220703125,-2.5843169689178467,0.0,0.0,0.0,0.03730927722528777,0.9993037690953827,4.68177297738606,-4.138303004907972,0.6833629380152879,0.0,0.0,0.0,1.0
1717758332.551162,map,True,False,2,2,0.49874686716791977,0.49874686716791977,3.3751220703125,-2.5843169689178467,0.0,0.0,0.0,0.03730927722528777,0.9993037690953827,4.685825114021067,-4.125713172575748,0.6858373459977283,0.0,0.0,0.0,1.0
1717758332.6022737,map,True,True,2,2,0.49874686716791977,0.49874686716791977,3.456655979156494,-2.5915584564208984,0.0,0.0,0.0,0.03902735367546582,0.9992381412393192,4.685825114021067,-4.125713172575748,0.6858373459977283,0.0,0.0,0.0,1.0
1717758332.653029,map,True,True,2,2,0.49874686716791977,0.49874686716791977,3.456655979156494,-2.5915584564208984,0.0,0.0,0.0,0.03902735367546582,0.9992381412393192,4.685825114021067,-4.125713172575748,0.6858373459977283,0.0,0.0,0.0,1.0
1717758332.7038517,map,True,False,2,2,0.49874686716791977,0.49874686716791977,3.456655979156494,-2.5915584564208984,0.0,0.0,0.0,0.03902735367546582,0.9992381412393192,4.685825114021067,-4.125713172575748,0.6858373459977283,0.0,0.0,0.0,1.0
1717758332.7548199,map,True,True,2,2,0.49874686716791977,0.49874686716791977,3.456655979156494,-2.5915584564208984,0.0,0.0,0.0,0.03902735367546582,0.9992381412393192,4.685825114021067,-4.125713172575748,0.6858373459977283,0.0,0.0,0.0,1.0
1717758332.8548098,map,True,True,2,2,0.49874686716791977,0.49874686716791977,3.456655979156494,-2.5915584564208984,0.0,0.0,0.0,0.03902735367546582,0.9992381412393192,4.736384141201795,-4.123650325182043,0.6833604413063764,0.0,0.0,0.0,1.0
1717758332.904462,map,True,True,2,2,0.49874686716791977,0.49874686716791977,3.456655979156494,-2.5915584564208984,0.0,0.0,0.0,0.03902735367546582,0.9992381412393192,4.738479613945409,-4.127751876681687,0.6833874737599986,0.0,0.0,0.0,1.0
1717758332.9548473,map,True,False,2,2,0.49874686716791977,0.49874686716791977,3.456655979156494,-2.5915584564208984,0.0,0.0,0.0,0.03902735367546582,0.9992381412393192,4.738479613945409,-4.127751876681687,0.6833874737599986,0.0,0.0,0.0,1.0
1717758333.0057359,map,True,True,2,2,0.49874686716791977,0.49874686716791977,3.4650352001190186,-2.586819887161255,0.0,0.0,0.0,0.03792029712428085,0.9992807603195378,4.738479613945409,-4.127751876681687,0.6833874737599986,0.0,0.0,0.0,1.0
1717758333.1052418,map,True,False,2,2,0.49874686716791977,0.49874686716791977,3.4650352001190186,-2.586819887161255,0.0,0.0,0.0,0.03792029712428085,0.9992807603195378,4.738479613945409,-4.127751876681687,0.6833874737599986,0.0,0.0,0.0,1.0
1717758333.1564426,map,True,False,2,2,0.49874686716791977,0.49874686716791977,3.4650352001190186,-2.586819887161255,0.0,0.0,0.0,0.03792029712428085,0.9992807603195378,4.738479613945409,-4.127751876681687,0.6833874737599986,0.0,0.0,0.0,1.0
1717758333.2059033,map,True,False,2,2,0.49874686716791977,0.49874686716791977,3.4650352001190186,-2.586819887161255,0.0,0.0,0.0,0.03792029712428085,0.9992807603195378,4.76289154711084,-4.116727195960212,0.6834132767613623,0.0,0.0,0.0,1.0
1717758333.3062022,map,True,True,2,2,0.49874686716791977,0.49874686716791977,3.4650352001190186,-2.586819887161255,0.0,0.0,0.0,0.03792029712428085,0.9992807603195378,4.758838891227365,-4.109187658750878,0.6834049942977984,0.0,0.0,0.0,1.0
1717758333.3570828,map,True,False,2,2,0.49874686716791977,0.49874686716791977,3.4650352001190186,-2.586819887161255,0.0,0.0,0.0,0.03792029712428085,0.9992807603195378,4.758838891227365,-4.109187658750878,0.6834049942977984,0.0,0.0,0.0,1.0
1717758333.4076881,map,True,True,2,2,0.49874686716791977,0.49874686716791977,3.519688844680786,-2.5990116596221924,0.0,0.0,0.0,0.03791025044397234,0.9992811480285094,4.758838891227365,-4.109187658750878,0.6834049942977984,0.0,0.0,0.0,1.0
1717758333.4585702,map,True,False,2,2,0.49874686716791977,0.49874686716791977,3.519688844680786,-2.5990116596221924,0.0,0.0,0.0,0.03791025044397234,0.9992811480285094,4.758838891227365,-4.109187658750878,0.6834049942977984,0.0,0.0,0.0,1.0
1717758333.5577219,map,True,False,2,2,0.49874686716791977,0.49874686716791977,3.519688844680786,-2.5990116596221924,0.0,0.0,0.0,0.03791025044397234,0.9992811480285094,4.787079195198647,-4.1179407041462674,0.6834261606877216,0.0,0.0,0.0,1.0
1717758333.608529,map,True,True,2,2,0.49874686716791977,0.49874686716791977,3.519688844680786,-2.5990116596221924,0.0,0.0,0.0,0.03791025044397234,0.9992811480285094,4.783621736856175,-4.122804666011184,0.6834479512042878,0.0,0.0,0.0,1.0
1717758333.659193,map,True,False,2,2,0.49874686716791977,0.49874686716791977,3.519688844680786,-2.5990116596221924,0.0,0.0,0.0,0.03791025044397234,0.9992811480285094,4.783621736856175,-4.122804666011184,0.6834479512042878,0.0,0.0,0.0,1.0
1717758333.7095275,map,True,False,2,2,0.49874686716791977,0.49874686716791977,3.519688844680786,-2.5990116596221924,0.0,0.0,0.0,0.03791025044397234,0.9992811480285094,4.783621736856175,-4.122804666011184,0.6834479512042878,0.0,0.0,0.0,1.0
1717758333.760076,map,True,False,2,2,0.49874686716791977,0.49874686716791977,3.519688844680786,-2.5990116596221924,0.0,0.0,0.0,0.03791025044397234,0.9992811480285094,4.783621736856175,-4.122804666011184,0.6834479512042878,0.0,0.0,0.0,1.0
1717758333.910609,map,True,False,2,2,0.49874686716791977,0.49874686716791977,3.6394753456115723,-2.6204237937927246,0.0,0.0,0.0,0.040140226722853466,0.9991940588506477,4.810804555435275,-4.121958395734568,0.685847919059924,0.0,0.0,0.0,1.0
1717758333.9608977,map,True,True,2,2,0.49874686716791977,0.49874686716791977,3.6394753456115723,-2.6204237937927246,0.0,0.0,0.0,0.040140226722853466,0.9991940588506477,4.814973989965892,-4.119311837927485,0.6858310494462672,0.0,0.0,0.0,1.0
1717758334.0118585,map,True,False,2,2,0.49874686716791977,0.49874686716791977,3.6394753456115723,-2.6204237937927246,0.0,0.0,0.0,0.040140226722853466,0.9991940588506477,4.814973989965892,-4.119311837927485,0.6858310494462672,0.0,0.0,0.0,1.0
1717758334.1104624,map,True,False,2,2,0.49874686716791977,0.49874686716791977,3.6394753456115723,-2.6204237937927246,0.0,0.0,0.0,0.040140226722853466,0.9991940588506477,4.814973989965892,-4.119311837927485,0.6858310494462672,0.0,0.0,0.0,1.0
1717758334.1620238,map,True,False,2,2,0.49874686716791977,0.49874686716791977,3.6394753456115723,-2.6204237937927246,0.0,0.0,0.0,0.040140226722853466,0.9991940588506477,4.814973989965892,-4.119311837927485,0.6858310494462672,0.0,0.0,0.0,1.0
1717758334.2110562,map,True,True,2,2,0.49874686716791977,0.49874686716791977,3.6394753456115723,-2.6204237937927246,0.0,0.0,0.0,0.040140226722853466,0.9991940588506477,4.814973989965892,-4.119311837927485,0.6858310494462672,0.0,0.0,0.0,1.0
1717758334.311073,map,True,True,2,2,0.49874686716791977,0.49874686716791977,3.6394753456115723,-2.6204237937927246,0.0,0.0,0.0,0.040140226722853466,0.9991940588506477,4.839096081840628,-4.145252600167276,0.6835801989987667,0.0,0.0,0.0,1.0
1717758334.3638318,map,True,False,2,2,0.49874686716791977,0.49874686716791977,3.6394753456115723,-2.6204237937927246,0.0,0.0,0.0,0.040140226722853466,0.9991940588506477,4.839096081840628,-4.145252600167276,0.6835801989987667,0.0,0.0,0.0,1.0
1717758334.4114106,map,True,True,2,2,0.49874686716791977,0.49874686716791977,3.6394753456115723,-2.6204237937927246,0.0,0.0,0.0,0.040140226722853466,0.9991940588506477,4.839096081840628,-4.145252600167276,0.6835801989987667,0.0,0.0,0.0,1.0
1717758334.511972,map,True,True,2,2,0.49874686716791977,0.49874686716791977,3.7173023223876953,-2.651067018508911,0.0,0.0,0.0,0.04018239500030436,0.9991923587466427,4.839096081840628,-4.145252600167276,0.6835801989987667,0.0,0.0,0.0,1.0
1717758334.5625741,map,True,False,2,2,0.49874686716791977,0.49874686716791977,3.7173023223876953,-2.651067018508911,0.0,0.0,0.0,0.04018239500030436,0.9991923587466427,4.839096081840628,-4.145252600167276,0.6835801989987667,0.0,0.0,0.0,1.0
1717758334.6613615,map,True,False,2,2,0.49874686716791977,0.49874686716791977,3.7173023223876953,-2.651067018508911,0.0,0.0,0.0,0.04018239500030436,0.9991923587466427,4.912598370041325,-4.144379852714813,0.6859728447980363,0.0,0.0,0.0,1.0
1717758334.7117505,map,True,True,2,2,0.49874686716791977,0.49874686716791977,3.7173023223876953,-2.651067018508911,0.0,0.0,0.0,0.04018239500030436,0.9991923587466427,4.912598370041325,-4.144379852714813,0.6859728447980363,0.0,0.0,0.0,1.0
1717758334.9112537,map,True,False,2,2,0.49874686716791977,0.49874686716791977,3.7173023223876953,-2.651067018508911,0.0,0.0,0.0,0.04018239500030436,0.9991923587466427,4.940814702081738,-4.182586910607734,0.6931099337196618,0.0,0.0,0.0,1.0
1717758334.9625437,map,True,False,2,2,0.49874686716791977,0.49874686716791977,3.7173023223876953,-2.651067018508911,0.0,0.0,0.0,0.04018239500030436,0.9991923587466427,4.935594604837197,-4.189926059090532,0.6931622553430716,0.0,0.0,0.0,1.0
1717758335.0122478,map,True,True,2,2,0.49874686716791977,0.49874686716791977,3.754626750946045,-2.659870147705078,0.0,0.0,0.0,0.03999624382939039,0.9991998302347712,4.935594604837197,-4.189926059090532,0.6931622553430716,0.0,0.0,0.0,1.0
1717758335.111361,map,True,True,2,2,0.49874686716791977,0.49874686716791977,3.754626750946045,-2.659870147705078,0.0,0.0,0.0,0.03999624382939039,0.9991998302347712,4.935594604837197,-4.189926059090532,0.6931622553430716,0.0,0.0,0.0,1.0
1717758335.1625266,map,True,False,2,2,0.49874686716791977,0.49874686716791977,3.754626750946045,-2.659870147705078,0.0,0.0,0.0,0.03999624382939039,0.9991998302347712,4.935594604837197,-4.189926059090532,0.6931622553430716,0.0,0.0,0.0,1.0
1717758335.211694,map,True,False,2,2,0.49874686716791977,0.49874686716791977,3.754626750946045,-2.659870147705078,0.0,0.0,0.0,0.03999624382939039,0.9991998302347712,4.935594604837197,-4.189926059090532,0.6931622553430716,0.0,0.0,0.0,1.0
1717758335.3118243,map,True,False,2,2,0.49874686716791977,0.49874686716791977,3.754626750946045,-2.659870147705078,0.0,0.0,0.0,0.03999624382939039,0.9991998302347712,4.935594604837197,-4.189926059090532,0.6931622553430716,0.0,0.0,0.0,1.0
1717758335.411581,map,True,False,2,2,0.49874686716791977,0.49874686716791977,3.754626750946045,-2.659870147705078,0.0,0.0,0.0,0.03999624382939039,0.9991998302347712,4.935594604837197,-4.189926059090532,0.6931622553430716,0.0,0.0,0.0,1.0
1717758335.5108807,map,True,False,2,2,0.49874686716791977,0.49874686716791977,3.754626750946045,-2.659870147705078,0.0,0.0,0.0,0.03999624382939039,0.9991998302347712,4.935594604837197,-4.189926059090532,0.6931622553430716,0.0,0.0,0.0,1.0
1717758335.5616202,map,True,True,2,2,0.49874686716791977,0.49874686716791977,3.754626750946045,-2.659870147705078,0.0,0.0,0.0,0.03999624382939039,0.9991998302347712,4.935594604837197,-4.189926059090532,0.6931622553430716,0.0,0.0,0.0,1.0
1717758335.6116848,map,True,True,2,2,0.49874686716791977,0.49874686716791977,3.754626750946045,-2.659870147705078,0.0,0.0,0.0,0.03999624382939039,0.9991998302347712,4.935594604837197,-4.189926059090532,0.6931622553430716,0.0,0.0,0.0,1.0
1717758335.7118795,map,True,False,1,2,0.0,0.0,3.8972530364990234,-2.6786587238311768,0.0,0.0,0.0,0.04076863620249112,0.9991686166410744,4.935594604837197,-4.189926059090532,0.6931622553430716,0.0,0.0,0.0,1.0
1717758335.762664,map,True,False,1,2,0.0,0.0,3.8972530364990234,-2.6786587238311768,0.0,0.0,0.0,0.04076863620249112,0.9991686166410744,4.935594604837197,-4.189926059090532,0.6931622553430716,0.0,0.0,0.0,1.0
