car_pos_meter , car_pos_cell, car_speed, ped_pos_meter, ped_pos_cell, ped_speed
-5.125, 5, 2, 2.683109, 3, 1
-4.604377, 4, 2, 2.682917, 3, 1
-4.083755, 4, 2, 2.683018, 3, 1
-3.563132, 3, 1, 2.683208, 3, 1
-3.303756, 3, 1, 2.683862, 3, 1
-3.044381, 3, 2, 2.682608, 3, 1
-2.523758, 2, 2, 2.683204, 3, 1
-2.003135, 2, 2, 2.6824, 3, 1
-1.482509, 1, 2, 2.682324, 3, 1
-0.9618838, 0, 2, 2.681608, 3, 1
