timestamp_sec,frame_id,game_played,yielding,player1discrete,player2discrete,player1yieldprob,player2yieldprob,player1_pose_x,player1_pose_y,player1_pose_z,player1_pose_orient_x,player1_pose_orient_y,player1_pose_orient_z,player1_pose_orient_w,player2_pose_x,player2_pose_y,player2_pose_z,player2_pose_orient_x,player2_pose_orient_y,player2_pose_orient_z,player2_pose_orient_w
1718106789.6367798,map,True,True,7,7,0.5884586641783778,0.5884586641783778,0.6722252368927002,-1.4176404476165771,0.0,0.0,0.0,0.04789041158562343,0.9988525930666697,2.6252099096680928,-8.136723329751145,0.9152758576281274,0.0,0.0,0.0,1.0
1718106789.686704,map,True,True,7,7,0.5884586641783778,0.5884586641783778,0.6722252368927002,-1.4176404476165771,0.0,0.0,0.0,0.04789041158562343,0.9988525930666697,2.6252099096680928,-8.136723329751145,0.9152758576281274,0.0,0.0,0.0,1.0
1718106789.7867055,map,True,True,7,7,0.5884586641783778,0.5884586641783778,0.6722252368927002,-1.4176404476165771,0.0,0.0,0.0,0.04789041158562343,0.9988525930666697,2.6047314214246797,-8.014927286811695,0.9110611849835649,0.0,0.0,0.0,1.0
1718106790.0888016,map,True,False,7,7,0.5884586641783778,0.5884586641783778,0.6722252368927002,-1.4176404476165771,0.0,0.0,0.0,0.04789041158562343,0.9988525930666697,2.647989051814416,-8.194533915237626,0.9275066805614317,0.0,0.0,0.0,1.0
1718106790.187855,map,True,True,7,7,0.5884586641783778,0.5884586641783778,0.6722252368927002,-1.4176404476165771,0.0,0.0,0.0,0.04789041158562343,0.9988525930666697,2.647989051814416,-8.194533915237626,0.9275066805614317,0.0,0.0,0.0,1.0
1718106790.2396417,map,True,True,7,7,0.5884586641783778,0.5884586641783778,0.6722252368927002,-1.4176404476165771,0.0,0.0,0.0,0.04789041158562343,0.9988525930666697,2.647989051814416,-8.194533915237626,0.9275066805614317,0.0,0.0,0.0,1.0
1718106790.3439507,map,True,False,7,7,0.5884586641783778,0.5884586641783778,0.6722252368927002,-1.4176404476165771,0.0,0.0,0.0,0.04789041158562343,0.9988525930666697,2.647989051814416,-8.194533915237626,0.9275066805614317,0.0,0.0,0.0,1.0
1718106790.3914962,map,True,True,7,7,0.5884586641783778,0.5884586641783778,0.6722252368927002,-1.4176404476165771,0.0,0.0,0.0,0.04789041158562343,0.9988525930666697,2.628861034593864,-8.072197051671642,0.9230338609065369,0.0,0.0,0.0,1.0
1718106790.441837,map,True,False,7,7,0.5884586641783778,0.5884586641783778,0.6722252368927002,-1.4176404476165771,0.0,0.0,0.0,0.04789041158562343,0.9988525930666697,2.6185369896026107,-8.011726344698106,0.9208568247913242,0.0,0.0,0.0,1.0
1718106790.542048,map,True,False,7,7,0.5884586641783778,0.5884586641783778,0.6689249277114868,-1.414766550064087,0.0,0.0,0.0,0.04780306211007588,0.99885678509414,2.6185369896026107,-8.011726344698106,0.9208568247913242,0.0,0.0,0.0,1.0
1718106790.5956957,map,True,True,7,7,0.5884586641783778,0.5884586641783778,0.6689249277114868,-1.414766550064087,0.0,0.0,0.0,0.04780306211007588,0.99885678509414,2.6185369896026107,-8.011726344698106,0.9208568247913242,0.0,0.0,0.0,1.0
1718106790.6450481,map,True,True,7,7,0.5884586641783778,0.5884586641783778,0.6689249277114868,-1.414766550064087,0.0,0.0,0.0,0.04780306211007588,0.99885678509414,2.6185369896026107,-8.011726344698106,0.9208568247913242,0.0,0.0,0.0,1.0
1718106790.7423966,map,True,False,7,6,0.0,0.0,0.6689249277114868,-1.414766550064087,0.0,0.0,0.0,0.04780306211007588,0.99885678509414,2.6086420610412357,-7.945531384720715,0.908957922960813,0.0,0.0,0.0,1.0
1718106790.7932909,map,True,False,7,6,0.0,0.0,0.6689249277114868,-1.414766550064087,0.0,0.0,0.0,0.04780306211007588,0.99885678509414,2.6086420610412357,-7.945531384720715,0.908957922960813,0.0,0.0,0.0,1.0
1718106791.0934927,map,True,True,7,7,0.5884586641783778,0.5884586641783778,0.6689249277114868,-1.414766550064087,0.0,0.0,0.0,0.04780306211007588,0.99885678509414,2.6318805094559927,-8.128638246010645,0.9250723583598709,0.0,0.0,0.0,1.0
1718106791.1926093,map,True,False,7,7,0.5884586641783778,0.5884586641783778,0.6675810813903809,-1.4145922660827637,0.0,0.0,0.0,0.04789192190818387,0.9988525184752743,2.6318805094559927,-8.128638246010645,0.9250723583598709,0.0,0.0,0.0,1.0
1718106791.243051,map,True,True,7,7,0.5884586641783778,0.5884586641783778,0.6675810813903809,-1.4145922660827637,0.0,0.0,0.0,0.04789192190818387,0.9988525184752743,2.6318805094559927,-8.128638246010645,0.9250723583598709,0.0,0.0,0.0,1.0
1718106791.34387,map,True,False,7,7,0.5884586641783778,0.5884586641783778,0.6675810813903809,-1.4145922660827637,0.0,0.0,0.0,0.04789192190818387,0.9988525184752743,2.6318805094559927,-8.128638246010645,0.9250723583598709,0.0,0.0,0.0,1.0
1718106791.3943257,map,True,False,7,7,0.5884586641783778,0.5884586641783778,0.6675810813903809,-1.4145922660827637,0.0,0.0,0.0,0.04789192190818387,0.9988525184752743,2.6148227206676635,-8.033577408275006,0.9118411600645598,0.0,0.0,0.0,1.0
1718106791.4473004,map,True,True,7,7,0.5884586641783778,0.5884586641783778,0.6675810813903809,-1.4145922660827637,0.0,0.0,0.0,0.04789192190818387,0.9988525184752743,2.627505303524272,-8.161581057828139,0.9060458807596118,0.0,0.0,0.0,1.0
1718106791.4951084,map,True,True,7,7,0.5884586641783778,0.5884586641783778,0.6675810813903809,-1.4145922660827637,0.0,0.0,0.0,0.04789192190818387,0.9988525184752743,2.627505303524272,-8.161581057828139,0.9060458807596118,0.0,0.0,0.0,1.0
1718106791.5956554,map,True,True,7,7,0.5884586641783778,0.5884586641783778,0.6675810813903809,-1.4145922660827637,0.0,0.0,0.0,0.04789192190818387,0.9988525184752743,2.627505303524272,-8.161581057828139,0.9060458807596118,0.0,0.0,0.0,1.0
1718106791.6946535,map,True,True,7,7,0.5884586641783778,0.5884586641783778,0.6675810813903809,-1.4145922660827637,0.0,0.0,0.0,0.04789192190818387,0.9988525184752743,2.627505303524272,-8.161581057828139,0.9060458807596118,0.0,0.0,0.0,1.0
1718106791.7458565,map,True,False,7,7,0.5884586641783778,0.5884586641783778,0.6675810813903809,-1.4145922660827637,0.0,0.0,0.0,0.04789192190818387,0.9988525184752743,2.633703763777797,-8.22080080775584,0.9082815044916317,0.0,0.0,0.0,1.0
1718106791.796427,map,True,True,7,7,0.5884586641783778,0.5884586641783778,0.6675810813903809,-1.4145922660827637,0.0,0.0,0.0,0.04789192190818387,0.9988525184752743,2.633703763777797,-8.22080080775584,0.9082815044916317,0.0,0.0,0.0,1.0
1718106792.047412,map,True,False,7,7,0.5884586641783778,0.5884586641783778,0.6633332371711731,-1.4152522087097168,0.0,0.0,0.0,0.048090880494485636,0.99884297073067,2.646112704472112,-8.28777929337948,0.9104262492101524,0.0,0.0,0.0,1.0
1718106792.148015,map,True,False,7,7,0.5884586641783778,0.5884586641783778,0.6633332371711731,-1.4152522087097168,0.0,0.0,0.0,0.048090880494485636,0.99884297073067,2.646120692424101,-8.287726108937404,0.9206676010112603,0.0,0.0,0.0,1.0
1718106792.1976256,map,True,True,7,7,0.5884586641783778,0.5884586641783778,0.6633332371711731,-1.4152522087097168,0.0,0.0,0.0,0.048090880494485636,0.99884297073067,2.646120692424101,-8.287726108937404,0.9206676010112603,0.0,0.0,0.0,1.0
1718106792.2831452,map,True,False,7,7,0.5884586641783778,0.5884586641783778,0.6633332371711731,-1.4152522087097168,0.0,0.0,0.0,0.048090880494485636,0.99884297073067,2.646120692424101,-8.287726108937404,0.9206676010112603,0.0,0.0,0.0,1.0
1718106792.286538,map,True,False,7,7,0.5884586641783778,0.5884586641783778,0.6633332371711731,-1.4152522087097168,0.0,0.0,0.0,0.048090880494485636,0.99884297073067,2.646120692424101,-8.287726108937404,0.9206676010112603,0.0,0.0,0.0,1.0
1718106792.2909207,map,True,False,7,7,0.5884586641783778,0.5884586641783778,0.6633332371711731,-1.4152522087097168,0.0,0.0,0.0,0.048090880494485636,0.99884297073067,2.646120692424101,-8.287726108937404,0.9206676010112603,0.0,0.0,0.0,1.0
1718106792.293069,map,True,True,7,7,0.5884586641783778,0.5884586641783778,0.6633332371711731,-1.4152522087097168,0.0,0.0,0.0,0.048090880494485636,0.99884297073067,2.646120692424101,-8.287726108937404,0.9206676010112603,0.0,0.0,0.0,1.0
1718106792.3943639,map,True,False,7,7,0.5884586641783778,0.5884586641783778,0.6633332371711731,-1.4152522087097168,0.0,0.0,0.0,0.048090880494485636,0.99884297073067,2.6247335544504384,-8.20330418507076,0.9073736174108586,0.0,0.0,0.0,1.0
1718106792.4455242,map,True,True,7,7,0.5884586641783778,0.5884586641783778,0.6633332371711731,-1.4152522087097168,0.0,0.0,0.0,0.048090880494485636,0.99884297073067,2.712291275004029,-8.664558114553252,0.9011860095293849,0.0,0.0,0.0,1.0
1718106792.4967103,map,True,False,7,7,0.5884586641783778,0.5884586641783778,0.6633332371711731,-1.4152522087097168,0.0,0.0,0.0,0.048090880494485636,0.99884297073067,2.712291275004029,-8.664558114553252,0.9011860095293849,0.0,0.0,0.0,1.0
1718106792.5964544,map,True,True,7,7,0.5884586641783778,0.5884586641783778,0.6633332371711731,-1.4152522087097168,0.0,0.0,0.0,0.048090880494485636,0.99884297073067,2.712291275004029,-8.664558114553252,0.9011860095293849,0.0,0.0,0.0,1.0
1718106792.6462245,map,True,False,7,7,0.5884586641783778,0.5884586641783778,0.6633332371711731,-1.4152522087097168,0.0,0.0,0.0,0.048090880494485636,0.99884297073067,2.712291275004029,-8.664558114553252,0.9011860095293849,0.0,0.0,0.0,1.0
1718106792.7458258,map,True,True,7,7,0.5884586641783778,0.5884586641783778,0.6633332371711731,-1.4152522087097168,0.0,0.0,0.0,0.048090880494485636,0.99884297073067,2.626723718254318,-8.058332649109303,0.8733927558028409,0.0,0.0,0.0,1.0
1718106792.781624,map,True,False,7,7,0.5884586641783778,0.5884586641783778,0.6633332371711731,-1.4152522087097168,0.0,0.0,0.0,0.048090880494485636,0.99884297073067,2.626723718254318,-8.058332649109303,0.8733927558028409,0.0,0.0,0.0,1.0
1718106792.785138,map,True,False,7,7,0.5884586641783778,0.5884586641783778,0.6633332371711731,-1.4152522087097168,0.0,0.0,0.0,0.048090880494485636,0.99884297073067,2.626723718254318,-8.058332649109303,0.8733927558028409,0.0,0.0,0.0,1.0
1718106793.118616,map,True,False,7,6,0.0,0.0,0.6551832556724548,-1.4110171794891357,0.0,0.0,0.0,0.04847195939889227,0.9988245463092711,2.6493934641401005,-7.561471166442056,0.8600669348182719,0.0,0.0,0.0,1.0
1718106793.1686237,map,True,False,7,6,0.0,0.0,0.6551832556724548,-1.4110171794891357,0.0,0.0,0.0,0.04847195939889227,0.9988245463092711,2.6493934641401005,-7.561471166442056,0.8600669348182719,0.0,0.0,0.0,1.0
1718106793.2225232,map,True,False,7,6,0.0,0.0,0.6551832556724548,-1.4110171794891357,0.0,0.0,0.0,0.04847195939889227,0.9988245463092711,2.6493934641401005,-7.561471166442056,0.8600669348182719,0.0,0.0,0.0,1.0
1718106793.2703464,map,True,False,7,6,0.0,0.0,0.6551832556724548,-1.4110171794891357,0.0,0.0,0.0,0.04847195939889227,0.9988245463092711,2.6493934641401005,-7.561471166442056,0.8600669348182719,0.0,0.0,0.0,1.0
1718106793.3696482,map,True,False,7,6,0.0,0.0,0.6551832556724548,-1.4110171794891357,0.0,0.0,0.0,0.04847195939889227,0.9988245463092711,2.6493934641401005,-7.561471166442056,0.8600669348182719,0.0,0.0,0.0,1.0
1718106793.4201684,map,True,False,7,6,0.0,0.0,0.6551832556724548,-1.4110171794891357,0.0,0.0,0.0,0.04847195939889227,0.9988245463092711,2.736987178573858,-7.615570428442709,0.8434848141586495,0.0,0.0,0.0,1.0
1718106793.4711785,map,True,False,7,6,0.0,0.0,0.6551832556724548,-1.4110171794891357,0.0,0.0,0.0,0.04847195939889227,0.9988245463092711,2.736987178573858,-7.615570428442709,0.8434848141586495,0.0,0.0,0.0,1.0
1718106793.5719929,map,True,False,7,6,0.0,0.0,0.6551832556724548,-1.4110171794891357,0.0,0.0,0.0,0.04847195939889227,0.9988245463092711,2.736987178573858,-7.615570428442709,0.8434848141586495,0.0,0.0,0.0,1.0
1718106793.6213973,map,True,False,7,6,0.0,0.0,0.6551832556724548,-1.4110171794891357,0.0,0.0,0.0,0.04847195939889227,0.9988245463092711,2.736987178573858,-7.615570428442709,0.8434848141586495,0.0,0.0,0.0,1.0
1718106793.6260931,map,True,False,7,6,0.0,0.0,0.6621842980384827,-1.413677453994751,0.0,0.0,0.0,0.048452444905788754,0.9988254861867671,2.736987178573858,-7.615570428442709,0.8434848141586495,0.0,0.0,0.0,1.0
1718106793.6289594,map,True,False,7,6,0.0,0.0,0.6621842980384827,-1.413677453994751,0.0,0.0,0.0,0.048452444905788754,0.9988254861867671,2.736987178573858,-7.615570428442709,0.8434848141586495,0.0,0.0,0.0,1.0
1718106793.6657372,map,True,False,7,6,0.0,0.0,0.6621842980384827,-1.413677453994751,0.0,0.0,0.0,0.048452444905788754,0.9988254861867671,2.736987178573858,-7.615570428442709,0.8434848141586495,0.0,0.0,0.0,1.0
1718106793.6686547,map,True,False,7,6,0.0,0.0,0.6621842980384827,-1.413677453994751,0.0,0.0,0.0,0.048452444905788754,0.9988254861867671,2.736987178573858,-7.615570428442709,0.8434848141586495,0.0,0.0,0.0,1.0
1718106793.769853,map,True,False,7,6,0.0,0.0,0.6621842980384827,-1.413677453994751,0.0,0.0,0.0,0.048452444905788754,0.9988254861867671,2.8113172386171783,-7.283142920588001,0.8353607319056651,0.0,0.0,0.0,1.0
1718106793.8694162,map,True,False,7,6,0.0,0.0,0.6621842980384827,-1.413677453994751,0.0,0.0,0.0,0.048452444905788754,0.9988254861867671,2.78668028697477,-7.0959962932907645,0.8218282188501491,0.0,0.0,0.0,1.0
1718106793.956057,map,True,False,7,6,0.0,0.0,0.6621842980384827,-1.413677453994751,0.0,0.0,0.0,0.048452444905788754,0.9988254861867671,2.78668028697477,-7.0959962932907645,0.8218282188501491,0.0,0.0,0.0,1.0
1718106794.010201,map,True,False,7,6,0.0,0.0,0.6621842980384827,-1.413677453994751,0.0,0.0,0.0,0.048452444905788754,0.9988254861867671,2.78668028697477,-7.0959962932907645,0.8218282188501491,0.0,0.0,0.0,1.0
1718106794.1060982,map,True,False,7,6,0.0,0.0,0.6621842980384827,-1.413677453994751,0.0,0.0,0.0,0.048452444905788754,0.9988254861867671,2.7884840446673755,-7.0092897254852655,0.8281379113568437,0.0,0.0,0.0,1.0
1718106794.1565254,map,True,False,7,6,0.0,0.0,0.6621842980384827,-1.413677453994751,0.0,0.0,0.0,0.048452444905788754,0.9988254861867671,2.7884840446673755,-7.0092897254852655,0.8281379113568437,0.0,0.0,0.0,1.0
1718106794.25572,map,True,False,7,6,0.0,0.0,0.6621842980384827,-1.413677453994751,0.0,0.0,0.0,0.048452444905788754,0.9988254861867671,2.7884840446673755,-7.0092897254852655,0.8281379113568437,0.0,0.0,0.0,1.0
1718106794.3550923,map,True,False,7,6,0.0,0.0,0.6621842980384827,-1.413677453994751,0.0,0.0,0.0,0.048452444905788754,0.9988254861867671,2.7884840446673755,-7.0092897254852655,0.8281379113568437,0.0,0.0,0.0,1.0
1718106794.4564846,map,True,False,7,5,0.0,0.0,0.6621842980384827,-1.413677453994751,0.0,0.0,0.0,0.048452444905788754,0.9988254861867671,2.899922191619952,-6.8569732092622235,0.8079917989032608,0.0,0.0,0.0,1.0
1718106794.5085824,map,True,False,7,5,0.0,0.0,0.7911508679389954,-1.4418171644210815,0.0,0.0,0.0,0.04792412960658435,0.9988509818912891,2.899922191619952,-6.8569732092622235,0.8079917989032608,0.0,0.0,0.0,1.0
1718106794.5572963,map,True,False,7,5,0.0,0.0,0.7911508679389954,-1.4418171644210815,0.0,0.0,0.0,0.04792412960658435,0.9988509818912891,2.899922191619952,-6.8569732092622235,0.8079917989032608,0.0,0.0,0.0,1.0
1718106794.657238,map,True,False,7,5,0.0,0.0,0.7911508679389954,-1.4418171644210815,0.0,0.0,0.0,0.04792412960658435,0.9988509818912891,2.899922191619952,-6.8569732092622235,0.8079917989032608,0.0,0.0,0.0,1.0
1718106794.757024,map,True,False,7,5,0.0,0.0,0.7911508679389954,-1.4418171644210815,0.0,0.0,0.0,0.04792412960658435,0.9988509818912891,2.861636941064356,-6.356730644318174,0.8119370114539408,0.0,0.0,0.0,1.0
1718106794.8570273,map,True,False,7,5,0.0,0.0,0.7911508679389954,-1.4418171644210815,0.0,0.0,0.0,0.04792412960658435,0.9988509818912891,2.9356213800573023,-6.372597489071916,0.7978373538341983,0.0,0.0,0.0,1.0
1718106794.910169,map,True,False,7,5,0.0,0.0,0.7911508679389954,-1.4418171644210815,0.0,0.0,0.0,0.04792412960658435,0.9988509818912891,2.9356213800573023,-6.372597489071916,0.7978373538341983,0.0,0.0,0.0,1.0
1718106795.0087302,map,True,False,7,5,0.0,0.0,0.7911508679389954,-1.4418171644210815,0.0,0.0,0.0,0.04792412960658435,0.9988509818912891,2.9356213800573023,-6.372597489071916,0.7978373538341983,0.0,0.0,0.0,1.0
1718106795.058202,map,True,False,7,5,0.0,0.0,0.7911508679389954,-1.4418171644210815,0.0,0.0,0.0,0.04792412960658435,0.9988509818912891,2.9356213800573023,-6.372597489071916,0.7978373538341983,0.0,0.0,0.0,1.0
1718106795.1093202,map,True,False,7,5,0.0,0.0,0.7911508679389954,-1.4418171644210815,0.0,0.0,0.0,0.04792412960658435,0.9988509818912891,2.9356213800573023,-6.372597489071916,0.7978373538341983,0.0,0.0,0.0,1.0
1718106795.1589565,map,True,False,7,5,0.0,0.0,0.7911508679389954,-1.4418171644210815,0.0,0.0,0.0,0.04792412960658435,0.9988509818912891,2.985060253738098,-6.05546326705637,0.7896376317235474,0.0,0.0,0.0,1.0
1718106795.2084038,map,True,False,7,4,0.0,0.0,0.7911508679389954,-1.4418171644210815,0.0,0.0,0.0,0.04792412960658435,0.9988509818912891,2.959962761917407,-5.922848418043437,0.8005026969956932,0.0,0.0,0.0,1.0
1718106795.258933,map,True,False,7,4,0.0,0.0,0.7911508679389954,-1.4418171644210815,0.0,0.0,0.0,0.04792412960658435,0.9988509818912891,2.959962761917407,-5.922848418043437,0.8005026969956932,0.0,0.0,0.0,1.0
1718106795.358251,map,True,False,7,4,0.0,0.0,0.7911508679389954,-1.4418171644210815,0.0,0.0,0.0,0.04792412960658435,0.9988509818912891,2.959962761917407,-5.922848418043437,0.8005026969956932,0.0,0.0,0.0,1.0
1718106795.41088,map,True,False,6,4,0.0,0.0,0.9018141031265259,-1.4588624238967896,0.0,0.0,0.0,0.04812793460383229,0.9988411805183963,2.959962761917407,-5.922848418043437,0.8005026969956932,0.0,0.0,0.0,1.0
1718106795.4606533,map,True,False,6,4,0.0,0.0,0.9018141031265259,-1.4588624238967896,0.0,0.0,0.0,0.04812793460383229,0.9988411805183963,2.959962761917407,-5.922848418043437,0.8005026969956932,0.0,0.0,0.0,1.0
1718106795.5609815,map,True,False,6,4,0.0,0.0,0.9018141031265259,-1.4588624238967896,0.0,0.0,0.0,0.04812793460383229,0.9988411805183963,3.0444157897007873,-5.620764016803684,0.7869873534185956,0.0,0.0,0.0,1.0
1718106795.6724687,map,True,False,6,4,0.0,0.0,0.9018141031265259,-1.4588624238967896,0.0,0.0,0.0,0.04812793460383229,0.9988411805183963,3.0444157897007873,-5.620764016803684,0.7869873534185956,0.0,0.0,0.0,1.0
1718106795.714726,map,True,False,6,4,0.0,0.0,0.9018141031265259,-1.4588624238967896,0.0,0.0,0.0,0.04812793460383229,0.9988411805183963,3.0444157897007873,-5.620764016803684,0.7869873534185956,0.0,0.0,0.0,1.0
1718106795.765102,map,True,False,6,4,0.0,0.0,0.9018141031265259,-1.4588624238967896,0.0,0.0,0.0,0.04812793460383229,0.9988411805183963,3.0444157897007873,-5.620764016803684,0.7869873534185956,0.0,0.0,0.0,1.0
1718106795.8635375,map,True,False,6,4,0.0,0.0,0.9018141031265259,-1.4588624238967896,0.0,0.0,0.0,0.04812793460383229,0.9988411805183963,3.1996373695549343,-5.565896436486257,0.7668482749291259,0.0,0.0,0.0,1.0
1718106795.9135103,map,True,False,6,4,0.0,0.0,0.9018141031265259,-1.4588624238967896,0.0,0.0,0.0,0.04812793460383229,0.9988411805183963,3.1996373695549343,-5.565896436486257,0.7668482749291259,0.0,0.0,0.0,1.0
1718106795.9647224,map,True,False,6,4,0.0,0.0,0.9018141031265259,-1.4588624238967896,0.0,0.0,0.0,0.04812793460383229,0.9988411805183963,3.1996373695549343,-5.565896436486257,0.7668482749291259,0.0,0.0,0.0,1.0
1718106796.0633392,map,True,False,6,4,0.0,0.0,0.9018141031265259,-1.4588624238967896,0.0,0.0,0.0,0.04812793460383229,0.9988411805183963,3.1996373695549343,-5.565896436486257,0.7668482749291259,0.0,0.0,0.0,1.0
1718106796.1161625,map,True,False,6,4,0.0,0.0,0.9018141031265259,-1.4588624238967896,0.0,0.0,0.0,0.04812793460383229,0.9988411805183963,3.1996373695549343,-5.565896436486257,0.7668482749291259,0.0,0.0,0.0,1.0
1718106796.1693332,map,True,False,6,4,0.0,0.0,0.9018141031265259,-1.4588624238967896,0.0,0.0,0.0,0.04812793460383229,0.9988411805183963,3.120648944036854,-5.0025933608448785,0.7778170660961469,0.0,0.0,0.0,1.0
1718106796.2166133,map,True,False,6,4,0.0,0.0,0.9018141031265259,-1.4588624238967896,0.0,0.0,0.0,0.04812793460383229,0.9988411805183963,3.1747751118982817,-4.976963707127841,0.7607783771586559,0.0,0.0,0.0,1.0
1718106796.266267,map,True,False,6,4,0.0,0.0,0.9018141031265259,-1.4588624238967896,0.0,0.0,0.0,0.04812793460383229,0.9988411805183963,3.1747751118982817,-4.976963707127841,0.7607783771586559,0.0,0.0,0.0,1.0
1718106796.3647592,map,True,False,6,4,0.0,0.0,1.1241618394851685,-1.5008018016815186,0.0,0.0,0.0,0.04803631316999665,0.9988455963695342,3.1747751118982817,-4.976963707127841,0.7607783771586559,0.0,0.0,0.0,1.0
1718106796.4663107,map,True,False,6,4,0.0,0.0,1.1241618394851685,-1.5008018016815186,0.0,0.0,0.0,0.04803631316999665,0.9988455963695342,3.1747751118982817,-4.976963707127841,0.7607783771586559,0.0,0.0,0.0,1.0
1718106796.5667574,map,True,False,6,3,0.0,0.0,1.1241618394851685,-1.5008018016815186,0.0,0.0,0.0,0.04803631316999665,0.9988455963695342,3.226511309379761,-4.767650044533964,0.7508375444362241,0.0,0.0,0.0,1.0
1718106796.6194284,map,True,False,6,3,0.0,0.0,1.1241618394851685,-1.5008018016815186,0.0,0.0,0.0,0.04803631316999665,0.9988455963695342,3.226511309379761,-4.767650044533964,0.7508375444362241,0.0,0.0,0.0,1.0
1718106796.7169974,map,True,False,6,3,0.0,0.0,1.1241618394851685,-1.5008018016815186,0.0,0.0,0.0,0.04803631316999665,0.9988455963695342,3.226511309379761,-4.767650044533964,0.7508375444362241,0.0,0.0,0.0,1.0
1718106796.917322,map,True,False,6,3,0.0,0.0,1.1241618394851685,-1.5008018016815186,0.0,0.0,0.0,0.04803631316999665,0.9988455963695342,3.2816308763412976,-4.3910178498049195,0.7289591557044854,0.0,0.0,0.0,1.0
1718106796.967027,map,True,False,6,3,0.0,0.0,1.1241618394851685,-1.5008018016815186,0.0,0.0,0.0,0.04803631316999665,0.9988455963695342,3.2816308763412976,-4.3910178498049195,0.7289591557044854,0.0,0.0,0.0,1.0
1718106797.01703,map,True,False,5,3,0.0,0.0,1.3019256591796875,-1.532875657081604,0.0,0.0,0.0,0.048347454584485056,0.998830573444849,3.2816308763412976,-4.3910178498049195,0.7289591557044854,0.0,0.0,0.0,1.0
1718106797.1167247,map,True,False,5,3,0.0,0.0,1.3019256591796875,-1.532875657081604,0.0,0.0,0.0,0.048347454584485056,0.998830573444849,3.2816308763412976,-4.3910178498049195,0.7289591557044854,0.0,0.0,0.0,1.0
1718106797.2168174,map,True,False,5,3,0.0,0.0,1.3019256591796875,-1.532875657081604,0.0,0.0,0.0,0.048347454584485056,0.998830573444849,3.3285361868941488,-4.256528477351325,0.7411188165992622,0.0,0.0,0.0,1.0
1718106797.2669396,map,True,False,5,3,0.0,0.0,1.3019256591796875,-1.532875657081604,0.0,0.0,0.0,0.048347454584485056,0.998830573444849,3.4031428185374857,-4.1978652546714645,0.7406995046318148,0.0,0.0,0.0,1.0
1718106797.3754203,map,True,False,5,3,0.0,0.0,1.3019256591796875,-1.532875657081604,0.0,0.0,0.0,0.048347454584485056,0.998830573444849,3.4031428185374857,-4.1978652546714645,0.7406995046318148,0.0,0.0,0.0,1.0
1718106797.4685352,map,True,False,5,3,0.0,0.0,1.3019256591796875,-1.532875657081604,0.0,0.0,0.0,0.048347454584485056,0.998830573444849,3.4031428185374857,-4.1978652546714645,0.7406995046318148,0.0,0.0,0.0,1.0
1718106797.5166798,map,True,False,5,3,0.0,0.0,1.3019256591796875,-1.532875657081604,0.0,0.0,0.0,0.048347454584485056,0.998830573444849,3.4031428185374857,-4.1978652546714645,0.7406995046318148,0.0,0.0,0.0,1.0
1718106797.5702786,map,True,False,5,2,0.0,0.0,1.3019256591796875,-1.532875657081604,0.0,0.0,0.0,0.048347454584485056,0.998830573444849,3.4348773181536787,-3.834772484406203,0.733412676374738,0.0,0.0,0.0,1.0
1718106797.6670935,map,True,False,5,2,0.0,0.0,1.3019256591796875,-1.532875657081604,0.0,0.0,0.0,0.048347454584485056,0.998830573444849,3.477486837819428,-3.8655827441816633,0.7343505925800207,0.0,0.0,0.0,1.0
1718106797.7180498,map,True,False,5,2,0.0,0.0,1.3019256591796875,-1.532875657081604,0.0,0.0,0.0,0.048347454584485056,0.998830573444849,3.477486837819428,-3.8655827441816633,0.7343505925800207,0.0,0.0,0.0,1.0
1718106797.768785,map,True,False,5,2,0.0,0.0,1.3019256591796875,-1.532875657081604,0.0,0.0,0.0,0.048347454584485056,0.998830573444849,3.477486837819428,-3.8655827441816633,0.7343505925800207,0.0,0.0,0.0,1.0
1718106797.918299,map,True,False,5,2,0.0,0.0,1.3019256591796875,-1.532875657081604,0.0,0.0,0.0,0.048347454584485056,0.998830573444849,3.480274624315853,-3.5794821149267277,0.7093631222578103,0.0,0.0,0.0,1.0
1718106798.0176733,map,True,False,5,2,0.0,0.0,1.4269230365753174,-1.5589580535888672,0.0,0.0,0.0,0.048595793646375667,0.9988185340561112,3.480274624315853,-3.5794821149267277,0.7093631222578103,0.0,0.0,0.0,1.0
1718106798.0681531,map,True,False,5,2,0.0,0.0,1.4269230365753174,-1.5589580535888672,0.0,0.0,0.0,0.048595793646375667,0.9988185340561112,3.480274624315853,-3.5794821149267277,0.7093631222578103,0.0,0.0,0.0,1.0
1718106798.1722581,map,True,False,5,2,0.0,0.0,1.4269230365753174,-1.5589580535888672,0.0,0.0,0.0,0.048595793646375667,0.9988185340561112,3.480274624315853,-3.5794821149267277,0.7093631222578103,0.0,0.0,0.0,1.0
1718106798.221412,map,True,False,5,2,0.0,0.0,1.4269230365753174,-1.5589580535888672,0.0,0.0,0.0,0.048595793646375667,0.9988185340561112,3.480274624315853,-3.5794821149267277,0.7093631222578103,0.0,0.0,0.0,1.0
1718106798.2703931,map,True,False,5,2,0.0,0.0,1.4269230365753174,-1.5589580535888672,0.0,0.0,0.0,0.048595793646375667,0.9988185340561112,3.646887374677502,-3.336109282180679,0.7247065458653078,0.0,0.0,0.0,1.0
1718106798.3698454,map,True,False,5,2,0.0,0.0,1.4269230365753174,-1.5589580535888672,0.0,0.0,0.0,0.048595793646375667,0.9988185340561112,3.646887374677502,-3.336109282180679,0.7247065458653078,0.0,0.0,0.0,1.0
1718106798.4694302,map,True,False,5,2,0.0,0.0,1.4269230365753174,-1.5589580535888672,0.0,0.0,0.0,0.048595793646375667,0.9988185340561112,3.646887374677502,-3.336109282180679,0.7247065458653078,0.0,0.0,0.0,1.0
1718106798.51953,map,True,False,5,2,0.0,0.0,1.4269230365753174,-1.5589580535888672,0.0,0.0,0.0,0.048595793646375667,0.9988185340561112,3.646887374677502,-3.336109282180679,0.7247065458653078,0.0,0.0,0.0,1.0
1718106798.5714386,map,True,False,5,2,0.0,0.0,1.4269230365753174,-1.5589580535888672,0.0,0.0,0.0,0.048595793646375667,0.9988185340561112,3.6441179066526486,-3.0032367478232227,0.6811657097535078,0.0,0.0,0.0,1.0
1718106798.6197066,map,True,False,5,2,0.0,0.0,1.6063001155853271,-1.5887362957000732,0.0,0.0,0.0,0.04925901079109494,0.998786040408975,3.673455389090466,-2.9713509887883554,0.681004598448115,0.0,0.0,0.0,1.0
1718106798.6699526,map,True,False,5,2,0.0,0.0,1.6063001155853271,-1.5887362957000732,0.0,0.0,0.0,0.04925901079109494,0.998786040408975,3.673455389090466,-2.9713509887883554,0.681004598448115,0.0,0.0,0.0,1.0
1718106798.7702112,map,True,False,5,2,0.0,0.0,1.6063001155853271,-1.5887362957000732,0.0,0.0,0.0,0.04925901079109494,0.998786040408975,3.673455389090466,-2.9713509887883554,0.681004598448115,0.0,0.0,0.0,1.0
1718106798.972628,map,True,False,5,1,0.0,0.0,1.6063001155853271,-1.5887362957000732,0.0,0.0,0.0,0.04925901079109494,0.998786040408975,3.67665717435277,-2.7359847877210317,0.6805047681704015,0.0,0.0,0.0,1.0
1718106799.0216494,map,True,False,5,1,0.0,0.0,1.6063001155853271,-1.5887362957000732,0.0,0.0,0.0,0.04925901079109494,0.998786040408975,3.67665717435277,-2.7359847877210317,0.6805047681704015,0.0,0.0,0.0,1.0
1718106799.0720737,map,True,False,5,1,0.0,0.0,1.6063001155853271,-1.5887362957000732,0.0,0.0,0.0,0.04925901079109494,0.998786040408975,3.67665717435277,-2.7359847877210317,0.6805047681704015,0.0,0.0,0.0,1.0
1718106799.1224794,map,True,False,5,1,0.0,0.0,1.6063001155853271,-1.5887362957000732,0.0,0.0,0.0,0.04925901079109494,0.998786040408975,3.67665717435277,-2.7359847877210317,0.6805047681704015,0.0,0.0,0.0,1.0
1718106799.2240214,map,True,False,5,1,0.0,0.0,1.6063001155853271,-1.5887362957000732,0.0,0.0,0.0,0.04925901079109494,0.998786040408975,3.7820455101855783,-2.5091300831490506,0.6821829045275885,0.0,0.0,0.0,1.0
1718106799.2720828,map,True,False,5,1,0.0,0.0,1.6063001155853271,-1.5887362957000732,0.0,0.0,0.0,0.04925901079109494,0.998786040408975,3.794436000421819,-2.3998522281499386,0.679468354930973,0.0,0.0,0.0,1.0
1718106799.373054,map,True,False,4,1,0.0,0.0,1.7186362743377686,-1.6103707551956177,0.0,0.0,0.0,0.04895175062483209,0.9988011385987178,3.794436000421819,-2.3998522281499386,0.679468354930973,0.0,0.0,0.0,1.0
1718106799.4751322,map,True,False,4,1,0.0,0.0,1.7186362743377686,-1.6103707551956177,0.0,0.0,0.0,0.04895175062483209,0.9988011385987178,3.794436000421819,-2.3998522281499386,0.679468354930973,0.0,0.0,0.0,1.0
1718106799.5243013,map,True,False,4,1,0.0,0.0,1.7186362743377686,-1.6103707551956177,0.0,0.0,0.0,0.04895175062483209,0.9988011385987178,3.794436000421819,-2.3998522281499386,0.679468354930973,0.0,0.0,0.0,1.0
1718106799.624339,map,True,False,4,7,0.0,0.0,1.7186362743377686,-1.6103707551956177,0.0,0.0,0.0,0.04895175062483209,0.9988011385987178,8.59025927384541,-5.610749942515843,0.6861768547690761,0.0,0.0,0.0,1.0
1718106799.673959,map,True,False,4,7,0.0,0.0,1.7186362743377686,-1.6103707551956177,0.0,0.0,0.0,0.04895175062483209,0.9988011385987178,8.59025927384541,-5.610749942515843,0.6861768547690761,0.0,0.0,0.0,1.0
1718106799.7739549,map,True,False,4,7,0.0,0.0,1.7186362743377686,-1.6103707551956177,0.0,0.0,0.0,0.04895175062483209,0.9988011385987178,8.59025927384541,-5.610749942515843,0.6861768547690761,0.0,0.0,0.0,1.0
