car_pos_meter , car_pos_cell, car_speed, ped_pos_meter, ped_pos_cell, ped_speed
-30.37037, 30, 2, 3.993297, 31, 1
-30.24696, 30, 2, 3.981786, 31, 1
-29.62993, 29, 2, 3.930571, 30, 1
-23.45959, 23, 2, 3.472471, 27, 1
-17.28924, 17, 2, 2.997388, 23, 1
-11.11889, 11, 2, 2.895661, 22, 1
-4.948515, 4, 2, 2.898175, 22, 1
1.221858, -1, 2, 2.875587, 22, 1
7.392234, -7, 2, 2.910022, 22, 1
13.5626, -13, 2, 2.81842, 21, 1
19.73295, -19, 2, 2.578958, 20, 1
25.90329, -25, 2, 2.107427, 16, 1
32.07364, -32, 2, 1.644317, 12, 1
38.24398, -38, 2, 1.045044, 8, 1
44.41432, -44, 2, 0.9211693, 7, 1
50.58474, -50, 2, 0.7900608, 6, 1
56.75522, -56, 2, 0.4314075, 3, 1
62.92571, -62, 2, -0.05434656, 0, 1
69.09619, -69, 2, -0.4260578, -3, 1
75.26668, -75, 2, -0.5512819, -4, 1
81.43716, -81, 2, -0.6368866, -4, 1
