car_pos_meter , car_pos_cell, car_speed, ped_pos_meter, ped_pos_cell, ped_speed
-30.37037, 30, 2, 3.862211, 30, 1
-27.2852, 27, 2, 3.753162, 29, 1
-24.20003, 24, 2, 3.377622, 26, 1
-21.11485, 21, 2, 2.952553, 23, 1
-18.02968, 18, 2, 2.464216, 19, 1
-14.94451, 14, 2, 2.006525, 15, 1
-11.85934, 11, 2, 1.507478, 11, 1
-8.77415, 8, 2, 0.9910955, 7, 1
-5.688961, 5, 2, 0.4735096, 3, 1
-2.603771, 2, 2, -0.05306721, 0, 1
0.4814134, 0, 2, -0.4213457, -3, 1
3.566599, -3, 2, -0.7264557, -5, 1
6.651789, -6, 2, -1.007992, -7, 1
9.736978, -9, 2, -1.212531, -9, 1
12.82216, -12, 2, -1.397908, -10, 1
15.90733, -15, 2, -1.273228, -9, 1
18.99251, -18, 2, -1.27441, -9, 1
22.07768, -22, 2, -1.260172, -9, 1
