timestamp_sec,frame_id,game_played,yielding,player1discrete,player2discrete,player1yieldprob,player2yieldprob,player1_pose_x,player1_pose_y,player1_pose_z,player1_pose_orient_x,player1_pose_orient_y,player1_pose_orient_z,player1_pose_orient_w,player2_pose_x,player2_pose_y,player2_pose_z,player2_pose_orient_x,player2_pose_orient_y,player2_pose_orient_z,player2_pose_orient_w
1718018260.4687467,map,True,False,3,3,0.6616527499769684,0.6616527499769684,2.2838337421417236,-1.7978436946868896,0.0,0.0,0.0,0.0440770161678204,0.9990281359430617,3.749492402595717,-4.824440254803985,0.6282691888024411,0.0,0.0,0.0,1.0
1718018260.8206408,map,True,False,2,3,0.0,0.0,2.4057230949401855,-1.82694673538208,0.0,0.0,0.0,0.04394815592003948,0.999033818792286,3.791402759105174,-4.347134025856808,0.6895613345998498,0.0,0.0,0.0,1.0
1718018260.8713984,map,True,False,2,3,0.0,0.0,2.4057230949401855,-1.82694673538208,0.0,0.0,0.0,0.04394815592003948,0.999033818792286,3.791402759105174,-4.347134025856808,0.6895613345998498,0.0,0.0,0.0,1.0
1718018260.972082,map,True,False,2,3,0.0,0.0,2.4057230949401855,-1.82694673538208,0.0,0.0,0.0,0.04394815592003948,0.999033818792286,3.791402759105174,-4.347134025856808,0.6895613345998498,0.0,0.0,0.0,1.0
1718018261.071145,map,True,False,2,3,0.0,0.0,2.4057230949401855,-1.82694673538208,0.0,0.0,0.0,0.04394815592003948,0.999033818792286,3.791402759105174,-4.347134025856808,0.6895613345998498,0.0,0.0,0.0,1.0
1718018261.170832,map,True,False,2,3,0.0,0.0,2.4057230949401855,-1.82694673538208,0.0,0.0,0.0,0.04394815592003948,0.999033818792286,3.799626420449133,-3.9987875232914334,0.6848902757153387,0.0,0.0,0.0,1.0
1718018261.2216222,map,True,False,2,3,0.0,0.0,2.4057230949401855,-1.82694673538208,0.0,0.0,0.0,0.04394815592003948,0.999033818792286,3.799626420449133,-3.9987875232914334,0.6848902757153387,0.0,0.0,0.0,1.0
1718018261.2706823,map,True,False,2,3,0.0,0.0,2.4057230949401855,-1.82694673538208,0.0,0.0,0.0,0.04394815592003948,0.999033818792286,3.799626420449133,-3.9987875232914334,0.6848902757153387,0.0,0.0,0.0,1.0
1718018261.321122,map,True,False,2,3,0.0,0.0,2.4057230949401855,-1.82694673538208,0.0,0.0,0.0,0.04394815592003948,0.999033818792286,3.799626420449133,-3.9987875232914334,0.6848902757153387,0.0,0.0,0.0,1.0
1718018261.421051,map,True,False,2,3,0.0,0.0,2.516228437423706,-1.8534791469573975,0.0,0.0,0.0,0.04331256711512991,0.9990615762867981,3.799626420449133,-3.9987875232914334,0.6848902757153387,0.0,0.0,0.0,1.0
1718018261.8746977,map,True,True,2,2,0.49874686716791977,0.49874686716791977,2.516228437423706,-1.8534791469573975,0.0,0.0,0.0,0.04331256711512991,0.9990615762867981,3.841112178336883,-3.4758897639731314,0.6862142979050376,0.0,0.0,0.0,1.0
1718018261.9745247,map,True,False,2,2,0.49874686716791977,0.49874686716791977,2.6237473487854004,-1.8699755668640137,0.0,0.0,0.0,0.04334692923420033,0.9990600847698916,3.841112178336883,-3.4758897639731314,0.6862142979050376,0.0,0.0,0.0,1.0
1718018262.074037,map,True,True,2,2,0.49874686716791977,0.49874686716791977,2.6237473487854004,-1.8699755668640137,0.0,0.0,0.0,0.04334692923420033,0.9990600847698916,3.841112178336883,-3.4758897639731314,0.6862142979050376,0.0,0.0,0.0,1.0
1718018262.1755435,map,True,False,2,2,0.49874686716791977,0.49874686716791977,2.6237473487854004,-1.8699755668640137,0.0,0.0,0.0,0.04334692923420033,0.9990600847698916,3.867875231400483,-3.3915981643536672,0.6859038804590646,0.0,0.0,0.0,1.0
1718018262.2743278,map,True,False,2,2,0.49874686716791977,0.49874686716791977,2.6237473487854004,-1.8699755668640137,0.0,0.0,0.0,0.04334692923420033,0.9990600847698916,3.867875231400483,-3.3915981643536672,0.6859038804590646,0.0,0.0,0.0,1.0
1718018262.3747895,map,True,True,2,2,0.49874686716791977,0.49874686716791977,2.6237473487854004,-1.8699755668640137,0.0,0.0,0.0,0.04334692923420033,0.9990600847698916,3.867875231400483,-3.3915981643536672,0.6859038804590646,0.0,0.0,0.0,1.0
1718018262.4247985,map,True,True,2,2,0.49874686716791977,0.49874686716791977,2.6237473487854004,-1.8699755668640137,0.0,0.0,0.0,0.04334692923420033,0.9990600847698916,3.867875231400483,-3.3915981643536672,0.6859038804590646,0.0,0.0,0.0,1.0
1718018262.525054,map,True,True,2,2,0.49874686716791977,0.49874686716791977,2.6237473487854004,-1.8699755668640137,0.0,0.0,0.0,0.04334692923420033,0.9990600847698916,3.913610918919544,-3.357806328130285,0.6858104909870751,0.0,0.0,0.0,1.0
1718018262.575271,map,True,True,2,2,0.49874686716791977,0.49874686716791977,2.7308506965637207,-1.9003547430038452,0.0,0.0,0.0,0.04350691821098048,0.9990531193564574,3.913610918919544,-3.357806328130285,0.6858104909870751,0.0,0.0,0.0,1.0
1718018262.62606,map,True,False,2,2,0.49874686716791977,0.49874686716791977,2.7308506965637207,-1.9003547430038452,0.0,0.0,0.0,0.04350691821098048,0.9990531193564574,3.913610918919544,-3.357806328130285,0.6858104909870751,0.0,0.0,0.0,1.0
1718018262.7378342,map,True,False,2,2,0.49874686716791977,0.49874686716791977,2.7308506965637207,-1.9003547430038452,0.0,0.0,0.0,0.04350691821098048,0.9990531193564574,3.913610918919544,-3.357806328130285,0.6858104909870751,0.0,0.0,0.0,1.0
1718018262.7785926,map,True,False,2,2,0.49874686716791977,0.49874686716791977,2.7308506965637207,-1.9003547430038452,0.0,0.0,0.0,0.04350691821098048,0.9990531193564574,3.913610918919544,-3.357806328130285,0.6858104909870751,0.0,0.0,0.0,1.0
1718018262.8754406,map,True,False,2,2,0.49874686716791977,0.49874686716791977,2.7308506965637207,-1.9003547430038452,0.0,0.0,0.0,0.04350691821098048,0.9990531193564574,3.919887689270515,-3.274362931253293,0.7566060328041923,0.0,0.0,0.0,1.0
1718018262.9260616,map,True,False,2,2,0.49874686716791977,0.49874686716791977,2.7308506965637207,-1.9003547430038452,0.0,0.0,0.0,0.04350691821098048,0.9990531193564574,3.919887689270515,-3.274362931253293,0.7566060328041923,0.0,0.0,0.0,1.0
1718018262.976557,map,True,False,2,2,0.49874686716791977,0.49874686716791977,2.7308506965637207,-1.9003547430038452,0.0,0.0,0.0,0.04350691821098048,0.9990531193564574,3.919887689270515,-3.274362931253293,0.7566060328041923,0.0,0.0,0.0,1.0
1718018263.0752013,map,True,True,2,2,0.49874686716791977,0.49874686716791977,2.7308506965637207,-1.9003547430038452,0.0,0.0,0.0,0.04350691821098048,0.9990531193564574,3.919887689270515,-3.274362931253293,0.7566060328041923,0.0,0.0,0.0,1.0
1718018263.1254313,map,True,False,1,2,0.0,0.0,2.824495315551758,-1.9126943349838257,0.0,0.0,0.0,0.043328739447327264,0.9990608752741293,3.959837474538349,-3.2820825097359303,0.8079684346982517,0.0,0.0,0.0,1.0
1718018263.2264616,map,True,False,1,2,0.0,0.0,2.824495315551758,-1.9126943349838257,0.0,0.0,0.0,0.043328739447327264,0.9990608752741293,3.9610817730501093,-3.2370751627959646,0.8086506098857836,0.0,0.0,0.0,1.0
1718018263.2775722,map,True,False,1,2,0.0,0.0,2.824495315551758,-1.9126943349838257,0.0,0.0,0.0,0.043328739447327264,0.9990608752741293,3.9610817730501093,-3.2370751627959646,0.8086506098857836,0.0,0.0,0.0,1.0
1718018263.376111,map,True,False,1,2,0.0,0.0,2.824495315551758,-1.9126943349838257,0.0,0.0,0.0,0.043328739447327264,0.9990608752741293,3.9610817730501093,-3.2370751627959646,0.8086506098857836,0.0,0.0,0.0,1.0
1718018263.4757807,map,True,False,1,2,0.0,0.0,2.824495315551758,-1.9126943349838257,0.0,0.0,0.0,0.043328739447327264,0.9990608752741293,4.011072307980172,-3.2504336228978654,0.9008669183095724,0.0,0.0,0.0,1.0
