car_pos_meter , car_pos_cell, car_speed, ped_pos_meter, ped_pos_cell, ped_speed
-5.125, 5, 1, 3.986014, 5, 1
-5.119375, 5, 1, 3.975521, 5, 1
-4.945007, 4, 2, 3.400858, 4, 1
-4.251257, 4, 2, 2.447298, 3, 1
-3.557507, 3, 2, 1.589419, 2, 1
-2.863756, 2, 2, 0.762892, 0, 1
-2.170006, 2, 2, 0.259347, 0, 1
-1.476255, 1, 2, -0.01666164, 0, 1
-0.782505, 0, 2, -0.1641984, 0, 1
