car_pos_meter , car_pos_cell, car_speed, ped_pos_meter, ped_pos_cell, ped_speed
-41, 41, 2, 3.078865, 30, 1
-40.889, 40, 2, 3.078072, 30, 1
-40.778, 40, 2, 3.078072, 30, 1
-40.667, 40, 2, 3.078072, 30, 1
-40.556, 40, 2, 3.078072, 30, 1
-40.445, 40, 2, 3.078072, 30, 1
-40.334, 40, 2, 2.94441, 29, 1
-40.223, 40, 2, 2.94441, 29, 1
-40.112, 40, 2, 2.931989, 29, 1
-40.001, 40, 2, 2.932712, 29, 1
-39.89, 39, 2, 2.933807, 29, 1
-39.779, 39, 2, 2.93544, 29, 1
-39.668, 39, 2, 2.937157, 29, 1
-39.557, 39, 2, 2.939225, 29, 1
-39.446, 39, 2, 2.940181, 29, 1
-39.335, 39, 2, 2.942031, 29, 1
-39.224, 39, 2, 2.94361, 29, 1
-39.113, 39, 2, 2.944691, 29, 1
-39.002, 39, 2, 2.945824, 29, 1
-38.891, 38, 2, 2.94631, 29, 1
-38.78, 38, 2, 2.947218, 29, 1
-38.669, 38, 2, 2.947553, 29, 1
-38.558, 38, 2, 2.947852, 29, 1
-38.447, 38, 2, 2.947943, 29, 1
-38.336, 38, 2, 2.947841, 29, 1
-38.225, 38, 2, 2.948023, 29, 1
-38.114, 38, 2, 2.948287, 29, 1
-38.003, 38, 2, 2.94812, 29, 1
-37.892, 37, 2, 2.948828, 29, 1
-37.781, 37, 2, 2.949093, 29, 1
-37.67, 37, 2, 2.950123, 29, 1
-37.559, 37, 2, 2.951155, 29, 1
-37.448, 37, 2, 2.952395, 29, 1
-37.337, 37, 2, 2.953467, 29, 1
-37.226, 37, 2, 2.954006, 29, 1
-37.115, 37, 2, 2.955175, 29, 1
-37.004, 37, 2, 2.956382, 29, 1
-36.893, 36, 2, 2.958418, 29, 1
-36.782, 36, 2, 2.960886, 29, 1
-36.671, 36, 2, 2.962011, 29, 1
-36.56, 36, 2, 2.965011, 29, 1
-36.449, 36, 2, 2.968428, 29, 1
-36.338, 36, 2, 2.971614, 29, 1
-36.227, 36, 2, 2.974995, 29, 1
-36.116, 36, 2, 2.976793, 29, 1
-36.005, 36, 2, 2.979874, 29, 1
-35.894, 35, 2, 2.98139, 29, 1
-35.783, 35, 2, 2.984486, 29, 1
-35.672, 35, 2, 2.987595, 29, 1
-35.561, 35, 2, 2.990345, 29, 1
-35.45, 35, 2, 2.992895, 29, 1
-35.339, 35, 2, 2.995275, 29, 1
-35.228, 35, 2, 2.996115, 29, 1
-35.117, 35, 2, 2.998292, 29, 1
-35.006, 35, 2, 2.999914, 29, 1
-34.895, 34, 2, 3.001354, 30, 1
-34.784, 34, 2, 3.002277, 30, 1
-34.673, 34, 2, 3.002812, 30, 1
-34.562, 34, 2, 3.003532, 30, 1
-34.451, 34, 2, 3.003888, 30, 1
-34.34, 34, 2, 3.003985, 30, 1
-34.229, 34, 2, 3.004411, 30, 1
-34.118, 34, 2, 3.004708, 30, 1
-34.007, 34, 2, 3.005191, 30, 1
-33.896, 33, 2, 3.006024, 30, 1
-33.785, 33, 2, 3.007164, 30, 1
-33.674, 33, 2, 3.007973, 30, 1
-33.563, 33, 2, 3.008399, 30, 1
-33.452, 33, 2, 3.009238, 30, 1
-33.341, 33, 2, 3.00983, 30, 1
-33.23, 33, 2, 3.010309, 30, 1
-33.119, 33, 2, 3.011403, 30, 1
-33.008, 33, 2, 3.011857, 30, 1
-32.897, 32, 2, 3.012636, 30, 1
-32.786, 32, 2, 3.013453, 30, 1
-32.675, 32, 2, 3.01458, 30, 1
-32.564, 32, 2, 3.015694, 30, 1
-32.453, 32, 2, 3.016218, 30, 1
-32.342, 32, 2, 3.016831, 30, 1
-32.231, 32, 2, 3.017588, 30, 1
-32.12, 32, 2, 3.017876, 30, 1
-32.009, 32, 2, 3.018226, 30, 1
-31.89799, 31, 2, 3.018081, 30, 1
-31.78699, 31, 2, 3.018264, 30, 1
-31.67599, 31, 2, 3.018451, 30, 1
-31.56499, 31, 2, 3.018572, 30, 1
-31.45399, 31, 2, 3.018845, 30, 1
-31.34299, 31, 2, 3.019021, 30, 1
-31.23199, 31, 2, 3.019292, 30, 1
-31.12099, 31, 2, 3.019618, 30, 1
-31.00999, 31, 2, 3.019917, 30, 1
-30.89899, 30, 2, 3.020487, 30, 1
-30.78799, 30, 2, 3.020716, 30, 1
-30.67699, 30, 2, 3.021364, 30, 1
-30.56599, 30, 2, 3.022015, 30, 1
-30.45499, 30, 2, 3.022851, 30, 1
-30.34399, 30, 2, 3.023874, 30, 1
-30.23299, 30, 2, 3.024191, 30, 1
-30.12199, 30, 2, 3.025358, 30, 1
-30.01099, 30, 2, 3.02632, 30, 1
-29.89999, 29, 2, 3.027571, 30, 1
-29.78899, 29, 2, 3.028907, 30, 1
-29.67799, 29, 2, 3.029366, 30, 1
-29.56699, 29, 2, 3.030685, 30, 1
-29.45599, 29, 2, 3.031867, 30, 1
-29.34499, 29, 2, 3.032979, 30, 1
-29.23399, 29, 2, 3.034104, 30, 1
-29.12299, 29, 2, 3.034622, 30, 1
-29.01199, 29, 2, 3.035701, 30, 1
-28.90099, 28, 2, 3.036467, 30, 1
-28.78999, 28, 2, 3.037525, 30, 1
-28.67899, 28, 2, 3.038471, 30, 1
-28.56799, 28, 2, 3.038947, 30, 1
-28.45699, 28, 2, 3.039734, 30, 1
-28.34599, 28, 2, 3.040364, 30, 1
-28.23499, 28, 2, 3.040692, 30, 1
-28.12399, 28, 2, 3.040599, 30, 1
-28.01299, 28, 2, 3.040514, 30, 1
-27.90199, 27, 2, 3.040317, 30, 1
-27.79099, 27, 2, 3.039979, 30, 1
-27.67999, 27, 2, 3.039776, 30, 1
-27.56899, 27, 2, 3.039337, 30, 1
-27.45799, 27, 2, 3.039041, 30, 1
-27.34699, 27, 2, 3.038702, 30, 1
-27.23599, 27, 2, 3.038033, 30, 1
-27.12499, 27, 2, 3.037554, 30, 1
-27.01399, 27, 2, 3.036867, 30, 1
-26.90299, 26, 2, 3.036368, 30, 1
-26.79199, 26, 2, 3.035489, 30, 1
-26.68099, 26, 2, 3.034016, 30, 1
-26.56999, 26, 2, 3.032724, 30, 1
-26.45899, 26, 2, 3.030889, 30, 1
-26.34799, 26, 2, 3.029754, 30, 1
-26.23699, 26, 2, 3.027205, 30, 1
-26.12599, 26, 2, 3.023746, 30, 1
-26.01499, 26, 2, 3.019868, 30, 1
-25.90399, 25, 2, 3.015323, 30, 1
-25.79299, 25, 2, 3.012354, 30, 1
-25.68199, 25, 2, 3.006428, 30, 1
-25.57099, 25, 2, 2.999611, 29, 1
-25.45999, 25, 2, 2.991858, 29, 1
-25.34899, 25, 2, 2.983273, 29, 1
-25.23799, 25, 2, 2.978652, 29, 1
-25.12699, 25, 2, 2.968732, 29, 1
-25.01599, 25, 2, 2.95806, 29, 1
-24.90499, 24, 2, 2.946925, 29, 1
-24.79399, 24, 2, 2.934967, 29, 1
-24.68299, 24, 2, 2.928479, 29, 1
-24.57199, 24, 2, 2.91569, 29, 1
-24.46099, 24, 2, 2.901617, 29, 1
-24.34999, 24, 2, 2.886887, 28, 1
-24.23899, 24, 2, 2.870902, 28, 1
-24.12799, 24, 2, 2.862742, 28, 1
-24.01699, 24, 2, 2.845473, 28, 1
-23.90599, 23, 2, 2.826708, 28, 1
-23.79499, 23, 2, 2.807418, 28, 1
-23.68399, 23, 2, 2.787446, 27, 1
-23.57299, 23, 2, 2.777393, 27, 1
-23.46199, 23, 2, 2.75765, 27, 1
-23.35099, 23, 2, 2.738627, 27, 1
-23.23999, 23, 2, 2.720795, 27, 1
-23.12899, 23, 2, 2.704071, 27, 1
-23.01799, 23, 2, 2.695901, 26, 1
-22.90699, 22, 2, 2.680075, 26, 1
-22.79599, 22, 2, 2.665487, 26, 1
-22.68499, 22, 2, 2.651283, 26, 1
-22.57399, 22, 2, 2.637073, 26, 1
-22.46299, 22, 2, 2.630103, 26, 1
-22.35199, 22, 2, 2.616444, 26, 1
-22.24099, 22, 2, 2.603103, 26, 1
-22.12999, 22, 2, 2.59023, 25, 1
-22.01899, 22, 2, 2.578095, 25, 1
-21.90799, 21, 2, 2.57213, 25, 1
-21.79699, 21, 2, 2.560468, 25, 1
-21.68599, 21, 2, 2.549288, 25, 1
-21.57499, 21, 2, 2.538228, 25, 1
-21.46399, 21, 2, 2.52739, 25, 1
-21.35299, 21, 2, 2.522131, 25, 1
-21.24199, 21, 2, 2.511752, 25, 1
-21.13099, 21, 2, 2.501865, 25, 1
-21.01999, 21, 2, 2.49225, 24, 1
-20.90899, 20, 2, 2.48302, 24, 1
-20.79799, 20, 2, 2.478556, 24, 1
-20.68699, 20, 2, 2.469885, 24, 1
-20.57599, 20, 2, 2.461358, 24, 1
-20.46499, 20, 2, 2.452175, 24, 1
-20.35399, 20, 2, 2.442243, 24, 1
-20.24299, 20, 2, 2.437127, 24, 1
-20.13199, 20, 2, 2.425761, 24, 1
-20.02099, 20, 2, 2.413743, 24, 1
-19.90999, 19, 2, 2.400964, 24, 1
-19.79899, 19, 2, 2.387634, 23, 1
-19.68799, 19, 2, 2.380844, 23, 1
-19.57699, 19, 2, 2.367134, 23, 1
-19.46599, 19, 2, 2.352928, 23, 1
-19.35499, 19, 2, 2.338626, 23, 1
-19.24399, 19, 2, 2.324567, 23, 1
-19.13299, 19, 2, 2.317137, 23, 1
-19.02199, 19, 2, 2.302237, 23, 1
-18.91099, 18, 2, 2.287144, 22, 1
-18.79999, 18, 2, 2.271872, 22, 1
-18.68899, 18, 2, 2.256293, 22, 1
-18.57799, 18, 2, 2.248678, 22, 1
-18.46699, 18, 2, 2.232816, 22, 1
-18.35599, 18, 2, 2.216687, 22, 1
-18.24499, 18, 2, 2.200552, 22, 1
-18.13399, 18, 2, 2.184035, 21, 1
-18.02299, 18, 2, 2.175628, 21, 1
-17.91199, 17, 2, 2.157971, 21, 1
-17.80099, 17, 2, 2.139842, 21, 1
-17.68999, 17, 2, 2.120911, 21, 1
-17.57899, 17, 2, 2.101053, 21, 1
-17.46799, 17, 2, 2.091153, 20, 1
-17.35699, 17, 2, 2.071617, 20, 1
-17.24599, 17, 2, 2.052449, 20, 1
-17.13499, 17, 2, 2.034029, 20, 1
-17.02399, 17, 2, 2.016354, 20, 1
-16.91299, 16, 2, 2.007715, 20, 1
-16.80199, 16, 2, 1.990943, 19, 1
-16.69099, 16, 2, 1.974614, 19, 1
-16.57999, 16, 2, 1.95849, 19, 1
-16.46899, 16, 2, 1.942971, 19, 1
-16.35799, 16, 2, 1.934944, 19, 1
-16.24699, 16, 2, 1.918931, 19, 1
-16.13599, 16, 2, 1.902685, 19, 1
-16.02499, 16, 2, 1.886199, 18, 1
-15.91399, 15, 2, 1.8694, 18, 1
-15.80299, 15, 2, 1.860799, 18, 1
-15.69199, 15, 2, 1.843059, 18, 1
-15.58099, 15, 2, 1.825324, 18, 1
-15.46999, 15, 2, 1.806999, 18, 1
-15.35899, 15, 2, 1.788513, 17, 1
-15.24799, 15, 2, 1.779021, 17, 1
-15.13699, 15, 2, 1.759012, 17, 1
-15.02599, 15, 2, 1.739363, 17, 1
-14.91499, 14, 2, 1.719791, 17, 1
-14.80399, 14, 2, 1.700176, 17, 1
-14.69299, 14, 2, 1.690094, 16, 1
-14.58199, 14, 2, 1.669362, 16, 1
-14.47099, 14, 2, 1.647942, 16, 1
-14.35999, 14, 2, 1.624997, 16, 1
-14.24899, 14, 2, 1.6003, 16, 1
-14.13799, 14, 2, 1.587691, 15, 1
-14.02699, 14, 2, 1.561763, 15, 1
-13.91599, 13, 2, 1.535771, 15, 1
-13.80499, 13, 2, 1.509675, 15, 1
-13.69398, 13, 2, 1.484548, 14, 1
-13.58298, 13, 2, 1.461, 14, 1
-13.47198, 13, 2, 1.449479, 14, 1
-13.36098, 13, 2, 1.427141, 14, 1
-13.24998, 13, 2, 1.405227, 14, 1
-13.13898, 13, 2, 1.383864, 13, 1
-13.02798, 13, 1, 1.373331, 13, 1
-12.98298, 12, 2, 1.35332, 13, 1
-12.87198, 12, 2, 1.323876, 13, 1
-12.76098, 12, 2, 1.314427, 13, 1
-12.64998, 12, 2, 1.29501, 12, 1
-12.53898, 12, 1, 1.275606, 12, 1
-12.49398, 12, 2, 1.255725, 12, 1
-12.38298, 12, 2, 1.235886, 12, 1
-12.27198, 12, 2, 1.226278, 12, 1
-12.16098, 12, 2, 1.205878, 12, 1
-12.04998, 12, 2, 1.185077, 11, 1
-11.93898, 11, 1, 1.163815, 11, 1
-11.89398, 11, 1, 1.152792, 11, 1
-11.84898, 11, 2, 1.131168, 11, 1
-11.73798, 11, 2, 1.108049, 11, 1
-11.62698, 11, 2, 1.08549, 10, 1
-11.51598, 11, 2, 1.062636, 10, 1
-11.40498, 11, 2, 1.039622, 10, 1
-11.29398, 11, 2, 1.028243, 10, 1
-11.18298, 11, 2, 1.004906, 10, 1
-11.07198, 11, 2, 0.9820099, 9, 1
-10.96098, 10, 2, 0.9582922, 9, 1
-10.84998, 10, 2, 0.9466801, 9, 1
-10.73898, 10, 2, 0.9217334, 9, 1
-10.62798, 10, 2, 0.8969181, 8, 1
-10.51698, 10, 2, 0.873441, 8, 1
-10.40598, 10, 2, 0.8617899, 8, 1
-10.29498, 10, 2, 0.8403783, 8, 1
-10.18398, 10, 2, 0.8198636, 8, 1
-10.07298, 10, 2, 0.8014426, 8, 1
-9.961983, 9, 2, 0.783252, 7, 1
-9.850983, 9, 2, 0.77356, 7, 1
-9.739983, 9, 2, 0.7547655, 7, 1
-9.628983, 9, 2, 0.7360063, 7, 1
-9.517982, 9, 2, 0.7165802, 7, 1
-9.406982, 9, 2, 0.6970015, 6, 1
-9.295982, 9, 2, 0.6867223, 6, 1
-9.184982, 9, 2, 0.6662755, 6, 1
-9.073982, 9, 2, 0.645117, 6, 1
-8.962982, 8, 2, 0.6235385, 6, 1
-8.851982, 8, 2, 0.6020017, 6, 1
-8.740982, 8, 2, 0.5910521, 5, 1
-8.629982, 8, 2, 0.5690727, 5, 1
-8.518982, 8, 2, 0.5471897, 5, 1
-8.407982, 8, 2, 0.5241811, 5, 1
-8.296982, 8, 2, 0.5015848, 5, 1
-8.185982, 8, 2, 0.4899549, 4, 1
-8.074982, 8, 2, 0.4669852, 4, 1
-7.963982, 7, 2, 0.4436395, 4, 1
-7.852982, 7, 2, 0.4199588, 4, 1
-7.741982, 7, 2, 0.396244, 3, 1
-7.630981, 7, 2, 0.3839099, 3, 1
-7.519981, 7, 2, 0.3595359, 3, 1
-7.408981, 7, 2, 0.3345015, 3, 1
-7.297981, 7, 2, 0.309211, 3, 1
-7.186981, 7, 2, 0.2830641, 2, 1
-7.075981, 7, 2, 0.2692618, 2, 1
-6.964981, 6, 2, 0.2421846, 2, 1
-6.853981, 6, 2, 0.2154276, 2, 1
-6.742981, 6, 2, 0.1900411, 1, 1
-6.631981, 6, 2, 0.1649597, 1, 1
-6.520981, 6, 2, 0.1529648, 1, 1
-6.409981, 6, 2, 0.1301694, 1, 1
-6.298981, 6, 2, 0.1079311, 1, 1
-6.187981, 6, 2, 0.08625579, 0, 1
-6.076981, 6, 2, 0.06501651, 0, 1
-5.965981, 5, 2, 0.05442858, 0, 1
-5.85498, 5, 2, 0.03370094, 0, 1
-5.74398, 5, 2, 0.01327968, 0, 1
-5.63298, 5, 2, -0.006785154, 0, 1
-5.52198, 5, 2, -0.02692485, 0, 1
-5.41098, 5, 2, -0.03710818, 0, 1
-5.29998, 5, 2, -0.05704212, 0, 1
-5.18898, 5, 2, -0.07778454, 0, 1
-5.07798, 5, 2, -0.09877777, 0, 1
-4.96698, 4, 2, -0.1092908, -1, 1
-4.85598, 4, 2, -0.1308126, -1, 1
-4.74498, 4, 2, -0.1522636, -1, 1
-4.63398, 4, 2, -0.1740594, -1, 1
-4.52298, 4, 2, -0.1964917, -1, 1
-4.41198, 4, 2, -0.2184625, -2, 1
-4.30098, 4, 2, -0.2296007, -2, 1
-4.18998, 4, 2, -0.2517102, -2, 1
-4.078979, 4, 2, -0.2739425, -2, 1
-3.967979, 3, 2, -0.295814, -2, 1
-3.856979, 3, 2, -0.3174136, -3, 1
-3.745979, 3, 2, -0.3283701, -3, 1
-3.634979, 3, 2, -0.3497386, -3, 1
-3.523979, 3, 2, -0.3713055, -3, 1
-3.412979, 3, 2, -0.3924041, -3, 1
-3.301979, 3, 2, -0.4129186, -4, 1
-3.190979, 3, 2, -0.4231834, -4, 1
-3.079979, 3, 2, -0.4423203, -4, 1
-2.968979, 2, 2, -0.4612541, -4, 1
-2.857979, 2, 2, -0.4803865, -4, 1
-2.746979, 2, 2, -0.4992104, -4, 1
-2.635979, 2, 2, -0.508491, -5, 1
-2.524979, 2, 2, -0.5268857, -5, 1
-2.413979, 2, 2, -0.5447774, -5, 1
-2.302979, 2, 2, -0.5622506, -5, 1
-2.191978, 2, 2, -0.5792823, -5, 1
-2.080978, 2, 2, -0.5878136, -5, 1
-1.969978, 1, 2, -0.604177, -6, 1
-1.858978, 1, 2, -0.6207137, -6, 1
-1.747978, 1, 2, -0.6369298, -6, 1
-1.636978, 1, 2, -0.6529231, -6, 1
-1.525978, 1, 2, -0.6610904, -6, 1
-1.414978, 1, 2, -0.6770215, -6, 1
-1.303978, 1, 2, -0.6927311, -6, 1
-1.192978, 1, 2, -0.7084343, -7, 1
-1.081978, 1, 2, -0.7240233, -7, 1
-0.9709778, 0, 2, -0.731859, -7, 1
-0.8599778, 0, 2, -0.7479231, -7, 1
-0.7489778, 0, 2, -0.7636092, -7, 1
-0.6379778, 0, 2, -0.7794728, -7, 1
-0.5269778, 0, 2, -0.7955494, -7, 1
-0.4159778, 0, 2, -0.8036678, -8, 1
-0.3049778, 0, 2, -0.8200026, -8, 1
-0.1939778, 0, 2, -0.8360126, -8, 1
-0.08297783, 0, 2, -0.8515189, -8, 1
0.02802217, 0, 2, -0.8662114, -8, 1
0.1390222, 0, 2, -0.8735194, -8, 1
0.2500222, 0, 2, -0.8871732, -8, 1
0.3610222, 0, 2, -0.9006064, -9, 1
0.4720222, 0, 2, -0.9126093, -9, 1
0.5830222, 0, 2, -0.9232922, -9, 1
0.6940222, 0, 2, -0.9282186, -9, 1
0.8050222, 0, 2, -0.9364309, -9, 1
0.9160222, 0, 2, -0.9435344, -9, 1
1.027022, -1, 2, -0.9486403, -9, 1
1.138022, -1, 2, -0.952455, -9, 1
1.249022, -1, 2, -0.9536018, -9, 1
1.360022, -1, 2, -0.9542761, -9, 1
1.471022, -1, 2, -0.9530334, -9, 1
1.582022, -1, 2, -0.9505496, -9, 1
1.693022, -1, 2, -0.9471998, -9, 1
1.804023, -1, 2, -0.9449832, -9, 1
1.915023, -1, 2, -0.9409642, -9, 1
2.026023, -2, 2, -0.9357698, -9, 1
2.137023, -2, 2, -0.9306452, -9, 1
2.248023, -2, 2, -0.9249232, -9, 1
2.359023, -2, 2, -0.9219129, -9, 1
2.470023, -2, 2, -0.9159527, -9, 1
2.581023, -2, 2, -0.9103734, -9, 1
2.692023, -2, 2, -0.9057579, -9, 1
2.803023, -2, 2, -0.902709, -9, 1
2.914023, -2, 2, -0.9010911, -9, 1
3.025023, -3, 2, -0.8995597, -8, 1
3.136023, -3, 2, -0.8974323, -8, 1
3.247023, -3, 2, -0.8949859, -8, 1
3.358023, -3, 2, -0.8925297, -8, 1
3.469023, -3, 2, -0.8916526, -8, 1
3.580024, -3, 2, -0.8899357, -8, 1
3.691024, -3, 2, -0.8893647, -8, 1
3.802024, -3, 2, -0.8889613, -8, 1
3.913024, -3, 2, -0.8899541, -8, 1
4.024024, -4, 2, -0.8900764, -8, 1
4.135024, -4, 2, -0.8906271, -8, 1
4.246024, -4, 2, -0.8931961, -8, 1
4.357024, -4, 2, -0.8963809, -8, 1
4.468024, -4, 2, -0.9010832, -9, 1
4.579024, -4, 2, -0.9030867, -9, 1
4.690024, -4, 2, -0.9087267, -9, 1
4.801024, -4, 2, -0.913764, -9, 1
4.912024, -4, 2, -0.9199686, -9, 1
5.023024, -5, 2, -0.9264708, -9, 1
5.134024, -5, 2, -0.9297762, -9, 1
5.245024, -5, 2, -0.9361134, -9, 1
5.356024, -5, 2, -0.9426847, -9, 1
5.467024, -5, 2, -0.9489636, -9, 1
5.578024, -5, 2, -0.9525394, -9, 1
5.689024, -5, 2, -0.9598465, -9, 1
5.800025, -5, 2, -0.9678035, -9, 1
5.911025, -5, 2, -0.9753807, -9, 1
6.022025, -6, 2, -0.9828935, -9, 1
6.133025, -6, 2, -0.9905531, -9, 1
6.244025, -6, 2, -0.99858, -9, 1
6.355025, -6, 2, -1.002247, -10, 1
6.466025, -6, 2, -1.009809, -10, 1
6.577025, -6, 2, -1.017045, -10, 1
6.688025, -6, 2, -1.024024, -10, 1
6.799025, -6, 2, -1.030732, -10, 1
6.910025, -6, 2, -1.034042, -10, 1
7.021025, -7, 2, -1.039696, -10, 1
7.132025, -7, 2, -1.045187, -10, 1
7.243025, -7, 2, -1.049712, -10, 1
7.354025, -7, 2, -1.054858, -10, 1
7.465025, -7, 2, -1.056959, -10, 1
7.576025, -7, 2, -1.061544, -10, 1
7.687026, -7, 2, -1.066294, -10, 1
7.798026, -7, 2, -1.071012, -10, 1
7.909026, -7, 2, -1.07583, -10, 1
8.020025, -8, 2, -1.078216, -10, 1
8.131025, -8, 2, -1.082203, -10, 1
8.242025, -8, 2, -1.08632, -10, 1
8.353025, -8, 2, -1.089738, -10, 1
8.464025, -8, 2, -1.092633, -10, 1
8.575026, -8, 2, -1.094225, -10, 1
8.686026, -8, 2, -1.09645, -10, 1
8.797026, -8, 2, -1.098649, -10, 1
8.908026, -8, 2, -1.100612, -11, 1
9.019026, -9, 2, -1.101449, -11, 1
9.130026, -9, 2, -1.103801, -11, 1
9.241026, -9, 2, -1.104473, -11, 1
9.352026, -9, 2, -1.105831, -11, 1
9.463026, -9, 2, -1.10711, -11, 1
9.574026, -9, 2, -1.107656, -11, 1
9.685026, -9, 2, -1.108775, -11, 1
9.796026, -9, 2, -1.109631, -11, 1
9.907026, -9, 2, -1.110603, -11, 1
10.01803, -10, 2, -1.111618, -11, 1
10.12903, -10, 2, -1.111898, -11, 1
10.24003, -10, 2, -1.112891, -11, 1
10.35103, -10, 2, -1.113316, -11, 1
10.46203, -10, 2, -1.113411, -11, 1
10.57303, -10, 2, -1.113705, -11, 1
10.68403, -10, 2, -1.113798, -11, 1
10.79503, -10, 2, -1.113866, -11, 1
10.90603, -10, 2, -1.11402, -11, 1
11.01703, -11, 2, -1.113804, -11, 1
11.12803, -11, 2, -1.113437, -11, 1
11.23903, -11, 2, -1.112725, -11, 1
11.35003, -11, 2, -1.112025, -11, 1
11.46103, -11, 2, -1.110863, -11, 1
11.57203, -11, 2, -1.109962, -11, 1
11.68303, -11, 2, -1.108258, -11, 1
11.79403, -11, 2, -1.106436, -11, 1
11.90503, -11, 2, -1.104405, -11, 1
12.01603, -12, 2, -1.103372, -11, 1
12.12703, -12, 2, -1.101449, -11, 1
12.23803, -12, 2, -1.100106, -11, 1
12.34903, -12, 2, -1.098514, -10, 1
12.46003, -12, 2, -1.097895, -10, 1
12.57103, -12, 2, -1.096242, -10, 1
12.68203, -12, 2, -1.094788, -10, 1
12.79303, -12, 2, -1.0934, -10, 1
12.90403, -12, 2, -1.092125, -10, 1
13.01503, -13, 2, -1.091464, -10, 1
13.12603, -13, 2, -1.090484, -10, 1
13.23703, -13, 2, -1.089653, -10, 1
13.34803, -13, 2, -1.089042, -10, 1
13.45903, -13, 2, -1.088817, -10, 1
13.57003, -13, 2, -1.088636, -10, 1
13.68103, -13, 2, -1.088707, -10, 1
13.79203, -13, 2, -1.089118, -10, 1
13.90303, -13, 2, -1.090049, -10, 1
14.01403, -14, 2, -1.09053, -10, 1
14.12503, -14, 2, -1.09155, -10, 1
14.23603, -14, 2, -1.092762, -10, 1
14.34703, -14, 2, -1.094239, -10, 1
14.45803, -14, 2, -1.095943, -10, 1
14.56903, -14, 2, -1.096793, -10, 1
14.68003, -14, 2, -1.098762, -10, 1
14.79103, -14, 2, -1.100718, -11, 1
14.90203, -14, 2, -1.102416, -11, 1
15.01303, -15, 2, -1.104468, -11, 1
15.12403, -15, 2, -1.105412, -11, 1
15.23503, -15, 2, -1.107026, -11, 1
15.34603, -15, 2, -1.108984, -11, 1
15.45703, -15, 2, -1.111004, -11, 1
15.56803, -15, 2, -1.113067, -11, 1
15.67903, -15, 2, -1.114965, -11, 1
15.79003, -15, 2, -1.115808, -11, 1
15.90103, -15, 2, -1.117601, -11, 1
16.01203, -16, 2, -1.119411, -11, 1
16.12303, -16, 2, -1.121242, -11, 1
16.23403, -16, 2, -1.122736, -11, 1
16.34503, -16, 2, -1.123732, -11, 1
16.45603, -16, 2, -1.125342, -11, 1
16.56703, -16, 2, -1.12731, -11, 1
16.67803, -16, 2, -1.129218, -11, 1
16.78903, -16, 2, -1.1315, -11, 1
16.90003, -16, 2, -1.133064, -11, 1
17.01103, -17, 2, -1.135498, -11, 1
17.12203, -17, 2, -1.138489, -11, 1
17.23303, -17, 2, -1.141752, -11, 1
17.34403, -17, 2, -1.145521, -11, 1
17.45503, -17, 2, -1.147824, -11, 1
17.56603, -17, 2, -1.152468, -11, 1
