timestamp_sec,frame_id,game_played,yielding,player1discrete,player2discrete,player1yieldprob,player2yieldprob,player1_pose_x,player1_pose_y,player1_pose_z,player1_pose_orient_x,player1_pose_orient_y,player1_pose_orient_z,player1_pose_orient_w,player2_pose_x,player2_pose_y,player2_pose_z,player2_pose_orient_x,player2_pose_orient_y,player2_pose_orient_z,player2_pose_orient_w
1718122208.7576575,map,True,False,5,6,0.0,0.0,1.4198323488235474,-1.5660184621810913,0.0,0.0,0.0,0.033555912473377025,0.999436845756423,3.2232992559253324,-7.353649469063231,0.7948900780539605,0.0,0.0,0.0,1.0
1718122208.8079853,map,True,False,5,6,0.0,0.0,1.4198323488235474,-1.5660184621810913,0.0,0.0,0.0,0.033555912473377025,0.999436845756423,3.2232992559253324,-7.353649469063231,0.7948900780539605,0.0,0.0,0.0,1.0
1718122208.908592,map,True,False,5,6,0.0,0.0,1.4198323488235474,-1.5660184621810913,0.0,0.0,0.0,0.033555912473377025,0.999436845756423,3.2232992559253324,-7.353649469063231,0.7948900780539605,0.0,0.0,0.0,1.0
1718122208.9582455,map,True,False,5,6,0.0,0.0,1.4198323488235474,-1.5660184621810913,0.0,0.0,0.0,0.033555912473377025,0.999436845756423,3.2232992559253324,-7.353649469063231,0.7948900780539605,0.0,0.0,0.0,1.0
1718122209.0122218,map,True,False,5,6,0.0,0.0,1.4198323488235474,-1.5660184621810913,0.0,0.0,0.0,0.033555912473377025,0.999436845756423,3.2232992559253324,-7.353649469063231,0.7948900780539605,0.0,0.0,0.0,1.0
1718122209.1120112,map,True,True,5,5,0.612995793784914,0.612995793784914,1.4198323488235474,-1.5660184621810913,0.0,0.0,0.0,0.033555912473377025,0.999436845756423,3.132427408971057,-6.369976477304485,0.7825331987747788,0.0,0.0,0.0,1.0
1718122209.2104878,map,True,True,5,5,0.612995793784914,0.612995793784914,1.4198323488235474,-1.5660184621810913,0.0,0.0,0.0,0.033555912473377025,0.999436845756423,3.1399028259062596,-6.24955154385481,0.7871242043465667,0.0,0.0,0.0,1.0
1718122209.4636,map,True,True,5,5,0.612995793784914,0.612995793784914,1.4198323488235474,-1.5660184621810913,0.0,0.0,0.0,0.033555912473377025,0.999436845756423,3.194387170369672,-6.1687711743312965,0.7983857753435573,0.0,0.0,0.0,1.0
1718122209.5136013,map,True,True,5,5,0.612995793784914,0.612995793784914,1.4198323488235474,-1.5660184621810913,0.0,0.0,0.0,0.033555912473377025,0.999436845756423,3.194387170369672,-6.1687711743312965,0.7983857753435573,0.0,0.0,0.0,1.0
1718122209.6136312,map,True,False,5,5,0.612995793784914,0.612995793784914,1.601047158241272,-1.617258071899414,0.0,0.0,0.0,0.03501297832346137,0.9993868527595218,3.194387170369672,-6.1687711743312965,0.7983857753435573,0.0,0.0,0.0,1.0
1718122209.6642082,map,True,True,5,5,0.612995793784914,0.612995793784914,1.601047158241272,-1.617258071899414,0.0,0.0,0.0,0.03501297832346137,0.9993868527595218,3.194387170369672,-6.1687711743312965,0.7983857753435573,0.0,0.0,0.0,1.0
1718122209.7255397,map,True,True,5,5,0.612995793784914,0.612995793784914,1.601047158241272,-1.617258071899414,0.0,0.0,0.0,0.03501297832346137,0.9993868527595218,3.194387170369672,-6.1687711743312965,0.7983857753435573,0.0,0.0,0.0,1.0
1718122209.7770565,map,True,True,5,5,0.612995793784914,0.612995793784914,1.601047158241272,-1.617258071899414,0.0,0.0,0.0,0.03501297832346137,0.9993868527595218,3.273457536760437,-6.049486447002875,0.7690770314659353,0.0,0.0,0.0,1.0
1718122209.826125,map,True,False,5,4,0.0,0.0,1.601047158241272,-1.617258071899414,0.0,0.0,0.0,0.03501297832346137,0.9993868527595218,3.2597498825884434,-5.9665862907600555,0.7674281105282933,0.0,0.0,0.0,1.0
1718122209.8762908,map,True,False,5,4,0.0,0.0,1.601047158241272,-1.617258071899414,0.0,0.0,0.0,0.03501297832346137,0.9993868527595218,3.2597498825884434,-5.9665862907600555,0.7674281105282933,0.0,0.0,0.0,1.0
1718122209.9283934,map,True,False,5,4,0.0,0.0,1.601047158241272,-1.617258071899414,0.0,0.0,0.0,0.03501297832346137,0.9993868527595218,3.2597498825884434,-5.9665862907600555,0.7674281105282933,0.0,0.0,0.0,1.0
1718122209.9777348,map,True,False,5,4,0.0,0.0,1.601047158241272,-1.617258071899414,0.0,0.0,0.0,0.03501297832346137,0.9993868527595218,3.2597498825884434,-5.9665862907600555,0.7674281105282933,0.0,0.0,0.0,1.0
1718122210.0768435,map,True,False,5,4,0.0,0.0,1.601047158241272,-1.617258071899414,0.0,0.0,0.0,0.03501297832346137,0.9993868527595218,3.2597498825884434,-5.9665862907600555,0.7674281105282933,0.0,0.0,0.0,1.0
1718122210.128034,map,True,True,4,4,0.5922520728754596,0.5922520728754596,1.726509690284729,-1.6555044651031494,0.0,0.0,0.0,0.036678773320412895,0.9993271053878078,3.2850337605915945,-5.470631067666513,0.7578960396445574,0.0,0.0,0.0,1.0
1718122210.1775792,map,True,False,4,4,0.5922520728754596,0.5922520728754596,1.726509690284729,-1.6555044651031494,0.0,0.0,0.0,0.036678773320412895,0.9993271053878078,3.2797749111944396,-5.412325302550945,0.7453392899155572,0.0,0.0,0.0,1.0
1718122210.4416683,map,True,False,4,4,0.5922520728754596,0.5922520728754596,1.726509690284729,-1.6555044651031494,0.0,0.0,0.0,0.036678773320412895,0.9993271053878078,3.3166927450571215,-5.329479281765983,0.7607900046177364,0.0,0.0,0.0,1.0
1718122210.538444,map,True,True,4,4,0.5922520728754596,0.5922520728754596,1.726509690284729,-1.6555044651031494,0.0,0.0,0.0,0.036678773320412895,0.9993271053878078,3.3535986009849017,-5.252247255515907,0.7540641086496199,0.0,0.0,0.0,1.0
1718122210.6385872,map,True,False,4,4,0.5922520728754596,0.5922520728754596,1.726509690284729,-1.6555044651031494,0.0,0.0,0.0,0.036678773320412895,0.9993271053878078,3.3535986009849017,-5.252247255515907,0.7540641086496199,0.0,0.0,0.0,1.0
1718122210.7377014,map,True,True,4,4,0.5922520728754596,0.5922520728754596,1.726509690284729,-1.6555044651031494,0.0,0.0,0.0,0.036678773320412895,0.9993271053878078,3.3535986009849017,-5.252247255515907,0.7540641086496199,0.0,0.0,0.0,1.0
1718122210.7888422,map,True,True,4,4,0.5922520728754596,0.5922520728754596,1.726509690284729,-1.6555044651031494,0.0,0.0,0.0,0.036678773320412895,0.9993271053878078,3.3950329783131123,-5.139227352947407,0.751577918778646,0.0,0.0,0.0,1.0
1718122210.8383152,map,True,False,4,3,0.0,0.0,1.726509690284729,-1.6555044651031494,0.0,0.0,0.0,0.036678773320412895,0.9993271053878078,3.3657540234396968,-4.927583444562029,0.7575024429126362,0.0,0.0,0.0,1.0
1718122210.9390867,map,True,False,4,3,0.0,0.0,1.78415048122406,-1.669642686843872,0.0,0.0,0.0,0.037172008883587904,0.9993088837415671,3.3657540234396968,-4.927583444562029,0.7575024429126362,0.0,0.0,0.0,1.0
1718122211.039039,map,True,False,4,3,0.0,0.0,1.78415048122406,-1.669642686843872,0.0,0.0,0.0,0.037172008883587904,0.9993088837415671,3.3657540234396968,-4.927583444562029,0.7575024429126362,0.0,0.0,0.0,1.0
1718122211.0891538,map,True,False,4,3,0.0,0.0,1.78415048122406,-1.669642686843872,0.0,0.0,0.0,0.037172008883587904,0.9993088837415671,3.3657540234396968,-4.927583444562029,0.7575024429126362,0.0,0.0,0.0,1.0
1718122211.1464205,map,True,False,4,3,0.0,0.0,1.78415048122406,-1.669642686843872,0.0,0.0,0.0,0.037172008883587904,0.9993088837415671,3.3860787402716412,-4.6558741209092895,0.7465745584891426,0.0,0.0,0.0,1.0
1718122211.2399666,map,True,False,4,3,0.0,0.0,1.78415048122406,-1.669642686843872,0.0,0.0,0.0,0.037172008883587904,0.9993088837415671,3.3867934152666797,-4.600056349602266,0.7272205136602146,0.0,0.0,0.0,1.0
1718122211.440209,map,True,False,4,3,0.0,0.0,1.78415048122406,-1.669642686843872,0.0,0.0,0.0,0.037172008883587904,0.9993088837415671,3.428215225050442,-4.334034030084371,0.7398712704935362,0.0,0.0,0.0,1.0
1718122211.4901798,map,True,False,4,3,0.0,0.0,1.9040899276733398,-1.704473614692688,0.0,0.0,0.0,0.03817493744280879,0.9992710675463599,3.5107170571320285,-4.306450494948456,0.7274200132258095,0.0,0.0,0.0,1.0
1718122211.5916145,map,True,False,4,3,0.0,0.0,1.9040899276733398,-1.704473614692688,0.0,0.0,0.0,0.03817493744280879,0.9992710675463599,3.5107170571320285,-4.306450494948456,0.7274200132258095,0.0,0.0,0.0,1.0
1718122211.6404693,map,True,False,4,3,0.0,0.0,1.9040899276733398,-1.704473614692688,0.0,0.0,0.0,0.03817493744280879,0.9992710675463599,3.5107170571320285,-4.306450494948456,0.7274200132258095,0.0,0.0,0.0,1.0
1718122211.6907904,map,True,False,4,3,0.0,0.0,1.9040899276733398,-1.704473614692688,0.0,0.0,0.0,0.03817493744280879,0.9992710675463599,3.5107170571320285,-4.306450494948456,0.7274200132258095,0.0,0.0,0.0,1.0
1718122211.7413774,map,True,False,4,3,0.0,0.0,1.9040899276733398,-1.704473614692688,0.0,0.0,0.0,0.03817493744280879,0.9992710675463599,3.5107170571320285,-4.306450494948456,0.7274200132258095,0.0,0.0,0.0,1.0
1718122211.8417578,map,True,False,4,2,0.0,0.0,1.9040899276733398,-1.704473614692688,0.0,0.0,0.0,0.03817493744280879,0.9992710675463599,3.5249788840388203,-3.777052758180229,0.7012590714613988,0.0,0.0,0.0,1.0
1718122211.8913434,map,True,False,4,2,0.0,0.0,1.9040899276733398,-1.704473614692688,0.0,0.0,0.0,0.03817493744280879,0.9992710675463599,3.5249788840388203,-3.777052758180229,0.7012590714613988,0.0,0.0,0.0,1.0
1718122211.9421468,map,True,False,4,2,0.0,0.0,1.9040899276733398,-1.704473614692688,0.0,0.0,0.0,0.03817493744280879,0.9992710675463599,3.5249788840388203,-3.777052758180229,0.7012590714613988,0.0,0.0,0.0,1.0
1718122211.9937482,map,True,False,4,2,0.0,0.0,1.9810452461242676,-1.7200849056243896,0.0,0.0,0.0,0.03807665072064905,0.9992748253711206,3.5249788840388203,-3.777052758180229,0.7012590714613988,0.0,0.0,0.0,1.0
1718122212.0428777,map,True,False,4,2,0.0,0.0,1.9810452461242676,-1.7200849056243896,0.0,0.0,0.0,0.03807665072064905,0.9992748253711206,3.5249788840388203,-3.777052758180229,0.7012590714613988,0.0,0.0,0.0,1.0
1718122212.0949516,map,True,False,4,2,0.0,0.0,1.9810452461242676,-1.7200849056243896,0.0,0.0,0.0,0.03807665072064905,0.9992748253711206,3.5249788840388203,-3.777052758180229,0.7012590714613988,0.0,0.0,0.0,1.0
1718122212.194823,map,True,False,4,2,0.0,0.0,1.9810452461242676,-1.7200849056243896,0.0,0.0,0.0,0.03807665072064905,0.9992748253711206,3.5410905312787424,-3.5564437119218564,0.6895243309104737,0.0,0.0,0.0,1.0
1718122212.2434926,map,True,False,4,2,0.0,0.0,1.9810452461242676,-1.7200849056243896,0.0,0.0,0.0,0.03807665072064905,0.9992748253711206,3.5410905312787424,-3.5564437119218564,0.6895243309104737,0.0,0.0,0.0,1.0
1718122212.4426277,map,True,False,3,2,0.0,0.0,2.06653094291687,-1.765163779258728,0.0,0.0,0.0,0.04065026144601257,0.9991734337093683,3.731848632392808,-3.374133703286941,0.6825145736528689,0.0,0.0,0.0,1.0
1718122212.4940345,map,True,False,3,2,0.0,0.0,2.06653094291687,-1.765163779258728,0.0,0.0,0.0,0.04065026144601257,0.9991734337093683,3.8214049705496143,-3.271414110560956,0.6848878873198788,0.0,0.0,0.0,1.0
1718122212.5443835,map,True,False,3,2,0.0,0.0,2.06653094291687,-1.765163779258728,0.0,0.0,0.0,0.04065026144601257,0.9991734337093683,3.8214049705496143,-3.271414110560956,0.6848878873198788,0.0,0.0,0.0,1.0
1718122212.6431987,map,True,False,3,2,0.0,0.0,2.06653094291687,-1.765163779258728,0.0,0.0,0.0,0.04065026144601257,0.9991734337093683,3.8214049705496143,-3.271414110560956,0.6848878873198788,0.0,0.0,0.0,1.0
1718122212.7440512,map,True,False,3,2,0.0,0.0,2.06653094291687,-1.765163779258728,0.0,0.0,0.0,0.04065026144601257,0.9991734337093683,3.8214049705496143,-3.271414110560956,0.6848878873198788,0.0,0.0,0.0,1.0
1718122212.7949607,map,True,False,3,2,0.0,0.0,2.06653094291687,-1.765163779258728,0.0,0.0,0.0,0.04065026144601257,0.9991734337093683,3.801893470889324,-3.0107647231552797,0.6839849747924788,0.0,0.0,0.0,1.0
1718122212.8463397,map,True,False,3,2,0.0,0.0,2.06653094291687,-1.765163779258728,0.0,0.0,0.0,0.04065026144601257,0.9991734337093683,3.814837969598769,-2.990034152385594,0.6814400961917527,0.0,0.0,0.0,1.0
1718122212.895897,map,True,False,3,2,0.0,0.0,2.06653094291687,-1.765163779258728,0.0,0.0,0.0,0.04065026144601257,0.9991734337093683,3.814837969598769,-2.990034152385594,0.6814400961917527,0.0,0.0,0.0,1.0
1718122212.9464204,map,True,False,3,2,0.0,0.0,2.06653094291687,-1.765163779258728,0.0,0.0,0.0,0.04065026144601257,0.9991734337093683,3.814837969598769,-2.990034152385594,0.6814400961917527,0.0,0.0,0.0,1.0
1718122212.997717,map,True,False,3,2,0.0,0.0,2.1539483070373535,-1.7899271249771118,0.0,0.0,0.0,0.04039326091178231,0.9991838581832266,3.814837969598769,-2.990034152385594,0.6814400961917527,0.0,0.0,0.0,1.0
1718122213.098271,map,True,False,3,2,0.0,0.0,2.1539483070373535,-1.7899271249771118,0.0,0.0,0.0,0.04039326091178231,0.9991838581832266,3.814837969598769,-2.990034152385594,0.6814400961917527,0.0,0.0,0.0,1.0
1718122213.1978803,map,True,False,3,2,0.0,0.0,2.1539483070373535,-1.7899271249771118,0.0,0.0,0.0,0.04039326091178231,0.9991838581832266,3.979095958055184,-2.610994243055239,0.680207847748032,0.0,0.0,0.0,1.0
1718122213.2488973,map,True,False,3,2,0.0,0.0,2.1539483070373535,-1.7899271249771118,0.0,0.0,0.0,0.04039326091178231,0.9991838581832266,3.979095958055184,-2.610994243055239,0.680207847748032,0.0,0.0,0.0,1.0
1718122213.4984634,map,True,False,3,1,0.0,0.0,2.1539483070373535,-1.7899271249771118,0.0,0.0,0.0,0.04039326091178231,0.9991838581832266,3.9375850930114504,-2.3491220640220867,0.6812986409922561,0.0,0.0,0.0,1.0
1718122213.598863,map,True,False,3,1,0.0,0.0,2.2638916969299316,-1.7939285039901733,0.0,0.0,0.0,0.04075185656613728,0.9991693026646025,3.9375850930114504,-2.3491220640220867,0.6812986409922561,0.0,0.0,0.0,1.0
1718122213.6480517,map,True,False,3,1,0.0,0.0,2.2638916969299316,-1.7939285039901733,0.0,0.0,0.0,0.04075185656613728,0.9991693026646025,3.9375850930114504,-2.3491220640220867,0.6812986409922561,0.0,0.0,0.0,1.0
1718122213.698071,map,True,False,3,1,0.0,0.0,2.2638916969299316,-1.7939285039901733,0.0,0.0,0.0,0.04075185656613728,0.9991693026646025,3.9375850930114504,-2.3491220640220867,0.6812986409922561,0.0,0.0,0.0,1.0
1718122213.748604,map,True,False,3,1,0.0,0.0,2.2638916969299316,-1.7939285039901733,0.0,0.0,0.0,0.04075185656613728,0.9991693026646025,3.9375850930114504,-2.3491220640220867,0.6812986409922561,0.0,0.0,0.0,1.0
1718122213.8498182,map,True,False,3,1,0.0,0.0,2.2638916969299316,-1.7939285039901733,0.0,0.0,0.0,0.04075185656613728,0.9991693026646025,3.973481254449359,-2.269435286187036,0.6795262836052572,0.0,0.0,0.0,1.0
1718122213.950176,map,True,False,3,1,0.0,0.0,2.2638916969299316,-1.7939285039901733,0.0,0.0,0.0,0.04075185656613728,0.9991693026646025,3.973481254449359,-2.269435286187036,0.6795262836052572,0.0,0.0,0.0,1.0
1718122214.000417,map,True,False,3,1,0.0,0.0,2.2638916969299316,-1.7939285039901733,0.0,0.0,0.0,0.04075185656613728,0.9991693026646025,3.973481254449359,-2.269435286187036,0.6795262836052572,0.0,0.0,0.0,1.0
1718122214.0510118,map,True,False,3,1,0.0,0.0,2.2638916969299316,-1.7939285039901733,0.0,0.0,0.0,0.04075185656613728,0.9991693026646025,3.973481254449359,-2.269435286187036,0.6795262836052572,0.0,0.0,0.0,1.0
1718122214.1018107,map,True,False,3,1,0.0,0.0,2.3688161373138428,-1.8407797813415527,0.0,0.0,0.0,0.042019024116568195,0.9991168055900488,3.973481254449359,-2.269435286187036,0.6795262836052572,0.0,0.0,0.0,1.0
1718122214.2017753,map,True,False,3,1,0.0,0.0,2.3688161373138428,-1.8407797813415527,0.0,0.0,0.0,0.042019024116568195,0.9991168055900488,3.973481254449359,-2.269435286187036,0.6795262836052572,0.0,0.0,0.0,1.0
