car_pos_meter , car_pos_cell, car_speed, ped_pos_meter, ped_pos_cell, ped_speed
-5.125, 5, 2, 3.997483, 5, 1
-5.104175, 5, 2, 3.992989, 5, 1
-5.08335, 5, 1, 3.983999, 5, 1
-5.072975, 5, 1, 3.97469, 5, 1
-5.0626, 5, 1, 3.965243, 5, 1
-5.052225, 5, 2, 3.960588, 5, 1
-5.0314, 5, 1, 3.951073, 5, 1
-5.021025, 5, 1, 3.941463, 5, 1
-5.01065, 5, 2, 3.931167, 5, 1
-4.989825, 4, 2, 3.920941, 5, 1
-4.969, 4, 2, 3.910517, 5, 1
-4.948175, 4, 2, 3.905013, 5, 1
-4.927351, 4, 2, 3.894082, 5, 1
-4.906526, 4, 2, 3.882837, 5, 1
-4.885701, 4, 2, 3.87138, 5, 1
-4.864876, 4, 2, 3.859601, 5, 1
-4.844051, 4, 2, 3.847125, 5, 1
-4.823226, 4, 2, 3.840977, 4, 1
-4.802401, 4, 1, 3.828019, 4, 1
-4.792026, 4, 2, 3.814929, 4, 1
-4.771201, 4, 1, 3.801636, 4, 1
-4.760826, 4, 1, 3.788338, 4, 1
-4.750451, 4, 1, 3.781771, 4, 1
-4.740076, 4, 1, 3.76826, 4, 1
-4.729701, 4, 2, 3.755236, 4, 1
-4.708876, 4, 1, 3.74193, 4, 1
-4.698501, 4, 1, 3.735098, 4, 1
-4.688126, 4, 2, 3.721005, 4, 1
-4.667301, 4, 2, 3.707354, 4, 1
-4.646476, 4, 1, 3.694416, 4, 1
-4.636101, 4, 1, 3.681257, 4, 1
-4.625726, 4, 1, 3.674841, 4, 1
-4.615351, 4, 1, 3.66193, 4, 1
-4.604976, 4, 1, 3.64911, 4, 1
-4.594601, 4, 2, 3.636472, 4, 1
-4.573776, 4, 1, 3.623462, 4, 1
-4.563401, 4, 1, 3.610329, 4, 1
-4.553026, 4, 2, 3.60374, 4, 1
-4.532201, 4, 2, 3.590384, 4, 1
-4.511376, 4, 1, 3.576648, 4, 1
-4.501001, 4, 1, 3.562614, 4, 1
-4.490626, 4, 1, 3.548797, 4, 1
-4.480251, 4, 2, 3.541712, 4, 1
-4.459426, 4, 2, 3.527659, 4, 1
-4.438601, 4, 2, 3.513601, 4, 1
-4.417777, 4, 1, 3.499255, 4, 1
-4.407402, 4, 1, 3.484999, 4, 1
-4.397027, 4, 1, 3.478023, 4, 1
-4.386652, 4, 1, 3.464121, 4, 1
-4.376276, 4, 1, 3.450117, 4, 1
-4.365901, 4, 1, 3.435758, 4, 1
-4.355526, 4, 2, 3.421826, 4, 1
-4.334702, 4, 2, 3.414466, 4, 1
-4.313877, 4, 2, 3.399462, 4, 1
-4.293052, 4, 1, 3.384646, 4, 1
-4.282677, 4, 1, 3.369463, 4, 1
-4.272302, 4, 2, 3.362022, 4, 1
-4.251477, 4, 1, 3.346437, 4, 1
-4.241102, 4, 1, 3.331491, 4, 1
-4.230727, 4, 1, 3.316226, 4, 1
-4.220352, 4, 1, 3.30131, 4, 1
-4.209977, 4, 2, 3.286575, 4, 1
-4.189152, 4, 2, 3.278776, 4, 1
-4.168327, 4, 2, 3.262971, 4, 1
-4.147502, 4, 1, 3.247251, 4, 1
-4.137127, 4, 1, 3.231916, 4, 1
-4.126752, 4, 2, 3.217304, 4, 1
-4.105927, 4, 1, 3.210186, 4, 1
-4.095552, 4, 2, 3.195667, 4, 1
-4.074727, 4, 1, 3.181721, 4, 1
-4.064352, 4, 1, 3.167567, 4, 1
-4.053977, 4, 2, 3.152787, 4, 1
-4.033152, 4, 2, 3.145244, 4, 1
-4.012327, 4, 1, 3.130296, 4, 1
-4.001952, 4, 1, 3.115417, 4, 1
-3.991577, 3, 2, 3.100297, 4, 1
-3.970752, 3, 2, 3.085131, 4, 1
-3.949927, 3, 2, 3.077455, 4, 1
-3.929102, 3, 1, 3.062132, 3, 1
-3.918727, 3, 1, 3.046498, 3, 1
-3.908352, 3, 1, 3.030472, 3, 1
-3.897977, 3, 2, 3.013872, 3, 1
-3.877152, 3, 2, 3.005409, 3, 1
-3.856328, 3, 1, 2.988185, 3, 1
-3.845953, 3, 1, 2.971043, 3, 1
-3.835577, 3, 2, 2.953828, 3, 1
-3.814753, 3, 2, 2.936321, 3, 1
-3.793928, 3, 1, 2.927957, 3, 1
-3.783553, 3, 1, 2.910791, 3, 1
-3.773178, 3, 1, 2.893215, 3, 1
-3.762803, 3, 1, 2.875378, 3, 1
-3.752428, 3, 2, 2.85771, 3, 1
-3.731603, 3, 1, 2.848763, 3, 1
-3.721228, 3, 1, 2.830851, 3, 1
-3.710853, 3, 1, 2.813585, 3, 1
-3.700478, 3, 2, 2.796112, 3, 1
-3.679653, 3, 2, 2.778271, 3, 1
-3.658828, 3, 1, 2.76951, 3, 1
-3.648453, 3, 1, 2.752173, 3, 1
-3.638078, 3, 1, 2.735968, 3, 1
-3.627703, 3, 2, 2.72015, 3, 1
-3.606878, 3, 1, 2.7047, 3, 1
-3.596503, 3, 1, 2.697117, 3, 1
-3.586128, 3, 1, 2.682454, 3, 1
-3.575753, 3, 1, 2.668448, 3, 1
-3.565378, 3, 2, 2.654431, 3, 1
-3.544553, 3, 1, 2.641123, 3, 1
-3.534178, 3, 2, 2.634524, 3, 1
-3.513353, 3, 1, 2.621696, 3, 1
-3.502978, 3, 1, 2.609357, 3, 1
-3.492603, 3, 2, 2.596725, 3, 1
-3.471778, 3, 1, 2.585099, 3, 1
-3.461403, 3, 1, 2.579245, 3, 1
-3.451028, 3, 1, 2.568049, 3, 1
-3.440653, 3, 1, 2.5571, 3, 1
-3.430278, 3, 2, 2.545444, 3, 1
-3.409453, 3, 1, 2.534498, 3, 1
-3.399078, 3, 1, 2.528699, 3, 1
-3.388703, 3, 1, 2.517458, 3, 1
-3.378328, 3, 2, 2.511695, 3, 1
-3.357503, 3, 2, 2.494589, 3, 1
-3.336678, 3, 1, 2.48351, 3, 1
-3.326303, 3, 1, 2.473004, 3, 1
-3.315928, 3, 2, 2.461712, 3, 1
-3.295103, 3, 2, 2.450161, 3, 1
-3.274278, 3, 1, 2.444427, 3, 1
-3.263903, 3, 1, 2.433163, 3, 1
-3.253528, 3, 1, 2.422127, 3, 1
-3.243153, 3, 1, 2.41095, 3, 1
-3.232778, 3, 1, 2.400076, 3, 1
-3.222403, 3, 2, 2.394556, 3, 1
-3.201578, 3, 1, 2.383585, 3, 1
-3.191203, 3, 1, 2.372522, 3, 1
-3.180828, 3, 2, 2.360752, 3, 1
-3.160003, 3, 2, 2.348988, 3, 1
-3.139178, 3, 1, 2.342744, 3, 1
-3.128803, 3, 1, 2.3303, 3, 1
-3.118428, 3, 2, 2.317583, 3, 1
-3.097603, 3, 2, 2.304594, 2, 1
-3.076778, 3, 2, 2.291718, 2, 1
-3.055954, 3, 2, 2.285176, 2, 1
-3.035129, 3, 2, 2.272535, 2, 1
-3.014304, 3, 2, 2.259951, 2, 1
-2.993479, 2, 2, 2.253389, 2, 1
-2.972654, 2, 2, 2.240869, 2, 1
-2.951829, 2, 1, 2.228025, 2, 1
-2.941454, 2, 2, 2.215134, 2, 1
-2.920629, 2, 2, 2.201933, 2, 1
-2.899804, 2, 1, 2.195194, 2, 1
-2.889429, 2, 2, 2.181708, 2, 1
-2.868604, 2, 1, 2.167542, 2, 1
-2.858229, 2, 1, 2.152808, 2, 1
-2.847854, 2, 2, 2.137031, 2, 1
-2.827029, 2, 2, 2.128487, 2, 1
-2.806204, 2, 1, 2.111054, 2, 1
-2.795829, 2, 1, 2.092349, 2, 1
-2.785454, 2, 2, 2.072468, 2, 1
-2.764629, 2, 1, 2.061976, 2, 1
-2.754254, 2, 1, 2.039445, 2, 1
-2.743879, 2, 2, 2.015868, 2, 1
-2.723054, 2, 1, 1.99107, 2, 1
-2.712679, 2, 2, 1.964872, 2, 1
-2.691854, 2, 2, 1.951571, 2, 1
-2.67103, 2, 2, 1.92379, 2, 1
-2.650205, 2, 1, 1.894919, 2, 1
-2.63983, 2, 1, 1.86546, 2, 1
-2.629455, 2, 2, 1.834829, 2, 1
-2.60863, 2, 2, 1.819868, 2, 1
-2.587805, 2, 2, 1.789105, 2, 1
-2.56698, 2, 1, 1.758499, 2, 1
-2.556605, 2, 1, 1.728317, 2, 1
-2.54623, 2, 2, 1.698005, 2, 1
-2.525405, 2, 2, 1.668012, 2, 1
-2.50458, 2, 1, 1.652318, 2, 1
-2.494205, 2, 1, 1.622137, 2, 1
-2.48383, 2, 1, 1.592382, 2, 1
-2.473455, 2, 2, 1.562944, 2, 1
-2.45263, 2, 1, 1.548235, 2, 1
-2.442255, 2, 2, 1.518846, 1, 1
-2.42143, 2, 2, 1.489693, 1, 1
-2.400605, 2, 2, 1.461205, 1, 1
-2.37978, 2, 2, 1.433195, 1, 1
-2.358955, 2, 2, 1.404914, 1, 1
-2.33813, 2, 2, 1.39122, 1, 1
-2.317306, 2, 2, 1.363045, 1, 1
-2.296481, 2, 2, 1.334655, 1, 1
-2.275656, 2, 2, 1.307441, 1, 1
-2.254831, 2, 2, 1.279441, 1, 1
-2.234006, 2, 2, 1.266204, 1, 1
-2.213181, 2, 2, 1.238135, 1, 1
-2.192356, 2, 2, 1.21082, 1, 1
-2.171531, 2, 2, 1.183125, 1, 1
-2.150706, 2, 2, 1.154959, 1, 1
-2.129881, 2, 2, 1.140171, 1, 1
-2.109056, 2, 2, 1.111412, 1, 1
-2.088232, 2, 2, 1.083338, 1, 1
-2.067407, 2, 2, 1.054404, 1, 1
-2.046582, 2, 2, 1.025719, 1, 1
-2.025757, 2, 2, 1.011729, 1, 1
-2.004932, 2, 2, 0.983654, 1, 1
-1.984107, 1, 2, 0.9544778, 1, 1
-1.963282, 1, 2, 0.9256887, 1, 1
-1.942457, 1, 2, 0.8972533, 1, 1
-1.921632, 1, 2, 0.8842642, 1, 1
-1.900807, 1, 2, 0.8572178, 1, 1
-1.879982, 1, 2, 0.8303123, 1, 1
-1.859157, 1, 2, 0.8038366, 1, 1
-1.838332, 1, 2, 0.7766104, 1, 1
-1.817507, 1, 2, 0.7628939, 0, 1
-1.796682, 1, 2, 0.7354012, 0, 1
-1.775857, 1, 2, 0.7079158, 0, 1
-1.755032, 1, 2, 0.6809053, 0, 1
-1.734207, 1, 2, 0.6545627, 0, 1
-1.713382, 1, 2, 0.6421132, 0, 1
-1.692557, 1, 2, 0.6164167, 0, 1
-1.671731, 1, 2, 0.5916305, 0, 1
-1.650906, 1, 2, 0.5669494, 0, 1
-1.630081, 1, 2, 0.5425391, 0, 1
-1.609256, 1, 2, 0.5306933, 0, 1
-1.588431, 1, 2, 0.5040472, 0, 1
-1.567606, 1, 2, 0.4787352, 0, 1
-1.546781, 1, 2, 0.4539411, 0, 1
-1.525956, 1, 2, 0.4298973, 0, 1
-1.505131, 1, 2, 0.4183891, 0, 1
-1.484306, 1, 2, 0.3959627, 0, 1
-1.463481, 1, 2, 0.3749976, 0, 1
-1.442656, 1, 2, 0.3549662, 0, 1
-1.421831, 1, 2, 0.335299, 0, 1
-1.401006, 1, 2, 0.326442, 0, 1
-1.380181, 1, 2, 0.3075488, 0, 1
-1.359356, 1, 2, 0.2898846, 0, 1
-1.338531, 1, 2, 0.2725794, 0, 1
-1.317706, 1, 2, 0.255517, 0, 1
-1.296881, 1, 2, 0.2475846, 0, 1
-1.276056, 1, 2, 0.2311707, 0, 1
-1.255231, 1, 2, 0.2144413, 0, 1
-1.234406, 1, 2, 0.1980147, 0, 1
-1.213581, 1, 2, 0.1817791, 0, 1
-1.192756, 1, 2, 0.1738167, 0, 1
-1.171931, 1, 2, 0.1576357, 0, 1
-1.151106, 1, 2, 0.1407576, 0, 1
-1.130281, 1, 2, 0.1237047, 0, 1
-1.109456, 1, 2, 0.1063232, 0, 1
-1.088631, 1, 2, 0.09714198, 0, 1
-1.067806, 1, 2, 0.07904768, 0, 1
-1.046981, 1, 2, 0.06043887, 0, 1
-1.026156, 1, 2, 0.04198837, 0, 1
-1.005331, 1, 2, 0.02347136, 0, 1
-0.9845055, 0, 2, 0.01410866, 0, 1
-0.9636805, 0, 2, -0.004697323, 0, 1
-0.9428555, 0, 2, -0.02359962, 0, 1
-0.9220304, 0, 2, -0.04261208, 0, 1
-0.9012054, 0, 2, -0.06140804, 0, 1
-0.8803804, 0, 2, -0.07043743, 0, 1
-0.8595554, 0, 2, -0.08895874, 0, 1
-0.8387303, 0, 2, -0.1075315, 0, 1
-0.8179053, 0, 2, -0.1265345, 0, 1
-0.7970803, 0, 2, -0.1450539, 0, 1
-0.7762552, 0, 2, -0.1543698, 0, 1
-0.7554302, 0, 2, -0.1725626, 0, 1
-0.7346052, 0, 2, -0.1911869, 0, 1
-0.7137802, 0, 2, -0.2093539, 0, 1
-0.6929551, 0, 2, -0.2267609, 0, 1
-0.6721301, 0, 2, -0.2355704, 0, 1
-0.6513051, 0, 2, -0.2522345, 0, 1
-0.6304801, 0, 2, -0.2681122, 0, 1
-0.609655, 0, 2, -0.2828698, 0, 1
-0.58883, 0, 2, -0.2965455, 0, 1
-0.568005, 0, 2, -0.3030701, 0, 1
-0.5471799, 0, 2, -0.3152194, 0, 1
-0.5263549, 0, 2, -0.3262916, 0, 1
-0.5055299, 0, 2, -0.3361731, 0, 1
-0.4847049, 0, 2, -0.3410082, 0, 1
-0.4638799, 0, 2, -0.3498144, 0, 1
-0.4430549, 0, 2, -0.3584828, 0, 1
-0.4222299, 0, 2, -0.3664703, 0, 1
-0.4014049, 0, 2, -0.3742428, 0, 1
-0.3805799, 0, 2, -0.3808169, 0, 1
-0.3597549, 0, 2, -0.3838024, 0, 1
-0.3389299, 0, 2, -0.3887796, 0, 1
-0.3181049, 0, 2, -0.3935385, 0, 1
-0.2972799, 0, 2, -0.3979573, 0, 1
-0.2764549, 0, 2, -0.3996592, 0, 1
-0.2556299, 0, 2, -0.4029136, 0, 1
-0.2348049, 0, 2, -0.405705, 0, 1
-0.2139799, 0, 2, -0.4079971, 0, 1
-0.1931549, 0, 2, -0.4091148, 0, 1
-0.1723299, 0, 2, -0.4101138, 0, 1
-0.1515049, 0, 2, -0.4106846, 0, 1
-0.1306799, 0, 2, -0.4118814, 0, 1
-0.1098549, 0, 2, -0.414484, 0, 1
-0.08902991, 0, 2, -0.4166727, 0, 1
-0.06820491, 0, 2, -0.4184113, 0, 1
-0.04737991, 0, 2, -0.4190674, 0, 1
-0.02655491, 0, 2, -0.4204392, 0, 1
-0.005729914, 0, 2, -0.4217215, 0, 1
0.01509508, 0, 2, -0.4230304, 0, 1
0.03592008, 0, 2, -0.4246278, 0, 1
0.05674508, 0, 2, -0.4252577, 0, 1
0.07757008, 0, 2, -0.427536, 0, 1
0.09839508, 0, 2, -0.4299707, 0, 1
0.1192201, 0, 2, -0.432744, 0, 1
0.1400451, 0, 2, -0.435288, 0, 1
0.1608701, 0, 2, -0.4365435, 0, 1
0.1816951, 0, 2, -0.4395752, 0, 1
0.2025201, 0, 2, -0.4418697, 0, 1
0.2233451, 0, 2, -0.4452319, 0, 1
0.2441701, 0, 2, -0.4488778, 0, 1
0.2649951, 0, 2, -0.451026, 0, 1
0.2858201, 0, 2, -0.4548779, 0, 1
0.3066451, 0, 2, -0.4590631, 0, 1
0.3274701, 0, 2, -0.4629412, 0, 1
0.3482951, 0, 2, -0.4670238, 0, 1
0.3691201, 0, 2, -0.4693174, 0, 1
0.3899451, 0, 2, -0.4740562, 0, 1
0.4107701, 0, 2, -0.478301, 0, 1
0.4315951, 0, 2, -0.4824343, 0, 1
0.4524201, 0, 2, -0.4866533, 0, 1
0.4732451, 0, 2, -0.4891758, 0, 1
0.4940701, 0, 2, -0.4939184, 0, 1
0.5148951, 0, 2, -0.4979277, 0, 1
0.5357201, 0, 2, -0.5021987, 0, 1
0.5565451, 0, 2, -0.5063505, 0, 1
0.5773702, 0, 2, -0.508338, 0, 1
0.5981952, 0, 2, -0.5123, 0, 1
0.6190202, 0, 2, -0.5163898, 0, 1
0.6398453, 0, 2, -0.5210052, 0, 1
0.6606703, 0, 2, -0.5230365, 0, 1
0.6814953, 0, 2, -0.5276775, 0, 1
0.7023203, 0, 2, -0.5318627, 0, 1
0.7231454, 0, 2, -0.534101, 0, 1
0.7439704, 0, 2, -0.5387154, 0, 1
0.7647954, 0, 2, -0.5433102, 0, 1
0.7856205, 0, 2, -0.5476928, 0, 1
0.8064455, 0, 2, -0.5498505, 0, 1
0.8272705, 0, 2, -0.5541649, 0, 1
0.8480955, 0, 2, -0.5582132, 0, 1
0.8689206, 0, 2, -0.5623093, 0, 1
0.8897456, 0, 2, -0.5645981, 0, 1
0.9105706, 0, 2, -0.5687065, 0, 1
0.9313956, 0, 2, -0.572691, 0, 1
0.9522207, 0, 2, -0.5767221, 0, 1
0.9730457, 0, 2, -0.5803652, 0, 1
0.9938707, 0, 2, -0.5820336, 0, 1
1.014696, -1, 2, -0.5855837, 0, 1
1.035521, -1, 2, -0.5890508, 0, 1
1.056346, -1, 2, -0.5929561, 0, 1
1.077171, -1, 2, -0.5962915, 0, 1
1.097996, -1, 2, -0.5979872, 0, 1
1.118821, -1, 2, -0.6013379, 0, 1
1.139646, -1, 2, -0.6044292, 0, 1
1.160471, -1, 2, -0.607718, 0, 1
1.181296, -1, 2, -0.6105027, 0, 1
1.202121, -1, 2, -0.6121922, 0, 1
1.222946, -1, 2, -0.6146007, 0, 1
1.243771, -1, 2, -0.6171885, 0, 1
1.264596, -1, 2, -0.6193142, 0, 1
1.285421, -1, 2, -0.6211162, 0, 1
1.306246, -1, 2, -0.6218977, 0, 1
1.327071, -1, 2, -0.6229239, 0, 1
1.347896, -1, 2, -0.6241417, 0, 1
1.368721, -1, 2, -0.6249323, 0, 1
1.389546, -1, 2, -0.6255455, 0, 1
1.410371, -1, 2, -0.6257401, 0, 1
1.431196, -1, 2, -0.6259918, 0, 1
1.452021, -1, 2, -0.6262512, 0, 1
1.472846, -1, 2, -0.6262169, 0, 1
1.493671, -1, 2, -0.626092, 0, 1
1.514496, -1, 2, -0.6262608, 0, 1
1.535321, -1, 2, -0.6263514, 0, 1
1.556147, -1, 2, -0.626863, 0, 1
1.576972, -1, 2, -0.6271067, 0, 1
1.597797, -1, 2, -0.6272392, 0, 1
1.618622, -1, 2, -0.6272788, 0, 1
1.639447, -1, 2, -0.6270523, 0, 1
1.660272, -1, 2, -0.6272287, 0, 1
1.681097, -1, 2, -0.6272068, 0, 1
1.701922, -1, 2, -0.626802, 0, 1
1.722747, -1, 2, -0.6265936, 0, 1
1.743572, -1, 2, -0.6264353, 0, 1
1.764397, -1, 2, -0.6259899, 0, 1
1.785222, -1, 2, -0.6257982, 0, 1
1.806047, -1, 2, -0.6251001, 0, 1
1.826872, -1, 2, -0.6246271, 0, 1
1.847697, -1, 2, -0.6241918, 0, 1
1.868522, -1, 2, -0.623539, 0, 1
1.889347, -1, 2, -0.6229458, 0, 1
1.910172, -1, 2, -0.6221094, 0, 1
1.930997, -1, 2, -0.6214151, 0, 1
1.951822, -1, 2, -0.6210365, 0, 1
1.972647, -1, 2, -0.620575, 0, 1
1.993472, -1, 2, -0.6199875, 0, 1
2.014297, -2, 2, -0.619205, 0, 1
2.035122, -2, 2, -0.6188736, 0, 1
2.055947, -2, 2, -0.617918, 0, 1
2.076772, -2, 2, -0.6171551, 0, 1
2.097597, -2, 2, -0.6162782, 0, 1
2.118422, -2, 2, -0.6150479, 0, 1
2.139246, -2, 2, -0.6145048, 0, 1
2.160071, -2, 2, -0.6131501, 0, 1
2.180896, -2, 2, -0.6115236, 0, 1
2.201721, -2, 2, -0.6097755, 0, 1
2.222546, -2, 2, -0.6075072, 0, 1
2.243371, -2, 2, -0.6065841, 0, 1
2.264196, -2, 2, -0.6041951, 0, 1
2.285021, -2, 2, -0.6017284, 0, 1
2.305846, -2, 2, -0.5991068, 0, 1
2.326671, -2, 2, -0.5968075, 0, 1
2.347496, -2, 2, -0.5956631, 0, 1
2.36832, -2, 2, -0.593986, 0, 1
2.389145, -2, 2, -0.5925364, 0, 1
2.40997, -2, 2, -0.5918865, 0, 1
2.430795, -2, 2, -0.5917788, 0, 1
2.45162, -2, 2, -0.5920911, 0, 1
2.472445, -2, 2, -0.5926809, 0, 1
2.49327, -2, 2, -0.5931664, 0, 1
2.514095, -2, 2, -0.5938039, 0, 1
2.53492, -2, 2, -0.5942507, 0, 1
2.555745, -2, 2, -0.5945635, 0, 1
2.57657, -2, 2, -0.5945201, 0, 1
2.597394, -2, 2, -0.5941906, 0, 1
2.618219, -2, 2, -0.5938463, 0, 1
2.639044, -2, 2, -0.593379, 0, 1
2.659869, -2, 2, -0.5928717, 0, 1
2.680694, -2, 2, -0.5925713, 0, 1
2.701519, -2, 2, -0.5920825, 0, 1
2.722344, -2, 2, -0.591712, 0, 1
