car_pos_meter , car_pos_cell, car_speed, ped_pos_meter, ped_pos_cell, ped_speed
-25.625, 25, 2, 3.988253, 25, 1
-25.52088, 25, 2, 3.9822, 25, 1
-25.41675, 25, 2, 3.969546, 25, 1
-25.31263, 25, 2, 3.957228, 25, 1
-23.12601, 23, 2, 3.759831, 24, 1
-20.5229, 20, 2, 3.537624, 22, 1
-17.91978, 17, 2, 3.263031, 21, 1
-15.31667, 15, 2, 3.025448, 19, 1
-12.71356, 12, 2, 2.90817, 18, 1
-10.11044, 10, 2, 2.869719, 18, 1
-7.507314, 7, 2, 2.86928, 18, 1
-4.904185, 4, 2, 2.871755, 18, 1
-2.301057, 2, 2, 2.873456, 18, 1
0.3020675, 0, 2, 2.834044, 18, 1
2.905193, -2, 2, 2.856214, 18, 1
5.404196, -5, 2, 2.902656, 18, 1
8.007325, -8, 2, 2.912648, 18, 1
10.61045, -10, 2, 2.846222, 18, 1
13.21356, -13, 2, 2.690877, 17, 1
15.81668, -15, 2, 2.462505, 16, 1
18.41979, -18, 2, 2.201815, 14, 1
21.02291, -21, 2, 1.993821, 12, 1
23.62602, -23, 2, 1.634589, 10, 1
26.22913, -26, 2, 1.279718, 8, 1
28.83225, -28, 2, 0.9783809, 6, 1
31.43536, -31, 2, 0.7286098, 4, 1
34.03848, -34, 2, 0.4902515, 3, 1
36.64159, -36, 2, 0.2180352, 1, 1
39.2447, -39, 2, -0.03872871, 0, 1
41.84786, -41, 2, -0.2680445, -1, 1
44.45103, -44, 2, -0.4262476, -2, 1
47.0542, -47, 2, -0.4838266, -3, 1
49.65737, -49, 2, -0.5086746, -3, 1
52.26055, -52, 2, -0.5175781, -3, 1
54.86372, -54, 2, -0.5160127, -3, 1
