timestamp_sec,frame_id,game_played,yielding,player1discrete,player2discrete,player1yieldprob,player2yieldprob,player1_pose_x,player1_pose_y,player1_pose_z,player1_pose_orient_x,player1_pose_orient_y,player1_pose_orient_z,player1_pose_orient_w,player2_pose_x,player2_pose_y,player2_pose_z,player2_pose_orient_x,player2_pose_orient_y,player2_pose_orient_z,player2_pose_orient_w
1717767256.1373389,map,True,True,6,6,0.5957621508060097,0.5957621508060098,2.0555272102355957,-2.527820110321045,0.0,0.0,0.0,0.024836659781401045,0.9996915281881804,3.801629410652166,-8.298172959348701,0.6747760183199465,0.0,0.0,0.0,1.0
1717767256.1880932,map,True,True,6,6,0.5957621508060097,0.5957621508060098,2.0555272102355957,-2.527820110321045,0.0,0.0,0.0,0.024836659781401045,0.9996915281881804,3.801629410652166,-8.298172959348701,0.6747760183199465,0.0,0.0,0.0,1.0
1717767256.2812815,map,True,False,6,6,0.5957621508060097,0.5957621508060098,2.0530292987823486,-2.528275966644287,0.0,0.0,0.0,0.02506388581765524,0.9996858490777939,3.801629410652166,-8.298172959348701,0.6747760183199465,0.0,0.0,0.0,1.0
1717767256.2857065,map,True,True,6,6,0.5957621508060097,0.5957621508060098,2.0530292987823486,-2.528275966644287,0.0,0.0,0.0,0.02506388581765524,0.9996858490777939,3.801629410652166,-8.298172959348701,0.6747760183199465,0.0,0.0,0.0,1.0
1717767256.2895958,map,True,False,6,6,0.5957621508060097,0.5957621508060098,2.0530292987823486,-2.528275966644287,0.0,0.0,0.0,0.02506388581765524,0.9996858490777939,3.801629410652166,-8.298172959348701,0.6747760183199465,0.0,0.0,0.0,1.0
1717767256.3477833,map,True,False,6,6,0.5957621508060097,0.5957621508060098,2.0530292987823486,-2.528275966644287,0.0,0.0,0.0,0.02506388581765524,0.9996858490777939,3.9220713472767406,-8.245565043949941,0.6567641413793432,0.0,0.0,0.0,1.0
1717767256.3594034,map,True,True,6,6,0.5957621508060097,0.5957621508060098,2.0530292987823486,-2.528275966644287,0.0,0.0,0.0,0.02506388581765524,0.9996858490777939,3.92167467450734,-8.199141252780471,0.6569028801200401,0.0,0.0,0.0,1.0
1717767256.3692524,map,True,False,6,6,0.5957621508060097,0.5957621508060098,2.0530292987823486,-2.528275966644287,0.0,0.0,0.0,0.02506388581765524,0.9996858490777939,3.92167467450734,-8.199141252780471,0.6569028801200401,0.0,0.0,0.0,1.0
1717767256.382675,map,True,True,6,6,0.5957621508060097,0.5957621508060098,2.0530292987823486,-2.528275966644287,0.0,0.0,0.0,0.02506388581765524,0.9996858490777939,3.92167467450734,-8.199141252780471,0.6569028801200401,0.0,0.0,0.0,1.0
1717767256.3863492,map,True,True,6,6,0.5957621508060097,0.5957621508060098,2.0530292987823486,-2.528275966644287,0.0,0.0,0.0,0.02506388581765524,0.9996858490777939,3.92167467450734,-8.199141252780471,0.6569028801200401,0.0,0.0,0.0,1.0
1717767256.4874668,map,True,True,6,6,0.5957621508060097,0.5957621508060098,2.0530292987823486,-2.528275966644287,0.0,0.0,0.0,0.02506388581765524,0.9996858490777939,3.92167467450734,-8.199141252780471,0.6569028801200401,0.0,0.0,0.0,1.0
1717767256.5360775,map,True,False,6,6,0.5957621508060097,0.5957621508060098,2.0530292987823486,-2.528275966644287,0.0,0.0,0.0,0.02506388581765524,0.9996858490777939,3.92167467450734,-8.199141252780471,0.6569028801200401,0.0,0.0,0.0,1.0
1717767256.9031267,map,True,True,6,6,0.5957621508060097,0.5957621508060098,2.0530292987823486,-2.528275966644287,0.0,0.0,0.0,0.02506388581765524,0.9996858490777939,3.92167467450734,-8.199141252780471,0.6569028801200401,0.0,0.0,0.0,1.0
1717767256.9032986,map,True,False,6,6,0.5957621508060097,0.5957621508060098,2.0530292987823486,-2.528275966644287,0.0,0.0,0.0,0.02506388581765524,0.9996858490777939,3.92167467450734,-8.199141252780471,0.6569028801200401,0.0,0.0,0.0,1.0
1717767256.903333,map,True,False,6,6,0.5957621508060097,0.5957621508060098,2.0530292987823486,-2.528275966644287,0.0,0.0,0.0,0.02506388581765524,0.9996858490777939,3.982751840385055,-7.923889028598227,0.6823966157931756,0.0,0.0,0.0,1.0
1717767256.9033556,map,True,True,6,6,0.5957621508060097,0.5957621508060098,2.0530292987823486,-2.528275966644287,0.0,0.0,0.0,0.02506388581765524,0.9996858490777939,3.982751840385055,-7.923889028598227,0.6823966157931756,0.0,0.0,0.0,1.0
1717767257.037299,map,True,False,6,5,0.0,0.0,2.053258180618286,-2.5291635990142822,0.0,0.0,0.0,0.025050602083062843,0.9996861770063055,3.981248421654871,-7.728527186308477,0.6661100944846479,0.0,0.0,0.0,1.0
1717767257.0878277,map,True,False,6,5,0.0,0.0,2.053258180618286,-2.5291635990142822,0.0,0.0,0.0,0.025050602083062843,0.9996861770063055,3.981248421654871,-7.728527186308477,0.6661100944846479,0.0,0.0,0.0,1.0
1717767257.1897986,map,True,False,6,5,0.0,0.0,2.053258180618286,-2.5291635990142822,0.0,0.0,0.0,0.025050602083062843,0.9996861770063055,3.981248421654871,-7.728527186308477,0.6661100944846479,0.0,0.0,0.0,1.0
1717767257.2397668,map,True,False,6,5,0.0,0.0,2.053258180618286,-2.5291635990142822,0.0,0.0,0.0,0.025050602083062843,0.9996861770063055,3.981248421654871,-7.728527186308477,0.6661100944846479,0.0,0.0,0.0,1.0
1717767257.3394399,map,True,False,6,5,0.0,0.0,2.053258180618286,-2.5291635990142822,0.0,0.0,0.0,0.025050602083062843,0.9996861770063055,3.947325750929272,-7.450704096552089,0.6821658492981251,0.0,0.0,0.0,1.0
1717767257.3903022,map,True,False,6,5,0.0,0.0,2.053258180618286,-2.5291635990142822,0.0,0.0,0.0,0.025050602083062843,0.9996861770063055,3.947325750929272,-7.450704096552089,0.6821658492981251,0.0,0.0,0.0,1.0
1717767257.4405951,map,True,False,6,5,0.0,0.0,2.053258180618286,-2.5291635990142822,0.0,0.0,0.0,0.025050602083062843,0.9996861770063055,3.947325750929272,-7.450704096552089,0.6821658492981251,0.0,0.0,0.0,1.0
1717767257.4917789,map,True,False,6,5,0.0,0.0,2.053258180618286,-2.5291635990142822,0.0,0.0,0.0,0.025050602083062843,0.9996861770063055,3.947325750929272,-7.450704096552089,0.6821658492981251,0.0,0.0,0.0,1.0
1717767257.5422463,map,True,False,6,5,0.0,0.0,2.053258180618286,-2.5291635990142822,0.0,0.0,0.0,0.025050602083062843,0.9996861770063055,3.947325750929272,-7.450704096552089,0.6821658492981251,0.0,0.0,0.0,1.0
1717767257.5922458,map,True,False,6,5,0.0,0.0,2.053258180618286,-2.5291635990142822,0.0,0.0,0.0,0.025050602083062843,0.9996861770063055,3.947325750929272,-7.450704096552089,0.6821658492981251,0.0,0.0,0.0,1.0
1717767257.643975,map,True,False,6,5,0.0,0.0,2.0774588584899902,-2.535745620727539,0.0,0.0,0.0,0.025049276206129664,0.9996862217238214,3.9933574611034137,-7.534972589439565,0.6744912394684213,0.0,0.0,0.0,1.0
1717767257.7421181,map,True,False,6,5,0.0,0.0,2.0774588584899902,-2.535745620727539,0.0,0.0,0.0,0.025049276206129664,0.9996862217238214,4.061259352996249,-7.376129032599671,0.6590715582533035,0.0,0.0,0.0,1.0
1717767257.8417587,map,True,False,6,5,0.0,0.0,2.0774588584899902,-2.535745620727539,0.0,0.0,0.0,0.025049276206129664,0.9996862217238214,4.061259352996249,-7.376129032599671,0.6590715582533035,0.0,0.0,0.0,1.0
1717767258.2178342,map,True,False,6,5,0.0,0.0,2.0774588584899902,-2.535745620727539,0.0,0.0,0.0,0.025049276206129664,0.9996862217238214,4.087027347979754,-7.1985507816969445,0.6596611490153894,0.0,0.0,0.0,1.0
1717767258.2178829,map,True,False,6,5,0.0,0.0,2.0774588584899902,-2.535745620727539,0.0,0.0,0.0,0.025049276206129664,0.9996862217238214,4.102050921057448,-7.2323529844441286,0.6594665573314675,0.0,0.0,0.0,1.0
1717767258.2179182,map,True,False,6,5,0.0,0.0,2.0774588584899902,-2.535745620727539,0.0,0.0,0.0,0.025049276206129664,0.9996862217238214,4.102050921057448,-7.2323529844441286,0.6594665573314675,0.0,0.0,0.0,1.0
1717767258.2179496,map,True,False,6,5,0.0,0.0,2.0774588584899902,-2.535745620727539,0.0,0.0,0.0,0.025049276206129664,0.9996862217238214,4.102050921057448,-7.2323529844441286,0.6594665573314675,0.0,0.0,0.0,1.0
1717767258.2431483,map,True,False,6,5,0.0,0.0,2.0774588584899902,-2.535745620727539,0.0,0.0,0.0,0.025049276206129664,0.9996862217238214,4.102050921057448,-7.2323529844441286,0.6594665573314675,0.0,0.0,0.0,1.0
1717767258.2940083,map,True,False,5,5,0.612995793784914,0.612995793784914,2.175032138824463,-2.5570995807647705,0.0,0.0,0.0,0.024588367337408937,0.9996976544364405,4.102050921057448,-7.2323529844441286,0.6594665573314675,0.0,0.0,0.0,1.0
1717767258.3434854,map,True,False,5,5,0.612995793784914,0.612995793784914,2.175032138824463,-2.5570995807647705,0.0,0.0,0.0,0.024588367337408937,0.9996976544364405,4.195617736054793,-6.907920208956738,0.646551109159486,0.0,0.0,0.0,1.0
1717767258.4449494,map,True,True,5,5,0.612995793784914,0.612995793784914,2.175032138824463,-2.5570995807647705,0.0,0.0,0.0,0.024588367337408937,0.9996976544364405,4.195617736054793,-6.907920208956738,0.646551109159486,0.0,0.0,0.0,1.0
1717767258.495262,map,True,True,5,5,0.612995793784914,0.612995793784914,2.175032138824463,-2.5570995807647705,0.0,0.0,0.0,0.024588367337408937,0.9996976544364405,4.195617736054793,-6.907920208956738,0.646551109159486,0.0,0.0,0.0,1.0
1717767258.5943012,map,True,False,5,5,0.612995793784914,0.612995793784914,2.175032138824463,-2.5570995807647705,0.0,0.0,0.0,0.024588367337408937,0.9996976544364405,4.195617736054793,-6.907920208956738,0.646551109159486,0.0,0.0,0.0,1.0
1717767258.6452053,map,True,False,5,4,0.0,0.0,2.175032138824463,-2.5570995807647705,0.0,0.0,0.0,0.024588367337408937,0.9996976544364405,4.226679532974499,-6.696414790486242,0.6282862071592938,0.0,0.0,0.0,1.0
1717767258.696078,map,True,False,5,4,0.0,0.0,2.175032138824463,-2.5570995807647705,0.0,0.0,0.0,0.024588367337408937,0.9996976544364405,4.231678640800275,-6.666198018500447,0.6416380989027526,0.0,0.0,0.0,1.0
1717767258.794564,map,True,False,5,4,0.0,0.0,2.175032138824463,-2.5570995807647705,0.0,0.0,0.0,0.024588367337408937,0.9996976544364405,4.221194092168814,-6.626393092352854,0.6549973943686589,0.0,0.0,0.0,1.0
1717767259.0472,map,True,False,5,4,0.0,0.0,2.2898783683776855,-2.579864263534546,0.0,0.0,0.0,0.024004370605558337,0.9997118594369861,4.403215584905055,-6.555499865044457,0.628418056465756,0.0,0.0,0.0,1.0
1717767259.1470737,map,True,False,5,4,0.0,0.0,2.2898783683776855,-2.579864263534546,0.0,0.0,0.0,0.024004370605558337,0.9997118594369861,4.317284612648304,-6.2508711714697025,0.6323058589433712,0.0,0.0,0.0,1.0
1717767259.2465303,map,True,False,5,4,0.0,0.0,2.2898783683776855,-2.579864263534546,0.0,0.0,0.0,0.024004370605558337,0.9997118594369861,4.317284612648304,-6.2508711714697025,0.6323058589433712,0.0,0.0,0.0,1.0
1717767259.2971616,map,True,False,5,4,0.0,0.0,2.2898783683776855,-2.579864263534546,0.0,0.0,0.0,0.024004370605558337,0.9997118594369861,4.317284612648304,-6.2508711714697025,0.6323058589433712,0.0,0.0,0.0,1.0
1717767259.396658,map,True,False,5,4,0.0,0.0,2.2898783683776855,-2.579864263534546,0.0,0.0,0.0,0.024004370605558337,0.9997118594369861,4.39166471316965,-6.035841797035158,0.6286920731663359,0.0,0.0,0.0,1.0
1717767259.446876,map,True,False,5,4,0.0,0.0,2.383047103881836,-2.5960447788238525,0.0,0.0,0.0,0.023501705262998943,0.9997237986359977,4.39166471316965,-6.035841797035158,0.6286920731663359,0.0,0.0,0.0,1.0
1717767259.4972205,map,True,False,5,4,0.0,0.0,2.383047103881836,-2.5960447788238525,0.0,0.0,0.0,0.023501705262998943,0.9997237986359977,4.39166471316965,-6.035841797035158,0.6286920731663359,0.0,0.0,0.0,1.0
1717767259.5482302,map,True,False,5,4,0.0,0.0,2.383047103881836,-2.5960447788238525,0.0,0.0,0.0,0.023501705262998943,0.9997237986359977,4.39166471316965,-6.035841797035158,0.6286920731663359,0.0,0.0,0.0,1.0
1717767259.6480546,map,True,False,5,4,0.0,0.0,2.383047103881836,-2.5960447788238525,0.0,0.0,0.0,0.023501705262998943,0.9997237986359977,4.39166471316965,-6.035841797035158,0.6286920731663359,0.0,0.0,0.0,1.0
1717767259.698995,map,True,False,5,4,0.0,0.0,2.383047103881836,-2.5960447788238525,0.0,0.0,0.0,0.023501705262998943,0.9997237986359977,4.433807239206565,-5.935946323100909,0.6133705166424865,0.0,0.0,0.0,1.0
1717767259.797415,map,True,False,5,4,0.0,0.0,2.383047103881836,-2.5960447788238525,0.0,0.0,0.0,0.023501705262998943,0.9997237986359977,4.427561685243266,-5.917308117923987,0.6192606949248518,0.0,0.0,0.0,1.0
1717767259.8476741,map,True,False,5,4,0.0,0.0,2.383047103881836,-2.5960447788238525,0.0,0.0,0.0,0.023501705262998943,0.9997237986359977,4.427561685243266,-5.917308117923987,0.6192606949248518,0.0,0.0,0.0,1.0
1717767260.0483267,map,True,False,5,3,0.0,0.0,2.4733922481536865,-2.617229700088501,0.0,0.0,0.0,0.023145285878270003,0.999732115746554,4.389553194999532,-5.572618258446527,0.6305371172749523,0.0,0.0,0.0,1.0
1717767260.1018302,map,True,False,5,3,0.0,0.0,2.4733922481536865,-2.617229700088501,0.0,0.0,0.0,0.023145285878270003,0.999732115746554,4.389553194999532,-5.572618258446527,0.6305371172749523,0.0,0.0,0.0,1.0
1717767260.1985393,map,True,False,5,3,0.0,0.0,2.4733922481536865,-2.617229700088501,0.0,0.0,0.0,0.023145285878270003,0.999732115746554,4.389553194999532,-5.572618258446527,0.6305371172749523,0.0,0.0,0.0,1.0
1717767260.3002186,map,True,False,5,3,0.0,0.0,2.4733922481536865,-2.617229700088501,0.0,0.0,0.0,0.023145285878270003,0.999732115746554,4.389553194999532,-5.572618258446527,0.6305371172749523,0.0,0.0,0.0,1.0
1717767260.3982027,map,True,False,5,3,0.0,0.0,2.4733922481536865,-2.617229700088501,0.0,0.0,0.0,0.023145285878270003,0.999732115746554,4.552024275772451,-5.420380820161109,0.6215677082722033,0.0,0.0,0.0,1.0
1717767260.44962,map,True,False,5,3,0.0,0.0,2.4733922481536865,-2.617229700088501,0.0,0.0,0.0,0.023145285878270003,0.999732115746554,4.552024275772451,-5.420380820161109,0.6215677082722033,0.0,0.0,0.0,1.0
1717767260.5008643,map,True,False,5,3,0.0,0.0,2.4733922481536865,-2.617229700088501,0.0,0.0,0.0,0.023145285878270003,0.999732115746554,4.552024275772451,-5.420380820161109,0.6215677082722033,0.0,0.0,0.0,1.0
1717767260.5494719,map,True,False,5,3,0.0,0.0,2.4733922481536865,-2.617229700088501,0.0,0.0,0.0,0.023145285878270003,0.999732115746554,4.552024275772451,-5.420380820161109,0.6215677082722033,0.0,0.0,0.0,1.0
1717767260.599576,map,True,False,5,3,0.0,0.0,2.4733922481536865,-2.617229700088501,0.0,0.0,0.0,0.023145285878270003,0.999732115746554,4.552024275772451,-5.420380820161109,0.6215677082722033,0.0,0.0,0.0,1.0
1717767260.6498652,map,True,False,4,3,0.0,0.0,2.5685653686523438,-2.639901638031006,0.0,0.0,0.0,0.023149987489257114,0.9997319965053144,4.552024275772451,-5.420380820161109,0.6215677082722033,0.0,0.0,0.0,1.0
1717767260.702058,map,True,False,4,3,0.0,0.0,2.5685653686523438,-2.639901638031006,0.0,0.0,0.0,0.023149987489257114,0.9997319965053144,4.546322193223828,-5.108124351922648,0.6404467452107727,0.0,0.0,0.0,1.0
1717767260.8016746,map,True,False,4,3,0.0,0.0,2.5685653686523438,-2.639901638031006,0.0,0.0,0.0,0.023149987489257114,0.9997319965053144,4.546322193223828,-5.108124351922648,0.6404467452107727,0.0,0.0,0.0,1.0
1717767260.850955,map,True,False,4,3,0.0,0.0,2.5685653686523438,-2.639901638031006,0.0,0.0,0.0,0.023149987489257114,0.9997319965053144,4.546322193223828,-5.108124351922648,0.6404467452107727,0.0,0.0,0.0,1.0
1717767261.0527382,map,True,False,4,3,0.0,0.0,2.5685653686523438,-2.639901638031006,0.0,0.0,0.0,0.023149987489257114,0.9997319965053144,4.565141472668314,-4.838502521918238,0.5886333702095803,0.0,0.0,0.0,1.0
1717767261.1526427,map,True,False,4,3,0.0,0.0,2.5685653686523438,-2.639901638031006,0.0,0.0,0.0,0.023149987489257114,0.9997319965053144,4.565141472668314,-4.838502521918238,0.5886333702095803,0.0,0.0,0.0,1.0
1717767261.203168,map,True,False,4,3,0.0,0.0,2.5685653686523438,-2.639901638031006,0.0,0.0,0.0,0.023149987489257114,0.9997319965053144,4.565141472668314,-4.838502521918238,0.5886333702095803,0.0,0.0,0.0,1.0
1717767261.2536185,map,True,False,4,3,0.0,0.0,2.6798789501190186,-2.6651346683502197,0.0,0.0,0.0,0.022998220867098174,0.9997354992107979,4.565141472668314,-4.838502521918238,0.5886333702095803,0.0,0.0,0.0,1.0
1717767261.3037143,map,True,False,4,3,0.0,0.0,2.6798789501190186,-2.6651346683502197,0.0,0.0,0.0,0.022998220867098174,0.9997354992107979,4.565141472668314,-4.838502521918238,0.5886333702095803,0.0,0.0,0.0,1.0
1717767261.404968,map,True,False,4,2,0.0,0.0,2.6798789501190186,-2.6651346683502197,0.0,0.0,0.0,0.022998220867098174,0.9997354992107979,4.611136357083589,-4.557041107347401,0.6576338506150332,0.0,0.0,0.0,1.0
1717767261.453785,map,True,False,4,2,0.0,0.0,2.6798789501190186,-2.6651346683502197,0.0,0.0,0.0,0.022998220867098174,0.9997354992107979,4.611136357083589,-4.557041107347401,0.6576338506150332,0.0,0.0,0.0,1.0
1717767261.553307,map,True,False,4,2,0.0,0.0,2.6798789501190186,-2.6651346683502197,0.0,0.0,0.0,0.022998220867098174,0.9997354992107979,4.611136357083589,-4.557041107347401,0.6576338506150332,0.0,0.0,0.0,1.0
1717767261.6532485,map,True,False,4,2,0.0,0.0,2.6798789501190186,-2.6651346683502197,0.0,0.0,0.0,0.022998220867098174,0.9997354992107979,4.611136357083589,-4.557041107347401,0.6576338506150332,0.0,0.0,0.0,1.0
1717767261.7048945,map,True,False,4,2,0.0,0.0,2.6798789501190186,-2.6651346683502197,0.0,0.0,0.0,0.022998220867098174,0.9997354992107979,4.680587083160449,-4.309481891980473,0.6751606435309399,0.0,0.0,0.0,1.0
1717767261.8054981,map,True,False,4,2,0.0,0.0,2.6798789501190186,-2.6651346683502197,0.0,0.0,0.0,0.022998220867098174,0.9997354992107979,4.70489593835748,-4.2792208377647984,0.6814363783114168,0.0,0.0,0.0,1.0
1717767261.8534718,map,True,False,4,2,0.0,0.0,2.79190731048584,-2.6888790130615234,0.0,0.0,0.0,0.022680349844578267,0.9997427728748972,4.70489593835748,-4.2792208377647984,0.6814363783114168,0.0,0.0,0.0,1.0
1717767262.0558324,map,True,False,4,2,0.0,0.0,2.79190731048584,-2.6888790130615234,0.0,0.0,0.0,0.022680349844578267,0.9997427728748972,4.712927231466407,-4.074505284829864,0.6838238823825555,0.0,0.0,0.0,1.0
1717767262.1068952,map,True,False,4,2,0.0,0.0,2.79190731048584,-2.6888790130615234,0.0,0.0,0.0,0.022680349844578267,0.9997427728748972,4.712927231466407,-4.074505284829864,0.6838238823825555,0.0,0.0,0.0,1.0
1717767262.207428,map,True,False,4,2,0.0,0.0,2.79190731048584,-2.6888790130615234,0.0,0.0,0.0,0.022680349844578267,0.9997427728748972,4.712927231466407,-4.074505284829864,0.6838238823825555,0.0,0.0,0.0,1.0
1717767262.2558153,map,True,False,4,2,0.0,0.0,2.79190731048584,-2.6888790130615234,0.0,0.0,0.0,0.022680349844578267,0.9997427728748972,4.712927231466407,-4.074505284829864,0.6838238823825555,0.0,0.0,0.0,1.0
1717767262.3070183,map,True,False,4,2,0.0,0.0,2.819397449493408,-2.698211669921875,0.0,0.0,0.0,0.022858758792075964,0.999738703802937,4.712927231466407,-4.074505284829864,0.6838238823825555,0.0,0.0,0.0,1.0
1717767262.357186,map,True,False,4,2,0.0,0.0,2.819397449493408,-2.698211669921875,0.0,0.0,0.0,0.022858758792075964,0.999738703802937,4.705915263425908,-3.9635951548671184,0.6834771929980616,0.0,0.0,0.0,1.0
1717767262.4101605,map,True,False,4,2,0.0,0.0,2.819397449493408,-2.698211669921875,0.0,0.0,0.0,0.022858758792075964,0.999738703802937,4.7126459409165244,-3.8738516808000547,0.683121701396955,0.0,0.0,0.0,1.0
1717767262.4650807,map,True,False,4,2,0.0,0.0,2.819397449493408,-2.698211669921875,0.0,0.0,0.0,0.022858758792075964,0.999738703802937,4.7126459409165244,-3.8738516808000547,0.683121701396955,0.0,0.0,0.0,1.0
1717767262.5147567,map,True,False,4,2,0.0,0.0,2.819397449493408,-2.698211669921875,0.0,0.0,0.0,0.022858758792075964,0.999738703802937,4.7126459409165244,-3.8738516808000547,0.683121701396955,0.0,0.0,0.0,1.0
1717767262.614888,map,True,False,4,2,0.0,0.0,2.819397449493408,-2.698211669921875,0.0,0.0,0.0,0.022858758792075964,0.999738703802937,4.7126459409165244,-3.8738516808000547,0.683121701396955,0.0,0.0,0.0,1.0
1717767262.714558,map,True,False,4,2,0.0,0.0,2.819397449493408,-2.698211669921875,0.0,0.0,0.0,0.022858758792075964,0.999738703802937,4.7543526692624845,-3.702292787923933,0.682442579069181,0.0,0.0,0.0,1.0
1717767262.8141577,map,True,False,4,2,0.0,0.0,2.819397449493408,-2.698211669921875,0.0,0.0,0.0,0.022858758792075964,0.999738703802937,4.7543526692624845,-3.702292787923933,0.682442579069181,0.0,0.0,0.0,1.0
1717767263.0178916,map,True,False,3,2,0.0,0.0,2.976962089538574,-2.782714366912842,0.0,0.0,0.0,0.022782069802671355,0.9997404476929479,4.779222134341246,-3.6778322246674886,0.6823424315718669,0.0,0.0,0.0,1.0
1717767263.0652702,map,True,False,3,2,0.0,0.0,2.976962089538574,-2.782714366912842,0.0,0.0,0.0,0.022782069802671355,0.9997404476929479,4.792223775751342,-3.6602450550812238,0.6801983490300205,0.0,0.0,0.0,1.0
1717767263.114884,map,True,False,3,2,0.0,0.0,2.976962089538574,-2.782714366912842,0.0,0.0,0.0,0.022782069802671355,0.9997404476929479,4.792223775751342,-3.6602450550812238,0.6801983490300205,0.0,0.0,0.0,1.0
1717767263.214473,map,True,False,3,2,0.0,0.0,2.976962089538574,-2.782714366912842,0.0,0.0,0.0,0.022782069802671355,0.9997404476929479,4.792223775751342,-3.6602450550812238,0.6801983490300205,0.0,0.0,0.0,1.0
1717767263.3148997,map,True,False,3,2,0.0,0.0,3.0556702613830566,-2.7941160202026367,0.0,0.0,0.0,0.022948748703953924,0.9997366469031167,4.792223775751342,-3.6602450550812238,0.6801983490300205,0.0,0.0,0.0,1.0
1717767263.3667066,map,True,False,3,2,0.0,0.0,3.0556702613830566,-2.7941160202026367,0.0,0.0,0.0,0.022948748703953924,0.9997366469031167,4.8132600466209166,-3.697032567626467,0.6802408921031493,0.0,0.0,0.0,1.0
1717767263.4155347,map,True,False,3,2,0.0,0.0,3.0556702613830566,-2.7941160202026367,0.0,0.0,0.0,0.022948748703953924,0.9997366469031167,4.798488980606145,-3.682636476001778,0.6802731657611805,0.0,0.0,0.0,1.0
1717767263.465735,map,True,False,3,2,0.0,0.0,3.0556702613830566,-2.7941160202026367,0.0,0.0,0.0,0.022948748703953924,0.9997366469031167,4.798488980606145,-3.682636476001778,0.6802731657611805,0.0,0.0,0.0,1.0
1717767263.5156815,map,True,False,3,2,0.0,0.0,3.0556702613830566,-2.7941160202026367,0.0,0.0,0.0,0.022948748703953924,0.9997366469031167,4.798488980606145,-3.682636476001778,0.6802731657611805,0.0,0.0,0.0,1.0
1717767263.6154625,map,True,False,3,2,0.0,0.0,3.0556702613830566,-2.7941160202026367,0.0,0.0,0.0,0.022948748703953924,0.9997366469031167,4.798488980606145,-3.682636476001778,0.6802731657611805,0.0,0.0,0.0,1.0
1717767263.6655777,map,True,False,3,2,0.0,0.0,3.0556702613830566,-2.7941160202026367,0.0,0.0,0.0,0.022948748703953924,0.9997366469031167,4.798488980606145,-3.682636476001778,0.6802731657611805,0.0,0.0,0.0,1.0
1717767263.717227,map,True,False,3,2,0.0,0.0,3.0556702613830566,-2.7941160202026367,0.0,0.0,0.0,0.022948748703953924,0.9997366469031167,4.796590437491143,-3.667140877163283,0.6803602766591469,0.0,0.0,0.0,1.0
1717767263.8152153,map,True,False,3,2,0.0,0.0,3.0556702613830566,-2.7941160202026367,0.0,0.0,0.0,0.022948748703953924,0.9997366469031167,4.777037779941059,-3.661977486417782,0.6804021959698473,0.0,0.0,0.0,1.0
1717767264.0709078,map,True,False,3,2,0.0,0.0,3.1386349201202393,-2.8118131160736084,0.0,0.0,0.0,0.022514242243291134,0.9997465289266225,4.802961657886649,-3.66254537716303,0.6804627539744303,0.0,0.0,0.0,1.0
1717767264.1185412,map,True,False,3,2,0.0,0.0,3.1386349201202393,-2.8118131160736084,0.0,0.0,0.0,0.022514242243291134,0.9997465289266225,4.7516400030007775,-3.659554293239653,0.6805988544812296,0.0,0.0,0.0,1.0
1717767264.1699486,map,True,False,3,2,0.0,0.0,3.1386349201202393,-2.8118131160736084,0.0,0.0,0.0,0.022514242243291134,0.9997465289266225,4.7516400030007775,-3.659554293239653,0.6805988544812296,0.0,0.0,0.0,1.0
1717767264.2685509,map,True,False,3,2,0.0,0.0,3.1386349201202393,-2.8118131160736084,0.0,0.0,0.0,0.022514242243291134,0.9997465289266225,4.7516400030007775,-3.659554293239653,0.6805988544812296,0.0,0.0,0.0,1.0
1717767264.3697197,map,True,False,3,2,0.0,0.0,3.248094320297241,-2.8260695934295654,0.0,0.0,0.0,0.022547743333186723,0.9997457687744361,4.7516400030007775,-3.659554293239653,0.6805988544812296,0.0,0.0,0.0,1.0
1717767264.4187574,map,True,False,3,2,0.0,0.0,3.248094320297241,-2.8260695934295654,0.0,0.0,0.0,0.022547743333186723,0.9997457687744361,4.748732782876331,-3.6636373912012243,0.6824947087183304,0.0,0.0,0.0,1.0
1717767264.5188572,map,True,False,3,2,0.0,0.0,3.248094320297241,-2.8260695934295654,0.0,0.0,0.0,0.022547743333186723,0.9997457687744361,4.739995389195141,-3.6663256536645155,0.6825217188491444,0.0,0.0,0.0,1.0
1717767264.6192048,map,True,False,3,2,0.0,0.0,3.248094320297241,-2.8260695934295654,0.0,0.0,0.0,0.022547743333186723,0.9997457687744361,4.739995389195141,-3.6663256536645155,0.6825217188491444,0.0,0.0,0.0,1.0
1717767264.6705837,map,True,False,3,2,0.0,0.0,3.248094320297241,-2.8260695934295654,0.0,0.0,0.0,0.022547743333186723,0.9997457687744361,4.750809286190829,-3.6608815334058935,0.6808676515259204,0.0,0.0,0.0,1.0
1717767264.7207618,map,True,False,3,2,0.0,0.0,3.248094320297241,-2.8260695934295654,0.0,0.0,0.0,0.022547743333186723,0.9997457687744361,4.750809286190829,-3.6608815334058935,0.6808676515259204,0.0,0.0,0.0,1.0
1717767264.820906,map,True,False,3,2,0.0,0.0,3.248094320297241,-2.8260695934295654,0.0,0.0,0.0,0.022547743333186723,0.9997457687744361,4.750809286190829,-3.6608815334058935,0.6808676515259204,0.0,0.0,0.0,1.0
1717767265.0218897,map,True,False,3,2,0.0,0.0,3.312239170074463,-2.842625141143799,0.0,0.0,0.0,0.023594152577625805,0.9997216224630335,4.733048927735248,-3.6465919087096985,0.6810470978464623,0.0,0.0,0.0,1.0
1717767265.0729365,map,True,False,3,2,0.0,0.0,3.312239170074463,-2.842625141143799,0.0,0.0,0.0,0.023594152577625805,0.9997216224630335,4.733048927735248,-3.6465919087096985,0.6810470978464623,0.0,0.0,0.0,1.0
1717767265.1231344,map,True,False,3,2,0.0,0.0,3.312239170074463,-2.842625141143799,0.0,0.0,0.0,0.023594152577625805,0.9997216224630335,4.733048927735248,-3.6465919087096985,0.6810470978464623,0.0,0.0,0.0,1.0
1717767265.2226188,map,True,False,3,2,0.0,0.0,3.312239170074463,-2.842625141143799,0.0,0.0,0.0,0.023594152577625805,0.9997216224630335,4.733048927735248,-3.6465919087096985,0.6810470978464623,0.0,0.0,0.0,1.0
1717767265.2866728,map,True,False,3,2,0.0,0.0,3.312239170074463,-2.842625141143799,0.0,0.0,0.0,0.023594152577625805,0.9997216224630335,4.733048927735248,-3.6465919087096985,0.6810470978464623,0.0,0.0,0.0,1.0
1717767265.3268192,map,True,False,3,2,0.0,0.0,3.312239170074463,-2.842625141143799,0.0,0.0,0.0,0.023594152577625805,0.9997216224630335,4.731008677544197,-3.628579945169762,0.6811771016448047,0.0,0.0,0.0,1.0
1717767265.4256632,map,True,False,2,2,0.49874686716791977,0.49874686716791977,3.4138734340667725,-2.8562233448028564,0.0,0.0,0.0,0.022535436639264744,0.9997460519684555,4.736027367027744,-3.624915637419796,0.6811803465376343,0.0,0.0,0.0,1.0
1717767265.4765396,map,True,False,2,2,0.49874686716791977,0.49874686716791977,3.4138734340667725,-2.8562233448028564,0.0,0.0,0.0,0.022535436639264744,0.9997460519684555,4.736027367027744,-3.624915637419796,0.6811803465376343,0.0,0.0,0.0,1.0
1717767265.5760577,map,True,True,2,2,0.49874686716791977,0.49874686716791977,3.4138734340667725,-2.8562233448028564,0.0,0.0,0.0,0.022535436639264744,0.9997460519684555,4.736027367027744,-3.624915637419796,0.6811803465376343,0.0,0.0,0.0,1.0
1717767265.6262462,map,True,False,2,2,0.49874686716791977,0.49874686716791977,3.4138734340667725,-2.8562233448028564,0.0,0.0,0.0,0.022535436639264744,0.9997460519684555,4.736027367027744,-3.624915637419796,0.6811803465376343,0.0,0.0,0.0,1.0
1717767265.6762166,map,True,False,2,2,0.49874686716791977,0.49874686716791977,3.4138734340667725,-2.8562233448028564,0.0,0.0,0.0,0.022535436639264744,0.9997460519684555,4.751843615987174,-3.6379366346026076,0.682767941522982,0.0,0.0,0.0,1.0
1717767265.7270985,map,True,True,2,2,0.49874686716791977,0.49874686716791977,3.4138734340667725,-2.8562233448028564,0.0,0.0,0.0,0.022535436639264744,0.9997460519684555,4.751843615987174,-3.6379366346026076,0.682767941522982,0.0,0.0,0.0,1.0
1717767265.8265982,map,True,False,2,2,0.49874686716791977,0.49874686716791977,3.5223851203918457,-2.8536856174468994,0.0,0.0,0.0,0.02077539149627259,0.9997841631896651,4.751843615987174,-3.6379366346026076,0.682767941522982,0.0,0.0,0.0,1.0
1717767266.027019,map,True,True,2,2,0.49874686716791977,0.49874686716791977,3.5223851203918457,-2.8536856174468994,0.0,0.0,0.0,0.02077539149627259,0.9997841631896651,4.765905574383343,-3.6640287250288264,0.6828861684916757,0.0,0.0,0.0,1.0
1717767266.0774543,map,True,False,2,2,0.49874686716791977,0.49874686716791977,3.5223851203918457,-2.8536856174468994,0.0,0.0,0.0,0.02077539149627259,0.9997841631896651,4.765905574383343,-3.6640287250288264,0.6828861684916757,0.0,0.0,0.0,1.0
1717767266.1284113,map,True,True,2,2,0.49874686716791977,0.49874686716791977,3.5223851203918457,-2.8536856174468994,0.0,0.0,0.0,0.02077539149627259,0.9997841631896651,4.765905574383343,-3.6640287250288264,0.6828861684916757,0.0,0.0,0.0,1.0
1717767266.2286851,map,True,True,2,2,0.49874686716791977,0.49874686716791977,3.5889086723327637,-2.864386558532715,0.0,0.0,0.0,0.021082560870928982,0.9997777393820638,4.765905574383343,-3.6640287250288264,0.6828861684916757,0.0,0.0,0.0,1.0
1717767266.3314543,map,True,False,2,2,0.49874686716791977,0.49874686716791977,3.5889086723327637,-2.864386558532715,0.0,0.0,0.0,0.021082560870928982,0.9997777393820638,4.7896184707930285,-3.6678235365694745,0.6829206533999095,0.0,0.0,0.0,1.0
1717767266.3811398,map,True,True,2,2,0.49874686716791977,0.49874686716791977,3.5889086723327637,-2.864386558532715,0.0,0.0,0.0,0.021082560870928982,0.9997777393820638,4.783009422251421,-3.666775027107996,0.6829332701358821,0.0,0.0,0.0,1.0
1717767266.4802182,map,True,True,2,2,0.49874686716791977,0.49874686716791977,3.5889086723327637,-2.864386558532715,0.0,0.0,0.0,0.021082560870928982,0.9997777393820638,4.783009422251421,-3.666775027107996,0.6829332701358821,0.0,0.0,0.0,1.0
1717767266.5811198,map,True,False,2,2,0.49874686716791977,0.49874686716791977,3.6528284549713135,-2.8874588012695312,0.0,0.0,0.0,0.022081105648459064,0.9997561872805476,4.783009422251421,-3.666775027107996,0.6829332701358821,0.0,0.0,0.0,1.0
1717767266.6321087,map,True,True,2,2,0.49874686716791977,0.49874686716791977,3.6528284549713135,-2.8874588012695312,0.0,0.0,0.0,0.022081105648459064,0.9997561872805476,4.783009422251421,-3.666775027107996,0.6829332701358821,0.0,0.0,0.0,1.0
1717767266.732497,map,True,False,2,2,0.49874686716791977,0.49874686716791977,3.6528284549713135,-2.8874588012695312,0.0,0.0,0.0,0.022081105648459064,0.9997561872805476,4.804757349371441,-3.6494141689228474,0.6828692448353665,0.0,0.0,0.0,1.0
1717767266.782067,map,True,True,2,2,0.49874686716791977,0.49874686716791977,3.6528284549713135,-2.8874588012695312,0.0,0.0,0.0,0.022081105648459064,0.9997561872805476,4.804757349371441,-3.6494141689228474,0.6828692448353665,0.0,0.0,0.0,1.0
1717767266.831992,map,True,False,2,2,0.49874686716791977,0.49874686716791977,3.6528284549713135,-2.8874588012695312,0.0,0.0,0.0,0.022081105648459064,0.9997561872805476,4.804757349371441,-3.6494141689228474,0.6828692448353665,0.0,0.0,0.0,1.0
1717767267.0336998,map,True,False,2,2,0.49874686716791977,0.49874686716791977,3.699498176574707,-2.9010205268859863,0.0,0.0,0.0,0.02238087877528017,0.9997495099100112,4.83624401499414,-3.6512788373574234,0.6828529601618799,0.0,0.0,0.0,1.0
1717767267.0846732,map,True,False,2,2,0.49874686716791977,0.49874686716791977,3.699498176574707,-2.9010205268859863,0.0,0.0,0.0,0.02238087877528017,0.9997495099100112,4.83624401499414,-3.6512788373574234,0.6828529601618799,0.0,0.0,0.0,1.0
1717767267.1341934,map,True,True,2,2,0.49874686716791977,0.49874686716791977,3.699498176574707,-2.9010205268859863,0.0,0.0,0.0,0.02238087877528017,0.9997495099100112,4.83624401499414,-3.6512788373574234,0.6828529601618799,0.0,0.0,0.0,1.0
1717767267.184879,map,True,False,2,2,0.49874686716791977,0.49874686716791977,3.699498176574707,-2.9010205268859863,0.0,0.0,0.0,0.02238087877528017,0.9997495099100112,4.83624401499414,-3.6512788373574234,0.6828529601618799,0.0,0.0,0.0,1.0
1717767267.2843592,map,True,False,2,2,0.49874686716791977,0.49874686716791977,3.699498176574707,-2.9010205268859863,0.0,0.0,0.0,0.02238087877528017,0.9997495099100112,4.83624401499414,-3.6512788373574234,0.6828529601618799,0.0,0.0,0.0,1.0
1717767267.3355343,map,True,True,2,2,0.49874686716791977,0.49874686716791977,3.742147207260132,-2.926603317260742,0.0,0.0,0.0,0.021027908110157867,0.9997788870258932,4.8386779729199745,-3.6367431584069725,0.682808097558727,0.0,0.0,0.0,1.0
1717767267.385555,map,True,False,2,2,0.49874686716791977,0.49874686716791977,3.742147207260132,-2.926603317260742,0.0,0.0,0.0,0.021027908110157867,0.9997788870258932,4.835713830193965,-3.635688782529696,0.6828097461160543,0.0,0.0,0.0,1.0
1717767267.4360142,map,True,True,2,2,0.49874686716791977,0.49874686716791977,3.742147207260132,-2.926603317260742,0.0,0.0,0.0,0.021027908110157867,0.9997788870258932,4.835713830193965,-3.635688782529696,0.6828097461160543,0.0,0.0,0.0,1.0
1717767267.4859736,map,True,True,2,2,0.49874686716791977,0.49874686716791977,3.742147207260132,-2.926603317260742,0.0,0.0,0.0,0.021027908110157867,0.9997788870258932,4.835713830193965,-3.635688782529696,0.6828097461160543,0.0,0.0,0.0,1.0
1717767267.536858,map,True,True,2,2,0.49874686716791977,0.49874686716791977,3.742147207260132,-2.926603317260742,0.0,0.0,0.0,0.021027908110157867,0.9997788870258932,4.835713830193965,-3.635688782529696,0.6828097461160543,0.0,0.0,0.0,1.0
1717767267.5867963,map,True,True,2,2,0.49874686716791977,0.49874686716791977,3.742147207260132,-2.926603317260742,0.0,0.0,0.0,0.021027908110157867,0.9997788870258932,4.835713830193965,-3.635688782529696,0.6828097461160543,0.0,0.0,0.0,1.0
1717767267.6862605,map,True,True,2,2,0.49874686716791977,0.49874686716791977,3.742147207260132,-2.926603317260742,0.0,0.0,0.0,0.021027908110157867,0.9997788870258932,4.851874554753282,-3.632823040029189,0.6827892262469675,0.0,0.0,0.0,1.0
1717767267.7862659,map,True,True,2,2,0.49874686716791977,0.49874686716791977,3.742147207260132,-2.926603317260742,0.0,0.0,0.0,0.021027908110157867,0.9997788870258932,4.851874554753282,-3.632823040029189,0.6827892262469675,0.0,0.0,0.0,1.0
1717767267.9905763,map,True,True,2,2,0.49874686716791977,0.49874686716791977,3.7802894115448,-2.9393270015716553,0.0,0.0,0.0,0.02208750123538858,0.9997560382325847,4.876553159223548,-3.6296386656691775,0.6827487406869661,0.0,0.0,0.0,1.0
1717767268.041863,map,True,True,2,2,0.49874686716791977,0.49874686716791977,3.7802894115448,-2.9393270015716553,0.0,0.0,0.0,0.02208750123538858,0.9997560382325847,4.872216918178615,-3.627093452780092,0.6815683042062995,0.0,0.0,0.0,1.0
1717767268.0892918,map,True,False,1,2,0.0,0.0,3.802229881286621,-2.9375271797180176,0.0,0.0,0.0,0.02220124724039237,0.9997535193186519,4.872216918178615,-3.627093452780092,0.6815683042062995,0.0,0.0,0.0,1.0
1717767268.1892111,map,True,False,1,2,0.0,0.0,3.802229881286621,-2.9375271797180176,0.0,0.0,0.0,0.02220124724039237,0.9997535193186519,4.872216918178615,-3.627093452780092,0.6815683042062995,0.0,0.0,0.0,1.0
1717767268.2399611,map,True,False,1,2,0.0,0.0,3.802229881286621,-2.9375271797180176,0.0,0.0,0.0,0.02220124724039237,0.9997535193186519,4.872216918178615,-3.627093452780092,0.6815683042062995,0.0,0.0,0.0,1.0
1717767268.3394582,map,True,False,1,2,0.0,0.0,3.8454365730285645,-2.9389142990112305,0.0,0.0,0.0,0.021801553730797302,0.9997623131325959,4.912908519119189,-3.6430511482908576,0.6815848748985166,0.0,0.0,0.0,1.0
1717767268.389803,map,True,False,1,2,0.0,0.0,3.8454365730285645,-2.9389142990112305,0.0,0.0,0.0,0.021801553730797302,0.9997623131325959,4.91180602190086,-3.6473445364909374,0.6815985096561059,0.0,0.0,0.0,1.0
1717767268.489052,map,True,False,1,2,0.0,0.0,3.8454365730285645,-2.9389142990112305,0.0,0.0,0.0,0.021801553730797302,0.9997623131325959,4.91180602190086,-3.6473445364909374,0.6815985096561059,0.0,0.0,0.0,1.0
1717767268.5895529,map,True,False,1,2,0.0,0.0,3.8454365730285645,-2.9389142990112305,0.0,0.0,0.0,0.021801553730797302,0.9997623131325959,4.91180602190086,-3.6473445364909374,0.6815985096561059,0.0,0.0,0.0,1.0
1717767268.6182597,map,True,False,1,2,0.0,0.0,3.8454365730285645,-2.9389142990112305,0.0,0.0,0.0,0.021801553730797302,0.9997623131325959,4.91180602190086,-3.6473445364909374,0.6815985096561059,0.0,0.0,0.0,1.0
1717767268.6212418,map,True,False,1,2,0.0,0.0,3.8454365730285645,-2.9389142990112305,0.0,0.0,0.0,0.021801553730797302,0.9997623131325959,4.91180602190086,-3.6473445364909374,0.6815985096561059,0.0,0.0,0.0,1.0
1717767268.6254172,map,True,False,1,2,0.0,0.0,3.8454365730285645,-2.9389142990112305,0.0,0.0,0.0,0.021801553730797302,0.9997623131325959,4.91180602190086,-3.6473445364909374,0.6815985096561059,0.0,0.0,0.0,1.0
1717767268.6300845,map,True,False,1,2,0.0,0.0,3.8454365730285645,-2.9389142990112305,0.0,0.0,0.0,0.021801553730797302,0.9997623131325959,4.91180602190086,-3.6473445364909374,0.6815985096561059,0.0,0.0,0.0,1.0
1717767268.6331902,map,True,False,1,2,0.0,0.0,3.8454365730285645,-2.9389142990112305,0.0,0.0,0.0,0.021801553730797302,0.9997623131325959,4.91180602190086,-3.6473445364909374,0.6815985096561059,0.0,0.0,0.0,1.0
1717767268.6381328,map,True,False,1,2,0.0,0.0,3.8454365730285645,-2.9389142990112305,0.0,0.0,0.0,0.021801553730797302,0.9997623131325959,4.91180602190086,-3.6473445364909374,0.6815985096561059,0.0,0.0,0.0,1.0
1717767268.643185,map,True,False,1,2,0.0,0.0,3.8454365730285645,-2.9389142990112305,0.0,0.0,0.0,0.021801553730797302,0.9997623131325959,4.91180602190086,-3.6473445364909374,0.6815985096561059,0.0,0.0,0.0,1.0
1717767268.6467748,map,True,False,1,2,0.0,0.0,3.8454365730285645,-2.9389142990112305,0.0,0.0,0.0,0.021801553730797302,0.9997623131325959,4.91180602190086,-3.6473445364909374,0.6815985096561059,0.0,0.0,0.0,1.0
1717767268.6652005,map,True,False,1,2,0.0,0.0,3.8454365730285645,-2.9389142990112305,0.0,0.0,0.0,0.021801553730797302,0.9997623131325959,4.923699830737851,-3.6405352008642002,0.6827591661818921,0.0,0.0,0.0,1.0
