car_pos_meter , car_pos_cell, car_speed, ped_pos_meter, ped_pos_cell, ped_speed
-41, 40, 2, 4.145915, 41, 1

-40.8334, 39, 2, 4.145915, 41, 1

-40.6668, 39, 2, 4.146199, 41, 1

-40.5002, 39, 2, 4.146199, 41, 1

-40.3336, 39, 2, 4.146199, 41, 1

-40.167, 39, 2, 4.146199, 41, 1

-40.0004, 39, 2, 4.146199, 41, 1

-39.83381, 38, 2, 4.085654, 40, 2

-39.66721, 38, 2, 4.085654, 40, 1

-39.50061, 38, 2, 4.071013, 40, 1

-39.33401, 38, 2, 4.068216, 40, 1

-39.16741, 38, 2, 4.066769, 40, 1

-39.00081, 38, 2, 4.065343, 40, 1

-38.83421, 37, 2, 4.064117, 40, 1

-38.66761, 37, 2, 4.063453, 40, 1

-38.50101, 37, 2, 4.061975, 40, 1

-38.33441, 37, 2, 4.060477, 40, 1

-38.16781, 37, 2, 4.05866, 40, 1

-38.00121, 37, 2, 4.056427, 40, 1

-37.83461, 36, 2, 4.05501, 40, 1

-37.66801, 36, 2, 4.051597, 40, 1

-37.50142, 36, 2, 4.047592, 40, 1

-37.33482, 36, 2, 4.043222, 40, 1

-37.16822, 36, 2, 4.038589, 40, 1

-37.00162, 36, 2, 4.035798, 40, 1

-36.83502, 35, 2, 4.029492, 40, 1

-36.66842, 35, 2, 4.0225, 40, 1

-36.50182, 35, 2, 4.014562, 40, 1

-36.33522, 35, 2, 4.005713, 40, 1

-36.16862, 35, 2, 4.000777, 40, 1

-36.00202, 35, 2, 3.990248, 39, 1

-35.83542, 34, 2, 3.978853, 39, 1

-35.66882, 34, 2, 3.966676, 39, 1

-35.50222, 34, 2, 3.953681, 39, 1

-35.33562, 34, 2, 3.946745, 39, 1

-35.16903, 34, 2, 3.932578, 39, 1

-35.00243, 34, 2, 3.917154, 39, 1

-34.83583, 33, 2, 3.900427, 39, 1

-34.66923, 33, 2, 3.873176, 38, 2

-34.50263, 33, 2, 3.873176, 38, 1

-34.33603, 33, 2, 3.85385, 38, 1

-34.16943, 33, 2, 3.834027, 38, 1

-34.00283, 33, 2, 3.813045, 38, 1

-33.83623, 32, 2, 3.791134, 37, 1

-33.66963, 32, 2, 3.779728, 37, 1

-33.50303, 32, 2, 3.756345, 37, 2

-33.33643, 32, 2, 3.732076, 37, 2

-33.16983, 32, 2, 3.706122, 37, 2

-33.00323, 32, 2, 3.664814, 36, 2

-32.83664, 31, 2, 3.664814, 36, 1

-32.67004, 31, 2, 3.636055, 36, 2

-32.50344, 31, 2, 3.606985, 36, 2

-32.33684, 31, 2, 3.576969, 35, 2

-32.17024, 31, 2, 3.546988, 35, 2

-32.00364, 31, 2, 3.532109, 35, 1

-31.83704, 30, 2, 3.503292, 35, 2

-31.67044, 30, 2, 3.475752, 34, 2

-31.50384, 30, 2, 3.449596, 34, 2

-31.33724, 30, 2, 3.424895, 34, 2

-31.17064, 30, 2, 3.401492, 34, 2

-31.00404, 30, 2, 3.390177, 33, 1

-30.83744, 29, 2, 3.368234, 33, 1

-30.67085, 29, 2, 3.346695, 33, 1

-30.50425, 29, 2, 3.325083, 33, 1

-30.33765, 29, 2, 3.314418, 33, 1

-30.17105, 29, 2, 3.292454, 32, 1

-30.00445, 29, 2, 3.270206, 32, 2

-29.83785, 28, 2, 3.248314, 32, 1

-29.67125, 28, 2, 3.22563, 32, 2

-29.50465, 28, 2, 3.214263, 32, 1

-29.33805, 28, 2, 3.190888, 31, 2

-29.17145, 28, 2, 3.166979, 31, 2

-29.00485, 28, 2, 3.142311, 31, 2

-28.83825, 27, 2, 3.116599, 31, 2

-28.67165, 27, 2, 3.103059, 31, 1

-28.50505, 27, 2, 3.075695, 30, 2

-28.33846, 27, 2, 3.047266, 30, 2

-28.17186, 27, 2, 3.018086, 30, 2

-28.00526, 27, 2, 2.987779, 29, 2

-27.83866, 26, 2, 2.971982, 29, 1

-27.67206, 26, 2, 2.939439, 29, 2

-27.50546, 26, 2, 2.905355, 29, 2

-27.33886, 26, 2, 2.870286, 28, 2

-27.17226, 26, 2, 2.83412, 28, 2

-27.00566, 26, 2, 2.815378, 28, 1

-26.83906, 25, 2, 2.778245, 27, 2

-26.67246, 25, 2, 2.739642, 27, 2

-26.50586, 25, 2, 2.70156, 27, 2

-26.33926, 25, 2, 2.665672, 26, 2

-26.17266, 25, 2, 2.647716, 26, 1

-26.00607, 25, 2, 2.599188, 25, 2

-25.83947, 24, 2, 2.583692, 25, 1

-25.67287, 24, 2, 2.553233, 25, 2

-25.50627, 24, 2, 2.524011, 25, 2

-25.33967, 24, 2, 2.509361, 25, 1

-25.17307, 24, 2, 2.480851, 24, 2

-25.00647, 24, 2, 2.452476, 24, 2

-24.83987, 23, 2, 2.424272, 24, 2

-24.67327, 23, 2, 2.395736, 23, 2

-24.50667, 23, 2, 2.380797, 23, 1

-24.34007, 23, 2, 2.335018, 23, 2

-24.17347, 23, 2, 2.319276, 23, 1

-24.00687, 23, 2, 2.288533, 22, 2

-23.84027, 22, 2, 2.258135, 22, 2

-23.67368, 22, 2, 2.242909, 22, 1

-23.50708, 22, 2, 2.21247, 22, 2

-23.34048, 22, 2, 2.181929, 21, 2

-23.17388, 22, 2, 2.151364, 21, 2

-23.00728, 22, 2, 2.119837, 21, 2

-22.84068, 21, 2, 2.104002, 21, 1

-22.67408, 21, 2, 2.056296, 20, 2

-22.50748, 21, 2, 2.040569, 20, 1

-22.34088, 21, 2, 2.008002, 20, 2

-22.17428, 21, 2, 1.974644, 19, 2

-22.00768, 21, 2, 1.957967, 19, 1

-21.84108, 20, 2, 1.923677, 19, 2

-21.67448, 20, 2, 1.889902, 18, 2

-21.50788, 20, 2, 1.856917, 18, 2

-21.34129, 20, 2, 1.825612, 18, 2

-21.17469, 20, 2, 1.810326, 18, 1

-21.00809, 20, 2, 1.767099, 17, 2

-20.84149, 19, 2, 1.752733, 17, 1

-20.67489, 19, 2, 1.724138, 17, 2

-20.50829, 19, 2, 1.695032, 16, 2

-20.34169, 19, 2, 1.680203, 16, 1

-20.17509, 19, 2, 1.650235, 16, 2

-20.00849, 19, 2, 1.61917, 16, 2

-19.84189, 18, 2, 1.587213, 15, 2

-19.67529, 18, 2, 1.55439, 15, 2

-19.50869, 18, 2, 1.537554, 15, 1

-19.34209, 18, 2, 1.503729, 15, 2

-19.1755, 18, 2, 1.469135, 14, 2

-19.0089, 18, 2, 1.434318, 14, 2

-18.8423, 17, 2, 1.399029, 13, 2

-18.6757, 17, 2, 1.381547, 13, 1

-18.5091, 17, 2, 1.346163, 13, 2

-18.3425, 17, 2, 1.310731, 13, 2

-18.1759, 17, 2, 1.274965, 12, 2

-18.0093, 17, 2, 1.23825, 12, 2

-17.8427, 16, 2, 1.219559, 12, 1

-17.6761, 16, 2, 1.18232, 11, 2

-17.5095, 16, 2, 1.14509, 11, 2

-17.3429, 16, 2, 1.108685, 11, 2

-17.1763, 16, 2, 1.072247, 10, 2

-17.0097, 16, 2, 1.053777, 10, 1

-16.84311, 15, 2, 1.015392, 10, 2

-16.67651, 15, 2, 0.9788074, 9, 2

-16.50991, 15, 2, 0.9453006, 9, 2

-16.34331, 15, 2, 0.9142861, 9, 2

-16.17671, 15, 2, 0.8986113, 8, 1

-16.01011, 15, 2, 0.8671818, 8, 2

-15.84351, 14, 2, 0.8209257, 8, 2

-15.67691, 14, 2, 0.8056986, 8, 1

-15.51031, 14, 2, 0.7764223, 7, 2

-15.34371, 14, 2, 0.7620111, 7, 1

-15.17711, 14, 2, 0.7333188, 7, 2

-15.01051, 14, 2, 0.7051508, 7, 2

-14.84391, 13, 2, 0.676228, 6, 2

-14.67731, 13, 2, 0.6473455, 6, 2

-14.51071, 13, 2, 0.6328442, 6, 1

-14.34411, 13, 2, 0.6041827, 6, 2

-14.17751, 13, 2, 0.5607586, 5, 2

-14.01091, 13, 2, 0.5462708, 5, 1

-13.84431, 12, 2, 0.516583, 5, 2

-13.6777, 12, 2, 0.5019464, 5, 1

-13.5111, 12, 2, 0.472712, 4, 2

-13.3445, 12, 2, 0.4434257, 4, 2

-13.1779, 12, 2, 0.4137785, 4, 2

-13.0113, 12, 2, 0.3841445, 3, 2

-12.8447, 11, 2, 0.3694191, 3, 1

-12.6781, 11, 2, 0.3388774, 3, 2

-12.5115, 11, 2, 0.3069596, 3, 2

-12.3449, 11, 2, 0.2753839, 2, 2

-12.1783, 11, 2, 0.2602949, 2, 1

-12.0117, 11, 2, 0.2292993, 2, 2

-11.8451, 10, 2, 0.1979041, 1, 2

-11.6785, 10, 2, 0.1694901, 1, 2

-11.5119, 10, 2, 0.1439617, 1, 2

-11.3453, 10, 2, 0.1169658, 1, 2

-11.1787, 10, 2, 0.1031861, 1, 1

-11.0121, 10, 2, 0.07727504, 0, 2

-10.8455, 9, 2, 0.05302978, 0, 2

-10.6789, 9, 2, 0.01633644, 0, 2

-10.5123, 9, 2, 0.0038414, 0, 1

-10.3457, 9, 2, -0.008402348, 0, 1

-10.1791, 9, 2, -0.03329039, 0, 2

-10.0125, 9, 2, -0.05723286, 0, 2

-9.8459, 8, 2, -0.08150148, 0, 2

-9.679299, 8, 2, -0.1057379, -1, 2

-9.512699, 8, 2, -0.1175275, -1, 1

-9.346099, 8, 2, -0.1418509, -1, 2

-9.179499, 8, 2, -0.166239, -1, 2

-9.012898, 8, 2, -0.1912305, -1, 2

-8.846298, 7, 2, -0.2170901, -2, 2

-8.679698, 7, 2, -0.229924, -2, 1

-8.513098, 7, 2, -0.2555821, -2, 2

-8.346498, 7, 2, -0.2806478, -2, 2

-8.179897, 7, 2, -0.3061028, -3, 2

-8.013297, 7, 2, -0.3309429, -3, 2

-7.846697, 6, 2, -0.3435359, -3, 1

-7.680097, 6, 2, -0.3687048, -3, 2

-7.513496, 6, 2, -0.3937941, -3, 2

-7.346896, 6, 2, -0.419554, -4, 2

-7.180296, 6, 2, -0.4570985, -4, 2

-7.013696, 6, 2, -0.4570985, -4, 1

-6.847095, 5, 2, -0.4796958, -4, 2

-6.680495, 5, 2, -0.5008547, -5, 1

-6.513895, 5, 2, -0.5215855, -5, 1

-6.347295, 5, 2, -0.5423083, -5, 1

-6.180695, 5, 2, -0.5524731, -5, 1

-6.014094, 5, 2, -0.5722427, -5, 1

-5.847494, 4, 2, -0.5912385, -5, 1

-5.680894, 4, 2, -0.6103935, -6, 1

-5.514294, 4, 2, -0.6285439, -6, 1

-5.347693, 4, 2, -0.6467433, -6, 1

-5.181093, 4, 2, -0.6557708, -6, 1

-5.014493, 4, 2, -0.6735229, -6, 1

-4.847893, 3, 2, -0.69028, -6, 1

-4.681293, 3, 2, -0.7072186, -7, 1

-4.514692, 3, 2, -0.7244763, -7, 1

-4.348092, 3, 2, -0.7331109, -7, 1

-4.181492, 3, 2, -0.7506275, -7, 1

-4.014892, 3, 2, -0.7681561, -7, 1

-3.848292, 2, 2, -0.7857833, -7, 1

-3.681692, 2, 2, -0.8124156, -8, 2

-3.515092, 2, 2, -0.8124156, -8, 1

-3.348492, 2, 2, -0.8308902, -8, 1

-3.181892, 2, 2, -0.8498855, -8, 1

-3.015292, 2, 2, -0.869154, -8, 1

-2.848692, 1, 2, -0.88866, -8, 1

-2.682092, 1, 2, -0.8986907, -8, 1

-2.515492, 1, 2, -0.9190717, -9, 1

-2.348892, 1, 2, -0.9397388, -9, 1

-2.182292, 1, 2, -0.9606681, -9, 1

-2.015692, 1, 2, -0.9715152, -9, 1

-1.849092, 0, 2, -0.9935236, -9, 2

-1.682492, 0, 2, -1.015606, -10, 2

-1.515892, 0, 2, -1.038533, -10, 2

-1.349292, 0, 2, -1.062607, -10, 2

-1.182692, 0, 2, -1.088087, -10, 2

-1.016092, 0, 2, -1.101263, -11, 1

-0.8494918, -1, 2, -1.128781, -11, 2

-0.6828918, -1, 2, -1.155858, -11, 2

-0.5162919, -1, 2, -1.182724, -11, 2

-0.3496919, -1, 2, -1.195726, -11, 1

-0.1830919, -1, 2, -1.233057, -12, 2

-0.01649189, -1, 2, -1.245249, -12, 1

0.1501081, -1, 2, -1.26881, -12, 2

0.3167081, -1, 2, -1.290063, -12, 1

0.4833081, -1, 2, -1.299023, -12, 1

0.6499081, -1, 2, -1.316716, -13, 1

0.8165081, -1, 2, -1.333213, -13, 1

0.983108, -1, 2, -1.346118, -13, 1

1.149708, -2, 2, -1.357501, -13, 1

1.316308, -2, 2, -1.362715, -13, 1

1.482908, -2, 2, -1.372108, -13, 1

1.649508, -2, 2, -1.379565, -13, 1

1.816108, -2, 2, -1.385836, -13, 1

1.982708, -2, 2, -1.391367, -13, 1

2.149308, -3, 2, -1.396624, -13, 1

2.315908, -3, 2, -1.398817, -13, 1

2.482508, -3, 2, -1.403018, -14, 1

2.649108, -3, 2, -1.406363, -14, 1

2.815708, -3, 2, -1.409479, -14, 1

2.982308, -3, 2, -1.411179, -14, 1

3.148908, -4, 2, -1.414265, -14, 1

3.315508, -4, 2, -1.416789, -14, 1

3.482108, -4, 2, -1.41843, -14, 1

3.648708, -4, 2, -1.419981, -14, 1

3.815308, -4, 2, -1.420656, -14, 1

3.981908, -4, 2, -1.420591, -14, 1

4.148508, -5, 2, -1.419119, -14, 1

4.315108, -5, 2, -1.416934, -14, 1

4.481709, -5, 2, -1.414097, -14, 1

4.648309, -5, 2, -1.408903, -14, 1

4.814909, -5, 2, -1.406841, -14, 1

4.981509, -5, 2, -1.399865, -13, 1

5.148109, -6, 2, -1.397843, -13, 1

5.31471, -6, 2, -1.393309, -13, 1

5.48131, -6, 2, -1.38757, -13, 1

5.64791, -6, 2, -1.384505, -13, 1

5.81451, -6, 2, -1.378085, -13, 1

5.981111, -6, 2, -1.37127, -13, 1

6.147711, -7, 2, -1.364888, -13, 1

6.314311, -7, 2, -1.360573, -13, 1

6.480911, -7, 2, -1.354014, -13, 1

6.647511, -7, 2, -1.344593, -13, 1

6.814112, -7, 2, -1.341299, -13, 1

6.980712, -7, 2, -1.335823, -13, 1

7.147312, -8, 2, -1.333293, -13, 1

7.313912, -8, 2, -1.328848, -13, 1

7.480513, -8, 2, -1.324274, -13, 1

7.647113, -8, 2, -1.32041, -13, 1

7.813713, -8, 2, -1.317997, -13, 1

7.980313, -8, 2, -1.31588, -13, 1

8.146914, -9, 2, -1.314112, -13, 1

8.313514, -9, 2, -1.312003, -13, 1

8.480114, -9, 2, -1.311381, -13, 1

8.646714, -9, 2, -1.311534, -13, 1

8.813314, -9, 2, -1.310588, -13, 1

8.979915, -9, 2, -1.311574, -13, 1

9.146515, -10, 2, -1.311569, -13, 1

9.313115, -10, 2, -1.311511, -13, 1

9.479715, -10, 2, -1.312883, -13, 1

9.646316, -10, 2, -1.313172, -13, 1

9.812916, -10, 2, -1.314487, -13, 1

9.979516, -10, 2, -1.31624, -13, 1

10.14612, -11, 2, -1.317433, -13, 1

10.31272, -11, 2, -1.319237, -13, 1

10.47932, -11, 2, -1.323065, -13, 1

10.64592, -11, 2, -1.326084, -13, 1

10.81252, -11, 2, -1.329257, -13, 1

10.97912, -11, 2, -1.33232, -13, 1

11.14572, -12, 2, -1.335475, -13, 1

11.31232, -12, 2, -1.336719, -13, 1

11.47892, -12, 2, -1.339599, -13, 1

11.64552, -12, 2, -1.341951, -13, 1

11.81212, -12, 2, -1.344027, -13, 1

11.97872, -12, 2, -1.346276, -13, 1

12.14532, -13, 2, -1.346824, -13, 1

12.31192, -13, 2, -1.348769, -13, 1

12.47852, -13, 2, -1.350186, -13, 1

12.64512, -13, 2, -1.352155, -13, 1

12.81172, -13, 2, -1.353798, -13, 1

12.97832, -13, 2, -1.354849, -13, 1

13.14492, -14, 2, -1.355401, -13, 1

13.31152, -14, 2, -1.356273, -13, 1

13.47812, -14, 2, -1.356966, -13, 1

13.64472, -14, 2, -1.35684, -13, 1

13.81132, -14, 2, -1.355561, -13, 1

13.97792, -14, 2, -1.354302, -13, 1

14.14452, -15, 2, -1.352257, -13, 1

14.31112, -15, 2, -1.35034, -13, 1

14.47772, -15, 2, -1.347282, -13, 1

14.64432, -15, 2, -1.343055, -13, 1

14.81092, -15, 2, -1.340319, -13, 1

14.97752, -15, 2, -1.334309, -13, 1

15.14412, -16, 2, -1.324424, -13, 1

15.31072, -16, 2, -1.321119, -13, 1

15.47732, -16, 2, -1.31477, -13, 1

15.64392, -16, 2, -1.311863, -13, 1

15.81052, -16, 2, -1.30602, -13, 1

15.97712, -16, 2, -1.301025, -13, 1

16.14372, -17, 2, -1.297193, -12, 1

16.31032, -17, 2, -1.294154, -12, 1

16.47692, -17, 2, -1.292847, -12, 1

16.64352, -17, 2, -1.290349, -12, 1

16.81012, -17, 2, -1.287957, -12, 1

16.97672, -17, 2, -1.286063, -12, 1

17.14332, -18, 2, -1.284021, -12, 1

17.30992, -18, 2, -1.283235, -12, 1

17.47652, -18, 2, -1.281737, -12, 1

17.64312, -18, 2, -1.280902, -12, 1

17.80972, -18, 2, -1.280754, -12, 1

17.97632, -18, 2, -1.281252, -12, 1

18.14292, -19, 2, -1.281559, -12, 1

18.30951, -19, 2, -1.282489, -12, 1

18.47611, -19, 2, -1.283057, -12, 1

18.64271, -19, 2, -1.283146, -12, 1

18.80931, -19, 2, -1.283339, -12, 1

18.97591, -19, 2, -1.282898, -12, 1

19.14251, -20, 2, -1.282867, -12, 1

19.30911, -20, 2, -1.283874, -12, 1

19.47571, -20, 2, -1.285688, -12, 1

19.64231, -20, 2, -1.286691, -12, 1

19.80891, -20, 2, -1.287073, -12, 1

19.97551, -20, 2, -1.287869, -12, 1

20.14211, -21, 2, -1.288037, -12, 1

20.30871, -21, 2, -1.288229, -12, 1

20.47531, -21, 2, -1.28794, -12, 1

20.6419, -21, 2, -1.287609, -12, 1

20.8085, -21, 2, -1.287658, -12, 1

