car_pos_meter , car_pos_cell, car_speed, ped_pos_meter, ped_pos_cell, ped_speed
-25.625, 25, 2, 3.990178, 25, 1
-25.52088, 25, 2, 3.983166, 25, 1
-22.60539, 22, 2, 3.57419, 23, 1
-17.39916, 17, 2, 2.915624, 18, 1
-12.19293, 12, 2, 2.697079, 17, 1
-6.986688, 6, 2, 2.718957, 17, 1
-1.780432, 1, 2, 2.714051, 17, 1
3.425819, -3, 2, 2.650984, 17, 1
8.632075, -8, 2, 2.388889, 15, 1
13.83831, -13, 2, 1.713867, 11, 1
19.04454, -19, 2, 0.8873339, 5, 1
24.25077, -24, 2, 0.06975937, 0, 1
29.457, -29, 2, -0.4922104, -3, 1
