car_pos_meter , car_pos_cell, car_speed, ped_pos_meter, ped_pos_cell, ped_speed
-5.125, 5, 1, 3.932933, 5, 1
-4.865624, 4, 2, 3.855919, 5, 1
-4.345002, 4, 2, 3.543507, 4, 1
-3.824379, 3, 1, 3.03316, 3, 1
-3.565003, 3, 1, 2.511505, 3, 1
-3.305628, 3, 2, 1.959684, 2, 1
-2.785005, 2, 2, 1.403941, 1, 1
-2.264382, 2, 2, 0.8155353, 1, 1
-1.743758, 1, 2, 0.3116524, 0, 1
-1.223132, 1, 2, -0.1499882, 0, 1
-0.7025067, 0, 2, -0.5849562, 0, 1
-0.1818814, 0, 2, -0.9094644, -1, 1
0.3387435, 0, 2, -1.170667, -1, 1
0.859369, 0, 2, -1.37499, -1, 1
1.379995, -1, 2, -1.363251, -1, 1
1.90062, -1, 2, -1.210368, -1, 1
2.421244, -2, 2, -1.18171, -1, 1
