timestamp_sec,frame_id,game_played,yielding,player1discrete,player2discrete,player1yieldprob,player2yieldprob,player1_pose_x,player1_pose_y,player1_pose_z,player1_pose_orient_x,player1_pose_orient_y,player1_pose_orient_z,player1_pose_orient_w,player2_pose_x,player2_pose_y,player2_pose_z,player2_pose_orient_x,player2_pose_orient_y,player2_pose_orient_z,player2_pose_orient_w
1718123054.4711955,map,True,True,3,3,0.6616527499769684,0.6616527499769684,2.1098124980926514,-1.7422245740890503,0.0,0.0,0.0,0.04961231359012844,0.9987685548684441,3.6019763906873647,-4.926145243491401,0.7583841863468406,0.0,0.0,0.0,1.0
1718123054.5204532,map,True,True,3,3,0.6616527499769684,0.6616527499769684,2.1098124980926514,-1.7422245740890503,0.0,0.0,0.0,0.04961231359012844,0.9987685548684441,3.6019763906873647,-4.926145243491401,0.7583841863468406,0.0,0.0,0.0,1.0
1718123054.6198735,map,True,True,3,3,0.6616527499769684,0.6616527499769684,2.1098124980926514,-1.7422245740890503,0.0,0.0,0.0,0.04961231359012844,0.9987685548684441,3.6019763906873647,-4.926145243491401,0.7583841863468406,0.0,0.0,0.0,1.0
1718123054.671061,map,True,True,3,3,0.6616527499769684,0.6616527499769684,2.201573610305786,-1.7690203189849854,0.0,0.0,0.0,0.04976854664335746,0.9987607817610963,3.6019763906873647,-4.926145243491401,0.7583841863468406,0.0,0.0,0.0,1.0
1718123054.7215085,map,True,True,3,3,0.6616527499769684,0.6616527499769684,2.201573610305786,-1.7690203189849854,0.0,0.0,0.0,0.04976854664335746,0.9987607817610963,3.6165893612661466,-4.595474531386637,0.8822694584196729,0.0,0.0,0.0,1.0
1718123054.8218641,map,True,True,3,3,0.6616527499769684,0.6616527499769684,2.201573610305786,-1.7690203189849854,0.0,0.0,0.0,0.04976854664335746,0.9987607817610963,3.6108006405161053,-4.56311139973187,0.8884183640256129,0.0,0.0,0.0,1.0
1718123054.8721395,map,True,False,3,3,0.6616527499769684,0.6616527499769684,2.201573610305786,-1.7690203189849854,0.0,0.0,0.0,0.04976854664335746,0.9987607817610963,3.6108006405161053,-4.56311139973187,0.8884183640256129,0.0,0.0,0.0,1.0
1718123054.9220235,map,True,False,3,3,0.6616527499769684,0.6616527499769684,2.201573610305786,-1.7690203189849854,0.0,0.0,0.0,0.04976854664335746,0.9987607817610963,3.6108006405161053,-4.56311139973187,0.8884183640256129,0.0,0.0,0.0,1.0
1718123054.9724853,map,True,False,3,3,0.6616527499769684,0.6616527499769684,2.201573610305786,-1.7690203189849854,0.0,0.0,0.0,0.04976854664335746,0.9987607817610963,3.6108006405161053,-4.56311139973187,0.8884183640256129,0.0,0.0,0.0,1.0
1718123055.0227764,map,True,True,3,3,0.6616527499769684,0.6616527499769684,2.201573610305786,-1.7690203189849854,0.0,0.0,0.0,0.04976854664335746,0.9987607817610963,3.6108006405161053,-4.56311139973187,0.8884183640256129,0.0,0.0,0.0,1.0
1718123055.1222868,map,True,True,3,3,0.6616527499769684,0.6616527499769684,2.201573610305786,-1.7690203189849854,0.0,0.0,0.0,0.04976854664335746,0.9987607817610963,3.6785912542791688,-4.342086643668232,0.7012581418294735,0.0,0.0,0.0,1.0
1718123055.2224503,map,True,True,3,3,0.6616527499769684,0.6616527499769684,2.201573610305786,-1.7690203189849854,0.0,0.0,0.0,0.04976854664335746,0.9987607817610963,3.6785912542791688,-4.342086643668232,0.7012581418294735,0.0,0.0,0.0,1.0
1718123055.4217827,map,True,False,3,3,0.6616527499769684,0.6616527499769684,2.201573610305786,-1.7690203189849854,0.0,0.0,0.0,0.04976854664335746,0.9987607817610963,3.763460614419013,-4.309453185915473,0.6356160870851265,0.0,0.0,0.0,1.0
1718123055.5214992,map,True,True,3,3,0.6616527499769684,0.6616527499769684,2.3516933917999268,-1.8191277980804443,0.0,0.0,0.0,0.050779841247151375,0.9987098746182744,3.763460614419013,-4.309453185915473,0.6356160870851265,0.0,0.0,0.0,1.0
1718123055.5717225,map,True,True,3,3,0.6616527499769684,0.6616527499769684,2.3516933917999268,-1.8191277980804443,0.0,0.0,0.0,0.050779841247151375,0.9987098746182744,3.763460614419013,-4.309453185915473,0.6356160870851265,0.0,0.0,0.0,1.0
1718123055.6254113,map,True,False,3,3,0.6616527499769684,0.6616527499769684,2.3516933917999268,-1.8191277980804443,0.0,0.0,0.0,0.050779841247151375,0.9987098746182744,3.763460614419013,-4.309453185915473,0.6356160870851265,0.0,0.0,0.0,1.0
1718123055.7213264,map,True,True,3,3,0.6616527499769684,0.6616527499769684,2.3516933917999268,-1.8191277980804443,0.0,0.0,0.0,0.050779841247151375,0.9987098746182744,3.729720030198112,-3.9325766096710764,0.6651791045761903,0.0,0.0,0.0,1.0
1718123055.8219273,map,True,False,3,2,0.0,0.0,2.3516933917999268,-1.8191277980804443,0.0,0.0,0.0,0.050779841247151375,0.9987098746182744,3.7288749519403463,-3.886652919979183,0.6686396826615395,0.0,0.0,0.0,1.0
1718123055.9222298,map,True,False,3,2,0.0,0.0,2.3516933917999268,-1.8191277980804443,0.0,0.0,0.0,0.050779841247151375,0.9987098746182744,3.7288749519403463,-3.886652919979183,0.6686396826615395,0.0,0.0,0.0,1.0
1718123055.9762096,map,True,False,3,2,0.0,0.0,2.3516933917999268,-1.8191277980804443,0.0,0.0,0.0,0.050779841247151375,0.9987098746182744,3.7288749519403463,-3.886652919979183,0.6686396826615395,0.0,0.0,0.0,1.0
1718123056.0740678,map,True,False,3,2,0.0,0.0,2.3744239807128906,-1.8318219184875488,0.0,0.0,0.0,0.05122804569392492,0.9986869864464575,3.741353742087279,-3.6474582227160077,0.6870211149075339,0.0,0.0,0.0,1.0
1718123056.1241407,map,True,False,3,2,0.0,0.0,2.3744239807128906,-1.8318219184875488,0.0,0.0,0.0,0.05122804569392492,0.9986869864464575,3.741353742087279,-3.6474582227160077,0.6870211149075339,0.0,0.0,0.0,1.0
1718123056.2235756,map,True,False,3,2,0.0,0.0,2.3744239807128906,-1.8318219184875488,0.0,0.0,0.0,0.05122804569392492,0.9986869864464575,3.741353742087279,-3.6474582227160077,0.6870211149075339,0.0,0.0,0.0,1.0
1718123056.4734862,map,True,False,3,2,0.0,0.0,2.3744239807128906,-1.8318219184875488,0.0,0.0,0.0,0.05122804569392492,0.9986869864464575,3.731827156759096,-3.372647070470099,0.6834838456947401,0.0,0.0,0.0,1.0
1718123056.5232651,map,True,False,3,2,0.0,0.0,2.3744239807128906,-1.8318219184875488,0.0,0.0,0.0,0.05122804569392492,0.9986869864464575,3.731827156759096,-3.372647070470099,0.6834838456947401,0.0,0.0,0.0,1.0
1718123056.574277,map,True,False,3,2,0.0,0.0,2.3744239807128906,-1.8318219184875488,0.0,0.0,0.0,0.05122804569392492,0.9986869864464575,3.731827156759096,-3.372647070470099,0.6834838456947401,0.0,0.0,0.0,1.0
1718123056.6733308,map,True,False,3,2,0.0,0.0,2.3744239807128906,-1.8318219184875488,0.0,0.0,0.0,0.05122804569392492,0.9986869864464575,3.731827156759096,-3.372647070470099,0.6834838456947401,0.0,0.0,0.0,1.0
1718123056.7244186,map,True,False,3,2,0.0,0.0,2.3744239807128906,-1.8318219184875488,0.0,0.0,0.0,0.05122804569392492,0.9986869864464575,3.731827156759096,-3.372647070470099,0.6834838456947401,0.0,0.0,0.0,1.0
1718123056.7748647,map,True,False,3,2,0.0,0.0,2.3744239807128906,-1.8318219184875488,0.0,0.0,0.0,0.05122804569392492,0.9986869864464575,3.7627516827408454,-3.3036699027750003,0.6856230684965854,0.0,0.0,0.0,1.0
1718123056.8759692,map,True,True,2,2,0.49874686716791977,0.49874686716791977,2.4916329383850098,-1.855544090270996,0.0,0.0,0.0,0.050666800012532744,0.9987156189597561,3.7627516827408454,-3.3036699027750003,0.6856230684965854,0.0,0.0,0.0,1.0
1718123056.9255571,map,True,True,2,2,0.49874686716791977,0.49874686716791977,2.4916329383850098,-1.855544090270996,0.0,0.0,0.0,0.050666800012532744,0.9987156189597561,3.7627516827408454,-3.3036699027750003,0.6856230684965854,0.0,0.0,0.0,1.0
1718123056.9789689,map,True,False,2,2,0.49874686716791977,0.49874686716791977,2.4916329383850098,-1.855544090270996,0.0,0.0,0.0,0.050666800012532744,0.9987156189597561,3.7627516827408454,-3.3036699027750003,0.6856230684965854,0.0,0.0,0.0,1.0
1718123057.028351,map,True,False,2,2,0.49874686716791977,0.49874686716791977,2.4916329383850098,-1.855544090270996,0.0,0.0,0.0,0.050666800012532744,0.9987156189597561,3.7627516827408454,-3.3036699027750003,0.6856230684965854,0.0,0.0,0.0,1.0
1718123057.1281033,map,True,False,2,2,0.49874686716791977,0.49874686716791977,2.4916329383850098,-1.855544090270996,0.0,0.0,0.0,0.050666800012532744,0.9987156189597561,3.798726847621186,-3.198362837819063,0.6852002785261876,0.0,0.0,0.0,1.0
1718123057.179418,map,True,True,2,2,0.49874686716791977,0.49874686716791977,2.4916329383850098,-1.855544090270996,0.0,0.0,0.0,0.050666800012532744,0.9987156189597561,3.798726847621186,-3.198362837819063,0.6852002785261876,0.0,0.0,0.0,1.0
1718123057.229546,map,True,False,2,2,0.49874686716791977,0.49874686716791977,2.4916329383850098,-1.855544090270996,0.0,0.0,0.0,0.050666800012532744,0.9987156189597561,3.798726847621186,-3.198362837819063,0.6852002785261876,0.0,0.0,0.0,1.0
1718123057.4289348,map,True,False,2,2,0.49874686716791977,0.49874686716791977,2.6157515048980713,-1.9085367918014526,0.0,0.0,0.0,0.0525763562640413,0.9986169012134992,3.8354518016136385,-3.1034762960030733,0.6848100703661089,0.0,0.0,0.0,1.0
1718123057.4788215,map,True,True,2,2,0.49874686716791977,0.49874686716791977,2.6157515048980713,-1.9085367918014526,0.0,0.0,0.0,0.0525763562640413,0.9986169012134992,3.835902703808422,-3.0981663696299018,0.684788474328438,0.0,0.0,0.0,1.0
1718123057.5793955,map,True,True,2,2,0.49874686716791977,0.49874686716791977,2.6157515048980713,-1.9085367918014526,0.0,0.0,0.0,0.0525763562640413,0.9986169012134992,3.835902703808422,-3.0981663696299018,0.684788474328438,0.0,0.0,0.0,1.0
1718123057.6293035,map,True,True,2,2,0.49874686716791977,0.49874686716791977,2.6157515048980713,-1.9085367918014526,0.0,0.0,0.0,0.0525763562640413,0.9986169012134992,3.835902703808422,-3.0981663696299018,0.684788474328438,0.0,0.0,0.0,1.0
1718123057.6789503,map,True,False,2,2,0.49874686716791977,0.49874686716791977,2.6157515048980713,-1.9085367918014526,0.0,0.0,0.0,0.0525763562640413,0.9986169012134992,3.835902703808422,-3.0981663696299018,0.684788474328438,0.0,0.0,0.0,1.0
1718123057.7793317,map,True,True,2,2,0.49874686716791977,0.49874686716791977,2.6157515048980713,-1.9085367918014526,0.0,0.0,0.0,0.0525763562640413,0.9986169012134992,3.882511699400193,-3.0352137598601145,0.6845301666859829,0.0,0.0,0.0,1.0
1718123057.8293562,map,True,False,2,2,0.49874686716791977,0.49874686716791977,2.6157515048980713,-1.9085367918014526,0.0,0.0,0.0,0.0525763562640413,0.9986169012134992,3.8800235701488757,-3.020261588547428,0.6844756709292636,0.0,0.0,0.0,1.0
1718123057.8794842,map,True,True,2,2,0.49874686716791977,0.49874686716791977,2.6157515048980713,-1.9085367918014526,0.0,0.0,0.0,0.0525763562640413,0.9986169012134992,3.8490804205809406,-2.91378623939005,0.6841098220788338,0.0,0.0,0.0,1.0
1718123057.9297035,map,True,False,2,2,0.49874686716791977,0.49874686716791977,2.6157515048980713,-1.9085367918014526,0.0,0.0,0.0,0.0525763562640413,0.9986169012134992,3.8490804205809406,-2.91378623939005,0.6841098220788338,0.0,0.0,0.0,1.0
1718123057.980086,map,True,True,2,2,0.49874686716791977,0.49874686716791977,2.6157515048980713,-1.9085367918014526,0.0,0.0,0.0,0.0525763562640413,0.9986169012134992,3.8490804205809406,-2.91378623939005,0.6841098220788338,0.0,0.0,0.0,1.0
1718123058.0318234,map,True,True,2,2,0.49874686716791977,0.49874686716791977,2.6157515048980713,-1.9085367918014526,0.0,0.0,0.0,0.0525763562640413,0.9986169012134992,3.8490804205809406,-2.91378623939005,0.6841098220788338,0.0,0.0,0.0,1.0
1718123058.0823348,map,True,False,2,2,0.49874686716791977,0.49874686716791977,2.6157515048980713,-1.9085367918014526,0.0,0.0,0.0,0.0525763562640413,0.9986169012134992,3.8490804205809406,-2.91378623939005,0.6841098220788338,0.0,0.0,0.0,1.0
1718123058.131757,map,True,False,2,2,0.49874686716791977,0.49874686716791977,2.6961543560028076,-1.922836184501648,0.0,0.0,0.0,0.052811934972913546,0.9986044712771432,3.8490804205809406,-2.91378623939005,0.6841098220788338,0.0,0.0,0.0,1.0
1718123058.2327611,map,True,False,2,2,0.49874686716791977,0.49874686716791977,2.6961543560028076,-1.922836184501648,0.0,0.0,0.0,0.052811934972913546,0.9986044712771432,3.882733290224121,-2.9230372959605333,0.6841049364334668,0.0,0.0,0.0,1.0
1718123058.4882057,map,True,True,2,2,0.49874686716791977,0.49874686716791977,2.6961543560028076,-1.922836184501648,0.0,0.0,0.0,0.052811934972913546,0.9986044712771432,3.9060578177145024,-2.9140282383340095,0.6824095106552134,0.0,0.0,0.0,1.0
1718123058.5825562,map,True,False,2,2,0.49874686716791977,0.49874686716791977,2.6961543560028076,-1.922836184501648,0.0,0.0,0.0,0.052811934972913546,0.9986044712771432,3.898270796102835,-2.909207489682748,0.6840795902409792,0.0,0.0,0.0,1.0
1718123058.632683,map,True,False,2,2,0.49874686716791977,0.49874686716791977,2.6961543560028076,-1.922836184501648,0.0,0.0,0.0,0.052811934972913546,0.9986044712771432,3.898270796102835,-2.909207489682748,0.6840795902409792,0.0,0.0,0.0,1.0
1718123058.6829305,map,True,True,2,2,0.49874686716791977,0.49874686716791977,2.6961543560028076,-1.922836184501648,0.0,0.0,0.0,0.052811934972913546,0.9986044712771432,3.898270796102835,-2.909207489682748,0.6840795902409792,0.0,0.0,0.0,1.0
1718123058.7339826,map,True,True,2,2,0.49874686716791977,0.49874686716791977,2.6961543560028076,-1.922836184501648,0.0,0.0,0.0,0.052811934972913546,0.9986044712771432,3.898270796102835,-2.909207489682748,0.6840795902409792,0.0,0.0,0.0,1.0
1718123058.8358219,map,True,False,1,2,0.0,0.0,2.786400556564331,-1.9428319931030273,0.0,0.0,0.0,0.05278144997842063,0.9986060828502501,3.935612919275866,-3.022277752716718,0.6862756604893043,0.0,0.0,0.0,1.0
1718123058.8845189,map,True,False,1,2,0.0,0.0,2.786400556564331,-1.9428319931030273,0.0,0.0,0.0,0.05278144997842063,0.9986060828502501,3.9275331569528156,-3.0176941738955714,0.6844617858448869,0.0,0.0,0.0,1.0
1718123058.9349906,map,True,False,1,2,0.0,0.0,2.786400556564331,-1.9428319931030273,0.0,0.0,0.0,0.05278144997842063,0.9986060828502501,3.9275331569528156,-3.0176941738955714,0.6844617858448869,0.0,0.0,0.0,1.0
1718123058.9859679,map,True,False,1,2,0.0,0.0,2.786400556564331,-1.9428319931030273,0.0,0.0,0.0,0.05278144997842063,0.9986060828502501,3.9275331569528156,-3.0176941738955714,0.6844617858448869,0.0,0.0,0.0,1.0
1718123059.0360856,map,True,False,1,2,0.0,0.0,2.786400556564331,-1.9428319931030273,0.0,0.0,0.0,0.05278144997842063,0.9986060828502501,3.9275331569528156,-3.0176941738955714,0.6844617858448869,0.0,0.0,0.0,1.0
1718123059.0894523,map,True,False,1,2,0.0,0.0,2.786400556564331,-1.9428319931030273,0.0,0.0,0.0,0.05278144997842063,0.9986060828502501,3.9275331569528156,-3.0176941738955714,0.6844617858448869,0.0,0.0,0.0,1.0
1718123059.1865795,map,True,False,1,2,0.0,0.0,2.786400556564331,-1.9428319931030273,0.0,0.0,0.0,0.05278144997842063,0.9986060828502501,3.9785696666904107,-3.043741111786728,0.6845200248586533,0.0,0.0,0.0,1.0
1718123059.4870121,map,True,False,1,2,0.0,0.0,2.786400556564331,-1.9428319931030273,0.0,0.0,0.0,0.05278144997842063,0.9986060828502501,3.999388454265485,-3.0373313436938076,0.6844655635577829,0.0,0.0,0.0,1.0
1718123059.5370033,map,True,False,1,2,0.0,0.0,2.8331174850463867,-1.9482396841049194,0.0,0.0,0.0,0.052976374183811334,0.9985957717218468,3.986379482538631,-3.024576426207541,0.6844371351221273,0.0,0.0,0.0,1.0
1718123059.6359017,map,True,False,1,2,0.0,0.0,2.8331174850463867,-1.9482396841049194,0.0,0.0,0.0,0.052976374183811334,0.9985957717218468,3.986379482538631,-3.024576426207541,0.6844371351221273,0.0,0.0,0.0,1.0
1718123059.6860545,map,True,False,1,2,0.0,0.0,2.8331174850463867,-1.9482396841049194,0.0,0.0,0.0,0.052976374183811334,0.9985957717218468,3.986379482538631,-3.024576426207541,0.6844371351221273,0.0,0.0,0.0,1.0
1718123059.736965,map,True,False,1,2,0.0,0.0,2.8331174850463867,-1.9482396841049194,0.0,0.0,0.0,0.052976374183811334,0.9985957717218468,3.986379482538631,-3.024576426207541,0.6844371351221273,0.0,0.0,0.0,1.0
1718123059.836387,map,True,False,1,2,0.0,0.0,2.8331174850463867,-1.9482396841049194,0.0,0.0,0.0,0.052976374183811334,0.9985957717218468,4.01617367983594,-3.0289754420528823,0.7136616100553115,0.0,0.0,0.0,1.0
1718123059.8670366,map,True,False,1,2,0.0,0.0,2.8331174850463867,-1.9482396841049194,0.0,0.0,0.0,0.052976374183811334,0.9985957717218468,4.020436740788856,-3.0196696194364994,0.6878076487454243,0.0,0.0,0.0,1.0
1718123059.874867,map,True,False,1,2,0.0,0.0,2.8331174850463867,-1.9482396841049194,0.0,0.0,0.0,0.052976374183811334,0.9985957717218468,4.020436740788856,-3.0196696194364994,0.6878076487454243,0.0,0.0,0.0,1.0
1718123059.8775685,map,True,False,1,2,0.0,0.0,2.8331174850463867,-1.9482396841049194,0.0,0.0,0.0,0.052976374183811334,0.9985957717218468,4.020436740788856,-3.0196696194364994,0.6878076487454243,0.0,0.0,0.0,1.0
1718123059.8816786,map,True,False,1,2,0.0,0.0,2.8331174850463867,-1.9482396841049194,0.0,0.0,0.0,0.052976374183811334,0.9985957717218468,4.020436740788856,-3.0196696194364994,0.6878076487454243,0.0,0.0,0.0,1.0
1718123059.8870203,map,True,False,1,2,0.0,0.0,2.8331174850463867,-1.9482396841049194,0.0,0.0,0.0,0.052976374183811334,0.9985957717218468,4.020436740788856,-3.0196696194364994,0.6878076487454243,0.0,0.0,0.0,1.0
1718123059.892707,map,True,False,1,2,0.0,0.0,2.8331174850463867,-1.9482396841049194,0.0,0.0,0.0,0.052976374183811334,0.9985957717218468,4.020436740788856,-3.0196696194364994,0.6878076487454243,0.0,0.0,0.0,1.0
1718123059.902568,map,True,False,1,2,0.0,0.0,2.8331174850463867,-1.9482396841049194,0.0,0.0,0.0,0.052976374183811334,0.9985957717218468,4.020436740788856,-3.0196696194364994,0.6878076487454243,0.0,0.0,0.0,1.0
1718123059.9108896,map,True,False,1,2,0.0,0.0,2.8331174850463867,-1.9482396841049194,0.0,0.0,0.0,0.052976374183811334,0.9985957717218468,4.020436740788856,-3.0196696194364994,0.6878076487454243,0.0,0.0,0.0,1.0
1718123059.9135122,map,True,False,1,2,0.0,0.0,2.8331174850463867,-1.9482396841049194,0.0,0.0,0.0,0.052976374183811334,0.9985957717218468,4.020436740788856,-3.0196696194364994,0.6878076487454243,0.0,0.0,0.0,1.0
1718123059.9175217,map,True,False,1,2,0.0,0.0,2.8331174850463867,-1.9482396841049194,0.0,0.0,0.0,0.052976374183811334,0.9985957717218468,4.020436740788856,-3.0196696194364994,0.6878076487454243,0.0,0.0,0.0,1.0
1718123059.9195948,map,True,False,1,2,0.0,0.0,2.8331174850463867,-1.9482396841049194,0.0,0.0,0.0,0.052976374183811334,0.9985957717218468,4.020436740788856,-3.0196696194364994,0.6878076487454243,0.0,0.0,0.0,1.0
1718123059.9215057,map,True,False,1,2,0.0,0.0,2.8331174850463867,-1.9482396841049194,0.0,0.0,0.0,0.052976374183811334,0.9985957717218468,4.020436740788856,-3.0196696194364994,0.6878076487454243,0.0,0.0,0.0,1.0
1718123059.9238882,map,True,False,1,2,0.0,0.0,2.8331174850463867,-1.9482396841049194,0.0,0.0,0.0,0.052976374183811334,0.9985957717218468,4.020436740788856,-3.0196696194364994,0.6878076487454243,0.0,0.0,0.0,1.0
1718123059.926526,map,True,False,1,2,0.0,0.0,2.8331174850463867,-1.9482396841049194,0.0,0.0,0.0,0.052976374183811334,0.9985957717218468,4.020436740788856,-3.0196696194364994,0.6878076487454243,0.0,0.0,0.0,1.0
1718123059.9299417,map,True,False,1,2,0.0,0.0,2.8331174850463867,-1.9482396841049194,0.0,0.0,0.0,0.052976374183811334,0.9985957717218468,4.020436740788856,-3.0196696194364994,0.6878076487454243,0.0,0.0,0.0,1.0
1718123059.9336016,map,True,False,1,2,0.0,0.0,2.8331174850463867,-1.9482396841049194,0.0,0.0,0.0,0.052976374183811334,0.9985957717218468,4.020436740788856,-3.0196696194364994,0.6878076487454243,0.0,0.0,0.0,1.0
1718123059.9373379,map,True,False,1,2,0.0,0.0,2.8331174850463867,-1.9482396841049194,0.0,0.0,0.0,0.052976374183811334,0.9985957717218468,4.020436740788856,-3.0196696194364994,0.6878076487454243,0.0,0.0,0.0,1.0
1718123059.9403222,map,True,False,1,2,0.0,0.0,2.8331174850463867,-1.9482396841049194,0.0,0.0,0.0,0.052976374183811334,0.9985957717218468,4.020436740788856,-3.0196696194364994,0.6878076487454243,0.0,0.0,0.0,1.0
1718123059.9425626,map,True,False,1,2,0.0,0.0,2.8331174850463867,-1.9482396841049194,0.0,0.0,0.0,0.052976374183811334,0.9985957717218468,4.020436740788856,-3.0196696194364994,0.6878076487454243,0.0,0.0,0.0,1.0
1718123059.9447143,map,True,False,1,2,0.0,0.0,2.8331174850463867,-1.9482396841049194,0.0,0.0,0.0,0.052976374183811334,0.9985957717218468,4.020436740788856,-3.0196696194364994,0.6878076487454243,0.0,0.0,0.0,1.0
1718123059.951405,map,True,False,1,2,0.0,0.0,2.8331174850463867,-1.9482396841049194,0.0,0.0,0.0,0.052976374183811334,0.9985957717218468,4.020436740788856,-3.0196696194364994,0.6878076487454243,0.0,0.0,0.0,1.0
1718123060.0024862,map,True,False,1,2,0.0,0.0,2.8331174850463867,-1.9482396841049194,0.0,0.0,0.0,0.052976374183811334,0.9985957717218468,4.020436740788856,-3.0196696194364994,0.6878076487454243,0.0,0.0,0.0,1.0
1718123060.1027231,map,True,False,1,2,0.0,0.0,2.8331174850463867,-1.9482396841049194,0.0,0.0,0.0,0.052976374183811334,0.9985957717218468,4.020436740788856,-3.0196696194364994,0.6878076487454243,0.0,0.0,0.0,1.0
1718123060.1533692,map,True,False,1,2,0.0,0.0,2.8331174850463867,-1.9482396841049194,0.0,0.0,0.0,0.052976374183811334,0.9985957717218468,4.060245416228228,-3.0390056453933023,0.8494722272128724,0.0,0.0,0.0,1.0
1718123060.204241,map,True,False,1,2,0.0,0.0,2.8331174850463867,-1.9482396841049194,0.0,0.0,0.0,0.052976374183811334,0.9985957717218468,4.053056216385962,-3.034389790439168,0.8498981389826172,0.0,0.0,0.0,1.0
