car_pos_meter , car_pos_cell, car_speed, ped_pos_meter, ped_pos_cell, ped_speed
-41, 41, 2, 3.647056, -40, 1
-35.45, 35, 2, 3.652459, -40, 1
-29.89999, 29, 2, 3.430363, -40, 1
-24.34999, 24, 2, 3.485936, -40, 1
-18.79999, 18, 2, 3.616847, -40, 1
