car_pos_meter , car_pos_cell, car_speed, ped_pos_meter, ped_pos_cell, ped_speed
-5.125, 5, 2, 4.097919, 5, 1
-5.104175, 5, 1, 4.086875, 5, 1
-5.049553, 5, 1, 3.871003, 5, 1
-4.90581, 4, 1, 3.379226, 4, 1
-4.762068, 4, 2, 3.152514, 4, 1
-3.720822, 3, 1, 3.075073, 3, 1
-3.577068, 3, 1, 2.904034, 3, 1
-3.433313, 3, 1, 2.949481, 3, 1
-3.289559, 3, 1, 2.940426, 3, 1
-3.145804, 3, 1, 2.904463, 3, 1
-3.00205, 3, 1, 2.714882, 3, 1
-2.858295, 2, 2, 1.929753, 2, 1
-1.817049, 1, 2, 1.294837, 1, 1
-0.7757974, 0, 2, 0.5586042, 0, 1
0.2654529, 0, 2, -0.1710386, 0, 1
1.306704, -1, 2, -0.6185584, 0, 1
2.347953, -2, 2, -0.6752615, 0, 1
3.389199, -3, 2, -0.4981594, 0, 1
4.430444, -4, 2, -0.4588399, 0, 1
