car_pos_meter , car_pos_cell, car_speed, ped_pos_meter, ped_pos_cell, ped_speed
-30.37037, 30, 2, 3.988867, 31, 1
-30.24696, 30, 2, 3.97689, 31, 1
-30.12356, 30, 2, 3.964677, 30, 1
-30.00015, 30, 2, 3.952067, 30, 1
-29.87674, 29, 2, 3.945466, 30, 1
-29.75334, 29, 2, 3.932463, 30, 1
-29.62993, 29, 2, 3.919192, 30, 1
-29.50652, 29, 2, 3.905882, 30, 1
-29.38312, 29, 2, 3.899295, 30, 1
-29.25971, 29, 2, 3.886429, 30, 1
-29.1363, 29, 2, 3.873251, 30, 1
-29.01289, 29, 2, 3.859266, 30, 1
-28.88949, 28, 2, 3.84446, 29, 1
-28.76608, 28, 2, 3.830285, 29, 1
-28.64267, 28, 2, 3.823337, 29, 1
-28.51927, 28, 2, 3.809816, 29, 1
-28.39586, 28, 2, 3.796371, 29, 1
-28.27245, 28, 2, 3.783206, 29, 1
-28.14905, 28, 2, 3.769947, 29, 1
-28.02564, 28, 2, 3.76338, 29, 1
-27.90223, 27, 2, 3.749873, 29, 1
-27.77883, 27, 2, 3.736437, 29, 1
-27.65542, 27, 2, 3.72289, 29, 1
-27.53201, 27, 2, 3.708991, 28, 1
-27.40861, 27, 2, 3.702117, 28, 1
-27.2852, 27, 2, 3.688052, 28, 1
-27.16179, 27, 2, 3.673968, 28, 1
-27.03838, 27, 2, 3.659831, 28, 1
-26.91498, 26, 2, 3.645454, 28, 1
-26.79157, 26, 2, 3.638073, 28, 1
-26.66816, 26, 2, 3.623348, 28, 1
-26.54476, 26, 2, 3.60849, 28, 1
-26.42135, 26, 2, 3.59282, 28, 1
-26.29794, 26, 2, 3.57682, 27, 1
-26.17454, 26, 2, 3.568864, 27, 1
-26.05113, 26, 2, 3.552653, 27, 1
-25.92772, 25, 2, 3.536686, 27, 1
-25.80432, 25, 2, 3.520167, 27, 1
-25.68091, 25, 2, 3.502419, 27, 1
-25.5575, 25, 2, 3.493663, 27, 1
-25.4341, 25, 2, 3.476328, 27, 1
-25.31069, 25, 2, 3.459179, 26, 1
-25.18728, 25, 2, 3.442181, 26, 1
-25.06388, 25, 2, 3.425001, 26, 1
-24.94047, 24, 2, 3.416734, 26, 1
-24.81706, 24, 2, 3.399975, 26, 1
-24.69365, 24, 2, 3.383673, 26, 1
-24.57025, 24, 2, 3.367462, 26, 1
-24.44684, 24, 2, 3.351194, 26, 1
-24.32343, 24, 2, 3.343098, 26, 1
-24.20003, 24, 2, 3.326499, 25, 1
-24.07662, 24, 2, 3.31004, 25, 1
-23.95321, 23, 2, 3.294071, 25, 1
-23.82981, 23, 2, 3.278569, 25, 1
-23.7064, 23, 2, 3.270907, 25, 1
-23.58299, 23, 2, 3.255485, 25, 1
-23.45959, 23, 2, 3.239672, 25, 1
-23.33618, 23, 2, 3.223863, 25, 1
-23.21277, 23, 2, 3.207917, 25, 1
-23.08937, 23, 2, 3.200017, 24, 1
-22.96596, 22, 2, 3.183797, 24, 1
-22.84255, 22, 2, 3.168417, 24, 1
-22.71914, 22, 2, 3.152751, 24, 1
-22.59574, 22, 2, 3.136692, 24, 1
-22.47233, 22, 2, 3.128817, 24, 1
-22.34892, 22, 2, 3.112801, 24, 1
-22.22552, 22, 2, 3.096747, 24, 1
-22.10211, 22, 2, 3.080809, 24, 1
-21.9787, 21, 2, 3.064442, 23, 1
-21.8553, 21, 2, 3.056416, 23, 1
-21.73189, 21, 2, 3.040125, 23, 1
-21.60848, 21, 2, 3.023667, 23, 1
-21.48507, 21, 2, 3.006618, 23, 1
-21.36167, 21, 2, 2.989459, 23, 1
-21.23826, 21, 2, 2.980793, 23, 1
-21.11485, 21, 2, 2.963238, 23, 1
-20.99145, 20, 2, 2.945672, 22, 1
-20.86804, 20, 2, 2.928448, 22, 1
-20.74463, 20, 2, 2.911275, 22, 1
-20.62123, 20, 2, 2.893753, 22, 1
-20.49782, 20, 2, 2.885249, 22, 1
-20.37441, 20, 2, 2.867923, 22, 1
-20.25101, 20, 2, 2.850609, 22, 1
-20.1276, 20, 2, 2.832404, 22, 1
-20.00419, 20, 2, 2.823519, 22, 1
-19.88079, 19, 2, 2.805823, 21, 1
-19.75738, 19, 2, 2.788713, 21, 1
-19.63397, 19, 2, 2.772043, 21, 1
-19.51056, 19, 2, 2.755684, 21, 1
-19.38716, 19, 2, 2.747933, 21, 1
-17.04243, 17, 2, 2.462785, 19, 1
-13.95726, 13, 2, 2.10296, 16, 1
-10.87208, 10, 2, 1.735903, 13, 1
-7.786889, 7, 2, 1.383169, 10, 1
-4.7017, 4, 2, 1.018083, 7, 1
-1.616512, 1, 2, 0.6434958, 5, 1
1.468673, -1, 2, 0.2997446, 2, 1
4.55386, -4, 2, 0.001798153, 0, 1
7.639049, -7, 2, -0.3071117, -2, 1
10.72424, -10, 2, -0.5715761, -4, 1
13.80942, -13, 2, -0.7477527, -5, 1
16.89459, -16, 2, -0.8751683, -6, 1
19.97976, -19, 2, -0.9115319, -7, 1
23.06493, -23, 2, -0.9210539, -7, 1
26.1501, -26, 2, -0.9097443, -7, 1
29.23528, -29, 2, -0.906002, -7, 1
32.32045, -32, 2, -0.9203162, -7, 1
