car_pos_meter , car_pos_cell, car_speed, ped_pos_meter, ped_pos_cell, ped_speed
-5.125, 5, 2, 1.255297, 1, 1
-4.604377, 4, 2, 1.186762, 1, 1
-4.083755, 4, 2, 1.210761, 1, 1
-3.563132, 3, 2, 1.18278, 1, 1
-3.042509, 3, 2, 1.25698, 1, 1
-2.521886, 2, 2, 1.285105, 1, 1
-2.001264, 2, 2, 1.170648, 1, 1
-1.480638, 1, 2, 0.9397087, 1, 1
-0.9600121, 0, 2, 0.7361321, 0, 1
-0.4393865, 0, 2, 0.5782204, 0, 1
0.08123851, 0, 2, 0.4289856, 0, 1
0.6018636, 0, 2, 0.5854931, 0, 1
1.122489, -1, 2, 0.6855488, 0, 1
1.643115, -1, 2, 0.7437425, 0, 1
2.16374, -2, 2, 0.7437425, 0, 1
2.684363, -2, 2, 0.7437425, 0, 1
3.204985, -3, 2, 0.7437425, 0, 1
3.725608, -3, 2, 0.7579179, 0, 1
4.246231, -4, 2, 0.6879268, 0, 1
4.766854, -4, 2, 0.6993873, 0, 1
5.287477, -5, 2, 0.7204311, 0, 1
5.808099, -5, 2, 0.7093725, 0, 1
6.328722, -6, 2, 0.7861669, 1, 1
6.849345, -6, 2, 0.7929049, 1, 1
7.369967, -7, 2, 0.6769664, 0, 1
7.89059, -7, 2, 0.493572, 0, 1
8.411222, -8, 2, 0.469558, 0, 1
8.931856, -8, 2, 0.4781895, 0, 1
9.452492, -9, 2, 0.4565554, 0, 1
9.973125, -9, 2, 0.4405441, 0, 1
10.49376, -10, 2, 0.3868446, 0, 1
11.01439, -11, 2, 0.4325967, 0, 1
11.53503, -11, 2, 0.4704177, 0, 1
12.05566, -12, 2, 0.4810047, 0, 1
12.5763, -12, 2, 0.5101097, 0, 1
13.09693, -13, 2, 0.4892445, 0, 1
13.61757, -13, 2, 0.4554965, 0, 1
14.1382, -14, 2, 0.4693747, 0, 1
14.65884, -14, 2, 0.5886657, 0, 1
15.17947, -15, 2, 0.6277311, 0, 1
15.70011, -15, 2, 0.6211469, 0, 1
16.22073, -16, 2, 0.620574, 0, 1
16.74134, -16, 2, 0.6233163, 0, 1
17.26195, -17, 2, 0.6269448, 0, 1
17.78256, -17, 2, 0.6137204, 0, 1
18.30317, -18, 2, 0.5982177, 0, 1
18.82379, -18, 2, 0.6333234, 0, 1
19.3444, -19, 2, 0.631222, 0, 1
19.86501, -19, 2, 0.7391143, 0, 1
20.38562, -20, 2, 0.7484362, 0, 1
20.90623, -20, 2, 0.6632266, 0, 1
21.42684, -21, 2, 0.6157663, 0, 1
21.94745, -21, 2, 0.6067467, 0, 1
22.46806, -22, 2, 0.6104708, 0, 1
22.98867, -22, 2, 0.6107287, 0, 1
23.50928, -23, 2, 0.5966969, 0, 1
24.02989, -24, 2, 0.6355755, 0, 1
24.5505, -24, 2, 0.6344903, 0, 1
25.07112, -25, 2, 0.6267779, 0, 1
25.59173, -25, 2, 0.6025164, 0, 1
26.11234, -26, 2, 0.5911613, 0, 1
26.63295, -26, 2, 0.4241724, 0, 1
27.15356, -27, 2, 0.1300259, 0, 1
27.67417, -27, 2, 0.06834054, 0, 1
28.19478, -28, 2, 0.1342349, 0, 1
28.71539, -28, 2, 0.06982255, 0, 1
29.236, -29, 2, 0.05687809, 0, 1
29.75661, -29, 2, 0.06850576, 0, 1
30.27722, -30, 2, 0.1032341, 0, 1
30.79783, -30, 2, 0.01510596, 0, 1
31.31845, -31, 2, 0.007130384, 0, 1
31.83906, -31, 2, 0.003040791, 0, 1
32.35967, -32, 2, 0.01268554, 0, 1
32.88028, -32, 2, 0.05086136, 0, 1
33.40089, -33, 2, 0.01101542, 0, 1
33.9215, -33, 2, 0.02228069, 0, 1
34.44211, -34, 2, -0.0001268387, 0, 1
34.96272, -34, 2, -0.02205944, 0, 1
35.48333, -35, 2, -0.05273533, 0, 1
36.00394, -36, 2, -0.07540178, 0, 1
36.52456, -36, 2, -0.09637403, 0, 1
37.04517, -37, 2, -0.09035873, 0, 1
37.56578, -37, 2, -0.07286644, 0, 1
38.08639, -38, 2, -0.06316614, 0, 1
38.607, -38, 2, -0.05984068, 0, 1
39.12761, -39, 2, -0.06159306, 0, 1
39.64822, -39, 2, -0.06248856, 0, 1
40.16883, -40, 2, -0.05826521, 0, 1
40.68944, -40, 2, -0.04565001, 0, 1
41.21005, -41, 2, -0.04423428, 0, 1
41.73066, -41, 2, -0.06272888, 0, 1
