timestamp_sec,frame_id,game_played,yielding,player1discrete,player2discrete,player1yieldprob,player2yieldprob,player1_pose_x,player1_pose_y,player1_pose_z,player1_pose_orient_x,player1_pose_orient_y,player1_pose_orient_z,player1_pose_orient_w,player2_pose_x,player2_pose_y,player2_pose_z,player2_pose_orient_x,player2_pose_orient_y,player2_pose_orient_z,player2_pose_orient_w
1718117776.9363496,map,True,False,6,6,0.5957621508060097,0.5957621508060098,0.8673726320266724,-1.4766457080841064,0.0,0.0,0.0,0.021131329552270133,0.9997767109728377,2.6069844373332076,-7.0886953959832635,0.8361822299561993,0.0,0.0,0.0,1.0
1718117776.9854462,map,True,True,6,6,0.5957621508060097,0.5957621508060098,0.8673726320266724,-1.4766457080841064,0.0,0.0,0.0,0.021131329552270133,0.9997767109728377,2.6069844373332076,-7.0886953959832635,0.8361822299561993,0.0,0.0,0.0,1.0
1718117777.0354507,map,True,True,6,6,0.5957621508060097,0.5957621508060098,0.8673726320266724,-1.4766457080841064,0.0,0.0,0.0,0.021131329552270133,0.9997767109728377,2.6246223573132728,-7.198178716383714,0.8565405192565091,0.0,0.0,0.0,1.0
1718117777.1376498,map,True,True,6,6,0.5957621508060097,0.5957621508060098,0.8673726320266724,-1.4766457080841064,0.0,0.0,0.0,0.021131329552270133,0.9997767109728377,2.6246223573132728,-7.198178716383714,0.8565405192565091,0.0,0.0,0.0,1.0
1718117777.1856384,map,True,True,6,6,0.5957621508060097,0.5957621508060098,0.8673726320266724,-1.4766457080841064,0.0,0.0,0.0,0.021131329552270133,0.9997767109728377,2.6246223573132728,-7.198178716383714,0.8565405192565091,0.0,0.0,0.0,1.0
1718117777.23521,map,True,False,6,6,0.5957621508060097,0.5957621508060098,0.8673726320266724,-1.4766457080841064,0.0,0.0,0.0,0.021131329552270133,0.9997767109728377,2.6246223573132728,-7.198178716383714,0.8565405192565091,0.0,0.0,0.0,1.0
1718117777.3875337,map,True,True,6,6,0.5957621508060097,0.5957621508060098,0.8673726320266724,-1.4766457080841064,0.0,0.0,0.0,0.021131329552270133,0.9997767109728377,2.6055253739238156,-7.070073241132336,0.8525767954291292,0.0,0.0,0.0,1.0
1718117777.4353395,map,True,True,6,6,0.5957621508060097,0.5957621508060098,0.8673726320266724,-1.4766457080841064,0.0,0.0,0.0,0.021131329552270133,0.9997767109728377,2.6055253739238156,-7.070073241132336,0.8525767954291292,0.0,0.0,0.0,1.0
1718117777.4870179,map,True,True,6,6,0.5957621508060097,0.5957621508060098,0.8673726320266724,-1.4766457080841064,0.0,0.0,0.0,0.021131329552270133,0.9997767109728377,2.6055253739238156,-7.070073241132336,0.8525767954291292,0.0,0.0,0.0,1.0
1718117777.585843,map,True,False,6,6,0.5957621508060097,0.5957621508060098,0.8673726320266724,-1.4766457080841064,0.0,0.0,0.0,0.021131329552270133,0.9997767109728377,2.6055253739238156,-7.070073241132336,0.8525767954291292,0.0,0.0,0.0,1.0
1718117777.6362407,map,True,False,6,6,0.5957621508060097,0.5957621508060098,0.8673726320266724,-1.4766457080841064,0.0,0.0,0.0,0.021131329552270133,0.9997767109728377,2.6055253739238156,-7.070073241132336,0.8525767954291292,0.0,0.0,0.0,1.0
1718117777.694788,map,True,True,6,6,0.5957621508060097,0.5957621508060098,0.8673726320266724,-1.4766457080841064,0.0,0.0,0.0,0.021131329552270133,0.9997767109728377,2.5926778321582638,-7.080721732481841,0.8441676571918733,0.0,0.0,0.0,1.0
1718117777.7417657,map,True,True,6,6,0.5957621508060097,0.5957621508060098,0.8673726320266724,-1.4766457080841064,0.0,0.0,0.0,0.021131329552270133,0.9997767109728377,2.5926778321582638,-7.080721732481841,0.8441676571918733,0.0,0.0,0.0,1.0
1718117777.8414843,map,True,True,6,6,0.5957621508060097,0.5957621508060098,0.8669829368591309,-1.4765815734863281,0.0,0.0,0.0,0.02113549165832331,0.9997766215458985,2.5926778321582638,-7.080721732481841,0.8441676571918733,0.0,0.0,0.0,1.0
1718117777.94209,map,True,False,6,6,0.5957621508060097,0.5957621508060098,0.8669829368591309,-1.4765815734863281,0.0,0.0,0.0,0.02113549165832331,0.9997766215458985,2.5926778321582638,-7.080721732481841,0.8441676571918733,0.0,0.0,0.0,1.0
1718117777.9649208,map,True,False,6,6,0.5957621508060097,0.5957621508060098,0.8669829368591309,-1.4765815734863281,0.0,0.0,0.0,0.02113549165832331,0.9997766215458985,2.5926778321582638,-7.080721732481841,0.8441676571918733,0.0,0.0,0.0,1.0
1718117777.967677,map,True,True,6,6,0.5957621508060097,0.5957621508060098,0.8669829368591309,-1.4765815734863281,0.0,0.0,0.0,0.02113549165832331,0.9997766215458985,2.5926778321582638,-7.080721732481841,0.8441676571918733,0.0,0.0,0.0,1.0
1718117778.0165873,map,True,True,6,6,0.5957621508060097,0.5957621508060098,0.8669829368591309,-1.4765815734863281,0.0,0.0,0.0,0.02113549165832331,0.9997766215458985,2.5768853354957972,-7.037124221343959,0.842837628296618,0.0,0.0,0.0,1.0
1718117778.0207882,map,True,False,6,6,0.5957621508060097,0.5957621508060098,0.8669829368591309,-1.4765815734863281,0.0,0.0,0.0,0.02113549165832331,0.9997766215458985,2.5768853354957972,-7.037124221343959,0.842837628296618,0.0,0.0,0.0,1.0
1718117778.024421,map,True,True,6,6,0.5957621508060097,0.5957621508060098,0.8669829368591309,-1.4765815734863281,0.0,0.0,0.0,0.02113549165832331,0.9997766215458985,2.5768853354957972,-7.037124221343959,0.842837628296618,0.0,0.0,0.0,1.0
1718117778.0343215,map,True,True,6,6,0.5957621508060097,0.5957621508060098,0.8669829368591309,-1.4765815734863281,0.0,0.0,0.0,0.02113549165832331,0.9997766215458985,2.5706604937769004,-6.998279708939286,0.84171106382546,0.0,0.0,0.0,1.0
1718117778.0751414,map,True,True,6,6,0.5957621508060097,0.5957621508060098,0.8669829368591309,-1.4765815734863281,0.0,0.0,0.0,0.02113549165832331,0.9997766215458985,2.5636504738691137,-7.002814408304301,0.8417418259222419,0.0,0.0,0.0,1.0
1718117778.0814226,map,True,False,6,6,0.5957621508060097,0.5957621508060098,0.8669829368591309,-1.4765815734863281,0.0,0.0,0.0,0.02113549165832331,0.9997766215458985,2.5636504738691137,-7.002814408304301,0.8417418259222419,0.0,0.0,0.0,1.0
1718117778.1308947,map,True,False,6,6,0.5957621508060097,0.5957621508060098,0.8669829368591309,-1.4765815734863281,0.0,0.0,0.0,0.02113549165832331,0.9997766215458985,2.5636504738691137,-7.002814408304301,0.8417418259222419,0.0,0.0,0.0,1.0
1718117778.1825502,map,True,True,6,6,0.5957621508060097,0.5957621508060098,0.8669829368591309,-1.4765815734863281,0.0,0.0,0.0,0.02113549165832331,0.9997766215458985,2.5636504738691137,-7.002814408304301,0.8417418259222419,0.0,0.0,0.0,1.0
1718117778.196979,map,True,True,6,6,0.5957621508060097,0.5957621508060098,0.8669829368591309,-1.4765815734863281,0.0,0.0,0.0,0.02113549165832331,0.9997766215458985,2.5636504738691137,-7.002814408304301,0.8417418259222419,0.0,0.0,0.0,1.0
1718117778.1998887,map,True,False,6,6,0.5957621508060097,0.5957621508060098,0.8669829368591309,-1.4765815734863281,0.0,0.0,0.0,0.02113549165832331,0.9997766215458985,2.5636504738691137,-7.002814408304301,0.8417418259222419,0.0,0.0,0.0,1.0
1718117778.2025082,map,True,True,6,6,0.5957621508060097,0.5957621508060098,0.8669829368591309,-1.4765815734863281,0.0,0.0,0.0,0.02113549165832331,0.9997766215458985,2.5636504738691137,-7.002814408304301,0.8417418259222419,0.0,0.0,0.0,1.0
1718117778.2073755,map,True,True,6,6,0.5957621508060097,0.5957621508060098,0.8669829368591309,-1.4765815734863281,0.0,0.0,0.0,0.02113549165832331,0.9997766215458985,2.5636504738691137,-7.002814408304301,0.8417418259222419,0.0,0.0,0.0,1.0
1718117778.2115397,map,True,True,6,6,0.5957621508060097,0.5957621508060098,0.8669829368591309,-1.4765815734863281,0.0,0.0,0.0,0.02113549165832331,0.9997766215458985,2.5636504738691137,-7.002814408304301,0.8417418259222419,0.0,0.0,0.0,1.0
1718117778.219999,map,True,False,6,6,0.5957621508060097,0.5957621508060098,0.8669829368591309,-1.4765815734863281,0.0,0.0,0.0,0.02113549165832331,0.9997766215458985,2.5636504738691137,-7.002814408304301,0.8417418259222419,0.0,0.0,0.0,1.0
1718117778.220544,map,True,False,6,6,0.5957621508060097,0.5957621508060098,0.8669829368591309,-1.4765815734863281,0.0,0.0,0.0,0.02113549165832331,0.9997766215458985,2.5636504738691137,-7.002814408304301,0.8417418259222419,0.0,0.0,0.0,1.0
1718117778.2234924,map,True,True,6,6,0.5957621508060097,0.5957621508060098,0.8669829368591309,-1.4765815734863281,0.0,0.0,0.0,0.02113549165832331,0.9997766215458985,2.5636504738691137,-7.002814408304301,0.8417418259222419,0.0,0.0,0.0,1.0
1718117778.226481,map,True,True,6,6,0.5957621508060097,0.5957621508060098,0.8669829368591309,-1.4765815734863281,0.0,0.0,0.0,0.02113549165832331,0.9997766215458985,2.5636504738691137,-7.002814408304301,0.8417418259222419,0.0,0.0,0.0,1.0
1718117778.2314878,map,True,False,6,6,0.5957621508060097,0.5957621508060098,0.8669829368591309,-1.4765815734863281,0.0,0.0,0.0,0.02113549165832331,0.9997766215458985,2.5636504738691137,-7.002814408304301,0.8417418259222419,0.0,0.0,0.0,1.0
1718117778.2355816,map,True,False,6,6,0.5957621508060097,0.5957621508060098,0.8669829368591309,-1.4765815734863281,0.0,0.0,0.0,0.02113549165832331,0.9997766215458985,2.5636504738691137,-7.002814408304301,0.8417418259222419,0.0,0.0,0.0,1.0
1718117778.2390182,map,True,False,6,6,0.5957621508060097,0.5957621508060098,0.8669829368591309,-1.4765815734863281,0.0,0.0,0.0,0.02113549165832331,0.9997766215458985,2.5636504738691137,-7.002814408304301,0.8417418259222419,0.0,0.0,0.0,1.0
1718117778.340715,map,True,False,6,6,0.5957621508060097,0.5957621508060098,0.8669829368591309,-1.4765815734863281,0.0,0.0,0.0,0.02113549165832331,0.9997766215458985,2.587506449671801,-7.200107293848066,0.847329295168293,0.0,0.0,0.0,1.0
1718117778.3912442,map,True,True,6,6,0.5957621508060097,0.5957621508060098,0.8669829368591309,-1.4765815734863281,0.0,0.0,0.0,0.02113549165832331,0.9997766215458985,2.587506449671801,-7.200107293848066,0.847329295168293,0.0,0.0,0.0,1.0
1718117778.4911926,map,True,False,6,6,0.5957621508060097,0.5957621508060098,0.8669829368591309,-1.4765815734863281,0.0,0.0,0.0,0.02113549165832331,0.9997766215458985,2.587506449671801,-7.200107293848066,0.847329295168293,0.0,0.0,0.0,1.0
1718117778.5910647,map,True,True,6,6,0.5957621508060097,0.5957621508060098,0.8669829368591309,-1.4765815734863281,0.0,0.0,0.0,0.02113549165832331,0.9997766215458985,2.587506449671801,-7.200107293848066,0.847329295168293,0.0,0.0,0.0,1.0
1718117778.641738,map,True,False,6,6,0.5957621508060097,0.5957621508060098,0.8668631315231323,-1.4798293113708496,0.0,0.0,0.0,0.021373384053309838,0.9997715689108394,2.587506449671801,-7.200107293848066,0.847329295168293,0.0,0.0,0.0,1.0
1718117778.6922853,map,True,False,6,6,0.5957621508060097,0.5957621508060098,0.8668631315231323,-1.4798293113708496,0.0,0.0,0.0,0.021373384053309838,0.9997715689108394,2.7821345375567406,-7.805157394646542,0.8468566114395818,0.0,0.0,0.0,1.0
1718117778.742858,map,True,True,6,6,0.5957621508060097,0.5957621508060098,0.8668631315231323,-1.4798293113708496,0.0,0.0,0.0,0.021373384053309838,0.9997715689108394,2.7821345375567406,-7.805157394646542,0.8468566114395818,0.0,0.0,0.0,1.0
1718117778.8443449,map,True,False,6,6,0.5957621508060097,0.5957621508060098,0.8668631315231323,-1.4798293113708496,0.0,0.0,0.0,0.021373384053309838,0.9997715689108394,2.7821345375567406,-7.805157394646542,0.8468566114395818,0.0,0.0,0.0,1.0
1718117778.9429784,map,True,True,6,6,0.5957621508060097,0.5957621508060098,0.8668631315231323,-1.4798293113708496,0.0,0.0,0.0,0.021373384053309838,0.9997715689108394,2.7821345375567406,-7.805157394646542,0.8468566114395818,0.0,0.0,0.0,1.0
1718117778.9950614,map,True,True,6,6,0.5957621508060097,0.5957621508060098,0.8668631315231323,-1.4798293113708496,0.0,0.0,0.0,0.021373384053309838,0.9997715689108394,2.7821345375567406,-7.805157394646542,0.8468566114395818,0.0,0.0,0.0,1.0
1718117779.052693,map,True,False,6,5,0.0,0.0,0.8668631315231323,-1.4798293113708496,0.0,0.0,0.0,0.021373384053309838,0.9997715689108394,2.6882270432350652,-6.676161798679547,0.8340331166101412,0.0,0.0,0.0,1.0
1718117779.103257,map,True,False,6,5,0.0,0.0,0.8668631315231323,-1.4798293113708496,0.0,0.0,0.0,0.021373384053309838,0.9997715689108394,2.6882270432350652,-6.676161798679547,0.8340331166101412,0.0,0.0,0.0,1.0
1718117779.1571317,map,True,False,6,5,0.0,0.0,0.8668631315231323,-1.4798293113708496,0.0,0.0,0.0,0.021373384053309838,0.9997715689108394,2.6882270432350652,-6.676161798679547,0.8340331166101412,0.0,0.0,0.0,1.0
1718117779.202939,map,True,False,6,5,0.0,0.0,0.8668631315231323,-1.4798293113708496,0.0,0.0,0.0,0.021373384053309838,0.9997715689108394,2.6882270432350652,-6.676161798679547,0.8340331166101412,0.0,0.0,0.0,1.0
1718117779.3543189,map,True,False,6,5,0.0,0.0,0.8782064318656921,-1.4822266101837158,0.0,0.0,0.0,0.02112411449341286,0.9997768600177187,2.7285896601504724,-6.4930444550157755,0.8213054255010958,0.0,0.0,0.0,1.0
1718117779.4028628,map,True,False,6,5,0.0,0.0,0.8782064318656921,-1.4822266101837158,0.0,0.0,0.0,0.02112411449341286,0.9997768600177187,2.7285896601504724,-6.4930444550157755,0.8213054255010958,0.0,0.0,0.0,1.0
1718117779.4541578,map,True,False,6,5,0.0,0.0,0.8782064318656921,-1.4822266101837158,0.0,0.0,0.0,0.02112411449341286,0.9997768600177187,2.7285896601504724,-6.4930444550157755,0.8213054255010958,0.0,0.0,0.0,1.0
1718117779.55499,map,True,False,6,5,0.0,0.0,0.8782064318656921,-1.4822266101837158,0.0,0.0,0.0,0.02112411449341286,0.9997768600177187,2.7285896601504724,-6.4930444550157755,0.8213054255010958,0.0,0.0,0.0,1.0
1718117779.604821,map,True,False,6,5,0.0,0.0,0.8782064318656921,-1.4822266101837158,0.0,0.0,0.0,0.02112411449341286,0.9997768600177187,2.7285896601504724,-6.4930444550157755,0.8213054255010958,0.0,0.0,0.0,1.0
1718117779.6558304,map,True,False,6,5,0.0,0.0,0.8782064318656921,-1.4822266101837158,0.0,0.0,0.0,0.02112411449341286,0.9997768600177187,2.7285896601504724,-6.4930444550157755,0.8213054255010958,0.0,0.0,0.0,1.0
1718117779.7539713,map,True,False,6,5,0.0,0.0,0.8782064318656921,-1.4822266101837158,0.0,0.0,0.0,0.02112411449341286,0.9997768600177187,2.784593315309979,-6.624557948054292,0.8247599503465015,0.0,0.0,0.0,1.0
1718117779.8540168,map,True,False,6,5,0.0,0.0,0.8782064318656921,-1.4822266101837158,0.0,0.0,0.0,0.02112411449341286,0.9997768600177187,2.838011253278978,-6.593692391762103,0.840267696712114,0.0,0.0,0.0,1.0
1718117779.91889,map,True,False,6,5,0.0,0.0,0.8782064318656921,-1.4822266101837158,0.0,0.0,0.0,0.02112411449341286,0.9997768600177187,2.838011253278978,-6.593692391762103,0.840267696712114,0.0,0.0,0.0,1.0
1718117779.922653,map,True,False,6,5,0.0,0.0,0.8782064318656921,-1.4822266101837158,0.0,0.0,0.0,0.02112411449341286,0.9997768600177187,2.838011253278978,-6.593692391762103,0.840267696712114,0.0,0.0,0.0,1.0
1718117779.926062,map,True,False,6,5,0.0,0.0,0.8782064318656921,-1.4822266101837158,0.0,0.0,0.0,0.02112411449341286,0.9997768600177187,2.838011253278978,-6.593692391762103,0.840267696712114,0.0,0.0,0.0,1.0
1718117779.9306836,map,True,False,6,5,0.0,0.0,0.8782064318656921,-1.4822266101837158,0.0,0.0,0.0,0.02112411449341286,0.9997768600177187,2.838011253278978,-6.593692391762103,0.840267696712114,0.0,0.0,0.0,1.0
1718117779.9348466,map,True,False,6,5,0.0,0.0,0.8782064318656921,-1.4822266101837158,0.0,0.0,0.0,0.02112411449341286,0.9997768600177187,2.838011253278978,-6.593692391762103,0.840267696712114,0.0,0.0,0.0,1.0
1718117779.9390094,map,True,False,6,5,0.0,0.0,0.8782064318656921,-1.4822266101837158,0.0,0.0,0.0,0.02112411449341286,0.9997768600177187,2.838011253278978,-6.593692391762103,0.840267696712114,0.0,0.0,0.0,1.0
1718117779.9511147,map,True,False,6,5,0.0,0.0,0.8782064318656921,-1.4822266101837158,0.0,0.0,0.0,0.02112411449341286,0.9997768600177187,2.838011253278978,-6.593692391762103,0.840267696712114,0.0,0.0,0.0,1.0
1718117779.9548342,map,True,False,6,5,0.0,0.0,0.8782064318656921,-1.4822266101837158,0.0,0.0,0.0,0.02112411449341286,0.9997768600177187,2.838011253278978,-6.593692391762103,0.840267696712114,0.0,0.0,0.0,1.0
1718117779.9589071,map,True,False,6,5,0.0,0.0,0.8782064318656921,-1.4822266101837158,0.0,0.0,0.0,0.02112411449341286,0.9997768600177187,2.838011253278978,-6.593692391762103,0.840267696712114,0.0,0.0,0.0,1.0
1718117779.9627843,map,True,False,6,5,0.0,0.0,0.8782064318656921,-1.4822266101837158,0.0,0.0,0.0,0.02112411449341286,0.9997768600177187,2.838011253278978,-6.593692391762103,0.840267696712114,0.0,0.0,0.0,1.0
1718117779.9704194,map,True,False,6,5,0.0,0.0,0.8782064318656921,-1.4822266101837158,0.0,0.0,0.0,0.02112411449341286,0.9997768600177187,2.838011253278978,-6.593692391762103,0.840267696712114,0.0,0.0,0.0,1.0
1718117779.9983912,map,True,False,6,5,0.0,0.0,0.8782064318656921,-1.4822266101837158,0.0,0.0,0.0,0.02112411449341286,0.9997768600177187,2.838011253278978,-6.593692391762103,0.840267696712114,0.0,0.0,0.0,1.0
1718117780.0035963,map,True,False,6,5,0.0,0.0,0.8782064318656921,-1.4822266101837158,0.0,0.0,0.0,0.02112411449341286,0.9997768600177187,2.838011253278978,-6.593692391762103,0.840267696712114,0.0,0.0,0.0,1.0
1718117780.006749,map,True,False,6,5,0.0,0.0,0.8782064318656921,-1.4822266101837158,0.0,0.0,0.0,0.02112411449341286,0.9997768600177187,2.838011253278978,-6.593692391762103,0.840267696712114,0.0,0.0,0.0,1.0
1718117780.0232165,map,True,False,6,5,0.0,0.0,0.8782064318656921,-1.4822266101837158,0.0,0.0,0.0,0.02112411449341286,0.9997768600177187,2.838011253278978,-6.593692391762103,0.840267696712114,0.0,0.0,0.0,1.0
1718117780.0233765,map,True,False,6,5,0.0,0.0,0.8782064318656921,-1.4822266101837158,0.0,0.0,0.0,0.02112411449341286,0.9997768600177187,2.838011253278978,-6.593692391762103,0.840267696712114,0.0,0.0,0.0,1.0
1718117780.0265791,map,True,False,6,5,0.0,0.0,0.8782064318656921,-1.4822266101837158,0.0,0.0,0.0,0.02112411449341286,0.9997768600177187,2.9275840241053155,-6.695565410354815,0.8353966357567926,0.0,0.0,0.0,1.0
1718117780.0312135,map,True,False,6,5,0.0,0.0,0.8782064318656921,-1.4822266101837158,0.0,0.0,0.0,0.02112411449341286,0.9997768600177187,2.9275840241053155,-6.695565410354815,0.8353966357567926,0.0,0.0,0.0,1.0
1718117780.0667286,map,True,False,6,4,0.0,0.0,0.8782064318656921,-1.4822266101837158,0.0,0.0,0.0,0.02112411449341286,0.9997768600177187,2.791631877252028,-5.891739251476164,0.8119878373148002,0.0,0.0,0.0,1.0
1718117780.07468,map,True,False,6,4,0.0,0.0,0.8782064318656921,-1.4822266101837158,0.0,0.0,0.0,0.02112411449341286,0.9997768600177187,2.791631877252028,-5.891739251476164,0.8119878373148002,0.0,0.0,0.0,1.0
1718117780.0912814,map,True,False,6,4,0.0,0.0,0.8782064318656921,-1.4822266101837158,0.0,0.0,0.0,0.02112411449341286,0.9997768600177187,2.791631877252028,-5.891739251476164,0.8119878373148002,0.0,0.0,0.0,1.0
1718117780.094259,map,True,False,6,4,0.0,0.0,0.8782064318656921,-1.4822266101837158,0.0,0.0,0.0,0.02112411449341286,0.9997768600177187,2.791631877252028,-5.891739251476164,0.8119878373148002,0.0,0.0,0.0,1.0
1718117780.0985239,map,True,False,6,4,0.0,0.0,0.8782064318656921,-1.4822266101837158,0.0,0.0,0.0,0.02112411449341286,0.9997768600177187,2.791631877252028,-5.891739251476164,0.8119878373148002,0.0,0.0,0.0,1.0
1718117780.103336,map,True,False,6,4,0.0,0.0,0.8782064318656921,-1.4822266101837158,0.0,0.0,0.0,0.02112411449341286,0.9997768600177187,2.791631877252028,-5.891739251476164,0.8119878373148002,0.0,0.0,0.0,1.0
1718117780.1065826,map,True,False,6,4,0.0,0.0,0.8782064318656921,-1.4822266101837158,0.0,0.0,0.0,0.02112411449341286,0.9997768600177187,2.791631877252028,-5.891739251476164,0.8119878373148002,0.0,0.0,0.0,1.0
1718117780.1108932,map,True,False,6,4,0.0,0.0,0.8782064318656921,-1.4822266101837158,0.0,0.0,0.0,0.02112411449341286,0.9997768600177187,2.791631877252028,-5.891739251476164,0.8119878373148002,0.0,0.0,0.0,1.0
1718117780.114637,map,True,False,6,4,0.0,0.0,0.8782064318656921,-1.4822266101837158,0.0,0.0,0.0,0.02112411449341286,0.9997768600177187,2.791631877252028,-5.891739251476164,0.8119878373148002,0.0,0.0,0.0,1.0
1718117780.118805,map,True,False,6,4,0.0,0.0,0.8782064318656921,-1.4822266101837158,0.0,0.0,0.0,0.02112411449341286,0.9997768600177187,2.791631877252028,-5.891739251476164,0.8119878373148002,0.0,0.0,0.0,1.0
1718117780.1277735,map,True,False,6,4,0.0,0.0,0.8782064318656921,-1.4822266101837158,0.0,0.0,0.0,0.02112411449341286,0.9997768600177187,2.791631877252028,-5.891739251476164,0.8119878373148002,0.0,0.0,0.0,1.0
1718117780.1301908,map,True,False,6,4,0.0,0.0,0.9406853318214417,-1.4964945316314697,0.0,0.0,0.0,0.021112843528375495,0.9997770984894819,2.791631877252028,-5.891739251476164,0.8119878373148002,0.0,0.0,0.0,1.0
1718117780.1346436,map,True,False,6,4,0.0,0.0,0.9406853318214417,-1.4964945316314697,0.0,0.0,0.0,0.021112843528375495,0.9997770984894819,2.791631877252028,-5.891739251476164,0.8119878373148002,0.0,0.0,0.0,1.0
1718117780.1466005,map,True,False,6,4,0.0,0.0,0.9406853318214417,-1.4964945316314697,0.0,0.0,0.0,0.021112843528375495,0.9997770984894819,2.791631877252028,-5.891739251476164,0.8119878373148002,0.0,0.0,0.0,1.0
1718117780.15081,map,True,False,6,4,0.0,0.0,0.9406853318214417,-1.4964945316314697,0.0,0.0,0.0,0.021112843528375495,0.9997770984894819,2.791631877252028,-5.891739251476164,0.8119878373148002,0.0,0.0,0.0,1.0
1718117780.157572,map,True,False,6,4,0.0,0.0,0.9406853318214417,-1.4964945316314697,0.0,0.0,0.0,0.021112843528375495,0.9997770984894819,2.791631877252028,-5.891739251476164,0.8119878373148002,0.0,0.0,0.0,1.0
1718117780.159016,map,True,False,6,4,0.0,0.0,0.9406853318214417,-1.4964945316314697,0.0,0.0,0.0,0.021112843528375495,0.9997770984894819,2.791631877252028,-5.891739251476164,0.8119878373148002,0.0,0.0,0.0,1.0
1718117780.162885,map,True,False,6,4,0.0,0.0,0.9406853318214417,-1.4964945316314697,0.0,0.0,0.0,0.021112843528375495,0.9997770984894819,2.791631877252028,-5.891739251476164,0.8119878373148002,0.0,0.0,0.0,1.0
1718117780.3706806,map,True,False,6,4,0.0,0.0,0.9406853318214417,-1.4964945316314697,0.0,0.0,0.0,0.021112843528375495,0.9997770984894819,2.912706803003137,-5.917748905583359,0.7988816905383489,0.0,0.0,0.0,1.0
1718117780.3792472,map,True,False,6,4,0.0,0.0,0.9406853318214417,-1.4964945316314697,0.0,0.0,0.0,0.021112843528375495,0.9997770984894819,2.912706803003137,-5.917748905583359,0.7988816905383489,0.0,0.0,0.0,1.0
1718117780.393756,map,True,False,6,4,0.0,0.0,0.9406853318214417,-1.4964945316314697,0.0,0.0,0.0,0.021112843528375495,0.9997770984894819,2.912706803003137,-5.917748905583359,0.7988816905383489,0.0,0.0,0.0,1.0
1718117780.3957658,map,True,False,6,4,0.0,0.0,0.9406853318214417,-1.4964945316314697,0.0,0.0,0.0,0.021112843528375495,0.9997770984894819,2.912706803003137,-5.917748905583359,0.7988816905383489,0.0,0.0,0.0,1.0
1718117780.4031188,map,True,False,6,4,0.0,0.0,0.9406853318214417,-1.4964945316314697,0.0,0.0,0.0,0.021112843528375495,0.9997770984894819,2.912706803003137,-5.917748905583359,0.7988816905383489,0.0,0.0,0.0,1.0
1718117780.4069366,map,True,False,6,4,0.0,0.0,0.9406853318214417,-1.4964945316314697,0.0,0.0,0.0,0.021112843528375495,0.9997770984894819,2.912706803003137,-5.917748905583359,0.7988816905383489,0.0,0.0,0.0,1.0
1718117780.4150517,map,True,False,6,4,0.0,0.0,0.9406853318214417,-1.4964945316314697,0.0,0.0,0.0,0.021112843528375495,0.9997770984894819,2.912706803003137,-5.917748905583359,0.7988816905383489,0.0,0.0,0.0,1.0
1718117780.4192429,map,True,False,6,4,0.0,0.0,0.9406853318214417,-1.4964945316314697,0.0,0.0,0.0,0.021112843528375495,0.9997770984894819,2.912706803003137,-5.917748905583359,0.7988816905383489,0.0,0.0,0.0,1.0
1718117780.4308786,map,True,False,6,4,0.0,0.0,0.9406853318214417,-1.4964945316314697,0.0,0.0,0.0,0.021112843528375495,0.9997770984894819,2.912706803003137,-5.917748905583359,0.7988816905383489,0.0,0.0,0.0,1.0
1718117780.4351275,map,True,False,6,4,0.0,0.0,0.9406853318214417,-1.4964945316314697,0.0,0.0,0.0,0.021112843528375495,0.9997770984894819,2.912706803003137,-5.917748905583359,0.7988816905383489,0.0,0.0,0.0,1.0
1718117780.4428637,map,True,False,6,4,0.0,0.0,0.9406853318214417,-1.4964945316314697,0.0,0.0,0.0,0.021112843528375495,0.9997770984894819,2.912706803003137,-5.917748905583359,0.7988816905383489,0.0,0.0,0.0,1.0
1718117780.451418,map,True,False,6,4,0.0,0.0,0.9406853318214417,-1.4964945316314697,0.0,0.0,0.0,0.021112843528375495,0.9997770984894819,2.912706803003137,-5.917748905583359,0.7988816905383489,0.0,0.0,0.0,1.0
1718117780.4560049,map,True,False,6,4,0.0,0.0,0.9406853318214417,-1.4964945316314697,0.0,0.0,0.0,0.021112843528375495,0.9997770984894819,2.912706803003137,-5.917748905583359,0.7988816905383489,0.0,0.0,0.0,1.0
1718117780.4790478,map,True,False,6,4,0.0,0.0,0.9406853318214417,-1.4964945316314697,0.0,0.0,0.0,0.021112843528375495,0.9997770984894819,2.912706803003137,-5.917748905583359,0.7988816905383489,0.0,0.0,0.0,1.0
1718117780.486824,map,True,False,6,4,0.0,0.0,0.9406853318214417,-1.4964945316314697,0.0,0.0,0.0,0.021112843528375495,0.9997770984894819,2.912706803003137,-5.917748905583359,0.7988816905383489,0.0,0.0,0.0,1.0
1718117780.492059,map,True,False,6,4,0.0,0.0,0.9406853318214417,-1.4964945316314697,0.0,0.0,0.0,0.021112843528375495,0.9997770984894819,2.912706803003137,-5.917748905583359,0.7988816905383489,0.0,0.0,0.0,1.0
1718117780.4948988,map,True,False,6,4,0.0,0.0,0.9406853318214417,-1.4964945316314697,0.0,0.0,0.0,0.021112843528375495,0.9997770984894819,2.912706803003137,-5.917748905583359,0.7988816905383489,0.0,0.0,0.0,1.0
1718117780.4980876,map,True,False,6,4,0.0,0.0,0.9406853318214417,-1.4964945316314697,0.0,0.0,0.0,0.021112843528375495,0.9997770984894819,2.912706803003137,-5.917748905583359,0.7988816905383489,0.0,0.0,0.0,1.0
1718117780.5030293,map,True,False,6,4,0.0,0.0,0.9406853318214417,-1.4964945316314697,0.0,0.0,0.0,0.021112843528375495,0.9997770984894819,2.912706803003137,-5.917748905583359,0.7988816905383489,0.0,0.0,0.0,1.0
1718117780.527009,map,True,False,6,4,0.0,0.0,0.9406853318214417,-1.4964945316314697,0.0,0.0,0.0,0.021112843528375495,0.9997770984894819,2.912706803003137,-5.917748905583359,0.7988816905383489,0.0,0.0,0.0,1.0
1718117780.5310137,map,True,False,6,4,0.0,0.0,0.9406853318214417,-1.4964945316314697,0.0,0.0,0.0,0.021112843528375495,0.9997770984894819,2.912706803003137,-5.917748905583359,0.7988816905383489,0.0,0.0,0.0,1.0
1718117780.547995,map,True,False,6,4,0.0,0.0,0.9406853318214417,-1.4964945316314697,0.0,0.0,0.0,0.021112843528375495,0.9997770984894819,2.912706803003137,-5.917748905583359,0.7988816905383489,0.0,0.0,0.0,1.0
1718117780.5509813,map,True,False,6,4,0.0,0.0,0.9406853318214417,-1.4964945316314697,0.0,0.0,0.0,0.021112843528375495,0.9997770984894819,2.912706803003137,-5.917748905583359,0.7988816905383489,0.0,0.0,0.0,1.0
1718117780.6014845,map,True,False,6,4,0.0,0.0,0.9406853318214417,-1.4964945316314697,0.0,0.0,0.0,0.021112843528375495,0.9997770984894819,2.912706803003137,-5.917748905583359,0.7988816905383489,0.0,0.0,0.0,1.0
1718117780.607544,map,True,False,6,4,0.0,0.0,0.9406853318214417,-1.4964945316314697,0.0,0.0,0.0,0.021112843528375495,0.9997770984894819,2.912706803003137,-5.917748905583359,0.7988816905383489,0.0,0.0,0.0,1.0
1718117780.620149,map,True,False,6,4,0.0,0.0,0.9406853318214417,-1.4964945316314697,0.0,0.0,0.0,0.021112843528375495,0.9997770984894819,2.912706803003137,-5.917748905583359,0.7988816905383489,0.0,0.0,0.0,1.0
1718117780.669849,map,True,False,6,4,0.0,0.0,0.9406853318214417,-1.4964945316314697,0.0,0.0,0.0,0.021112843528375495,0.9997770984894819,2.9294627375803604,-5.704434883416137,0.7864125482281258,0.0,0.0,0.0,1.0
1718117780.738823,map,True,False,6,4,0.0,0.0,0.9406853318214417,-1.4964945316314697,0.0,0.0,0.0,0.021112843528375495,0.9997770984894819,2.952938465600101,-5.834515500747117,0.8031450143180118,0.0,0.0,0.0,1.0
1718117780.7444823,map,True,False,6,4,0.0,0.0,0.9406853318214417,-1.4964945316314697,0.0,0.0,0.0,0.021112843528375495,0.9997770984894819,2.952938465600101,-5.834515500747117,0.8031450143180118,0.0,0.0,0.0,1.0
1718117780.7591283,map,True,False,6,4,0.0,0.0,0.9406853318214417,-1.4964945316314697,0.0,0.0,0.0,0.021112843528375495,0.9997770984894819,2.952938465600101,-5.834515500747117,0.8031450143180118,0.0,0.0,0.0,1.0
1718117780.7631092,map,True,False,6,4,0.0,0.0,1.0605792999267578,-1.5247374773025513,0.0,0.0,0.0,0.020918491181943017,0.9997811823095999,2.952938465600101,-5.834515500747117,0.8031450143180118,0.0,0.0,0.0,1.0
1718117780.7803347,map,True,False,6,4,0.0,0.0,1.0605792999267578,-1.5247374773025513,0.0,0.0,0.0,0.020918491181943017,0.9997811823095999,2.952938465600101,-5.834515500747117,0.8031450143180118,0.0,0.0,0.0,1.0
1718117780.791121,map,True,False,6,4,0.0,0.0,1.0605792999267578,-1.5247374773025513,0.0,0.0,0.0,0.020918491181943017,0.9997811823095999,2.952938465600101,-5.834515500747117,0.8031450143180118,0.0,0.0,0.0,1.0
1718117780.794797,map,True,False,6,4,0.0,0.0,1.0605792999267578,-1.5247374773025513,0.0,0.0,0.0,0.020918491181943017,0.9997811823095999,2.952938465600101,-5.834515500747117,0.8031450143180118,0.0,0.0,0.0,1.0
1718117780.8032026,map,True,False,6,4,0.0,0.0,1.0605792999267578,-1.5247374773025513,0.0,0.0,0.0,0.020918491181943017,0.9997811823095999,2.952938465600101,-5.834515500747117,0.8031450143180118,0.0,0.0,0.0,1.0
1718117780.807472,map,True,False,6,4,0.0,0.0,1.0605792999267578,-1.5247374773025513,0.0,0.0,0.0,0.020918491181943017,0.9997811823095999,2.952938465600101,-5.834515500747117,0.8031450143180118,0.0,0.0,0.0,1.0
1718117780.8124452,map,True,False,6,4,0.0,0.0,1.0605792999267578,-1.5247374773025513,0.0,0.0,0.0,0.020918491181943017,0.9997811823095999,2.952938465600101,-5.834515500747117,0.8031450143180118,0.0,0.0,0.0,1.0
1718117780.8155499,map,True,False,6,4,0.0,0.0,1.0605792999267578,-1.5247374773025513,0.0,0.0,0.0,0.020918491181943017,0.9997811823095999,2.952938465600101,-5.834515500747117,0.8031450143180118,0.0,0.0,0.0,1.0
1718117780.8199546,map,True,False,6,4,0.0,0.0,1.0605792999267578,-1.5247374773025513,0.0,0.0,0.0,0.020918491181943017,0.9997811823095999,2.952938465600101,-5.834515500747117,0.8031450143180118,0.0,0.0,0.0,1.0
1718117780.833194,map,True,False,6,4,0.0,0.0,1.0605792999267578,-1.5247374773025513,0.0,0.0,0.0,0.020918491181943017,0.9997811823095999,2.952938465600101,-5.834515500747117,0.8031450143180118,0.0,0.0,0.0,1.0
1718117780.8359818,map,True,False,6,4,0.0,0.0,1.0605792999267578,-1.5247374773025513,0.0,0.0,0.0,0.020918491181943017,0.9997811823095999,2.952938465600101,-5.834515500747117,0.8031450143180118,0.0,0.0,0.0,1.0
1718117780.844302,map,True,False,6,4,0.0,0.0,1.0605792999267578,-1.5247374773025513,0.0,0.0,0.0,0.020918491181943017,0.9997811823095999,2.952938465600101,-5.834515500747117,0.8031450143180118,0.0,0.0,0.0,1.0
1718117780.8473353,map,True,False,6,4,0.0,0.0,1.0605792999267578,-1.5247374773025513,0.0,0.0,0.0,0.020918491181943017,0.9997811823095999,2.952938465600101,-5.834515500747117,0.8031450143180118,0.0,0.0,0.0,1.0
1718117780.8558304,map,True,False,6,4,0.0,0.0,1.0605792999267578,-1.5247374773025513,0.0,0.0,0.0,0.020918491181943017,0.9997811823095999,2.952938465600101,-5.834515500747117,0.8031450143180118,0.0,0.0,0.0,1.0
1718117780.8600426,map,True,False,6,4,0.0,0.0,1.0605792999267578,-1.5247374773025513,0.0,0.0,0.0,0.020918491181943017,0.9997811823095999,2.952938465600101,-5.834515500747117,0.8031450143180118,0.0,0.0,0.0,1.0
1718117780.8642118,map,True,False,6,4,0.0,0.0,1.0605792999267578,-1.5247374773025513,0.0,0.0,0.0,0.020918491181943017,0.9997811823095999,2.952938465600101,-5.834515500747117,0.8031450143180118,0.0,0.0,0.0,1.0
1718117780.8668902,map,True,False,6,4,0.0,0.0,1.0605792999267578,-1.5247374773025513,0.0,0.0,0.0,0.020918491181943017,0.9997811823095999,2.952938465600101,-5.834515500747117,0.8031450143180118,0.0,0.0,0.0,1.0
1718117780.8710046,map,True,False,6,4,0.0,0.0,1.0605792999267578,-1.5247374773025513,0.0,0.0,0.0,0.020918491181943017,0.9997811823095999,2.952938465600101,-5.834515500747117,0.8031450143180118,0.0,0.0,0.0,1.0
1718117780.8747046,map,True,False,6,4,0.0,0.0,1.0605792999267578,-1.5247374773025513,0.0,0.0,0.0,0.020918491181943017,0.9997811823095999,2.952938465600101,-5.834515500747117,0.8031450143180118,0.0,0.0,0.0,1.0
1718117780.8787084,map,True,False,6,4,0.0,0.0,1.0605792999267578,-1.5247374773025513,0.0,0.0,0.0,0.020918491181943017,0.9997811823095999,2.952938465600101,-5.834515500747117,0.8031450143180118,0.0,0.0,0.0,1.0
1718117780.8873084,map,True,False,6,4,0.0,0.0,1.0605792999267578,-1.5247374773025513,0.0,0.0,0.0,0.020918491181943017,0.9997811823095999,2.952938465600101,-5.834515500747117,0.8031450143180118,0.0,0.0,0.0,1.0
1718117780.8902726,map,True,False,6,4,0.0,0.0,1.0605792999267578,-1.5247374773025513,0.0,0.0,0.0,0.020918491181943017,0.9997811823095999,2.952938465600101,-5.834515500747117,0.8031450143180118,0.0,0.0,0.0,1.0
1718117780.895404,map,True,False,6,4,0.0,0.0,1.0605792999267578,-1.5247374773025513,0.0,0.0,0.0,0.020918491181943017,0.9997811823095999,2.952938465600101,-5.834515500747117,0.8031450143180118,0.0,0.0,0.0,1.0
1718117780.9000242,map,True,False,6,4,0.0,0.0,1.0605792999267578,-1.5247374773025513,0.0,0.0,0.0,0.020918491181943017,0.9997811823095999,2.952938465600101,-5.834515500747117,0.8031450143180118,0.0,0.0,0.0,1.0
1718117780.9032388,map,True,False,6,4,0.0,0.0,1.0605792999267578,-1.5247374773025513,0.0,0.0,0.0,0.020918491181943017,0.9997811823095999,2.952938465600101,-5.834515500747117,0.8031450143180118,0.0,0.0,0.0,1.0
1718117780.9075406,map,True,False,6,4,0.0,0.0,1.0605792999267578,-1.5247374773025513,0.0,0.0,0.0,0.020918491181943017,0.9997811823095999,2.952938465600101,-5.834515500747117,0.8031450143180118,0.0,0.0,0.0,1.0
1718117780.911414,map,True,False,6,4,0.0,0.0,1.0605792999267578,-1.5247374773025513,0.0,0.0,0.0,0.020918491181943017,0.9997811823095999,2.952938465600101,-5.834515500747117,0.8031450143180118,0.0,0.0,0.0,1.0
1718117780.9154034,map,True,False,6,4,0.0,0.0,1.0605792999267578,-1.5247374773025513,0.0,0.0,0.0,0.020918491181943017,0.9997811823095999,2.952938465600101,-5.834515500747117,0.8031450143180118,0.0,0.0,0.0,1.0
1718117780.923275,map,True,False,6,4,0.0,0.0,1.0605792999267578,-1.5247374773025513,0.0,0.0,0.0,0.020918491181943017,0.9997811823095999,2.952938465600101,-5.834515500747117,0.8031450143180118,0.0,0.0,0.0,1.0
1718117780.929667,map,True,False,6,4,0.0,0.0,1.0605792999267578,-1.5247374773025513,0.0,0.0,0.0,0.020918491181943017,0.9997811823095999,2.952938465600101,-5.834515500747117,0.8031450143180118,0.0,0.0,0.0,1.0
1718117780.9322226,map,True,False,6,4,0.0,0.0,1.0605792999267578,-1.5247374773025513,0.0,0.0,0.0,0.020918491181943017,0.9997811823095999,2.952938465600101,-5.834515500747117,0.8031450143180118,0.0,0.0,0.0,1.0
1718117780.9355757,map,True,False,6,4,0.0,0.0,1.0605792999267578,-1.5247374773025513,0.0,0.0,0.0,0.020918491181943017,0.9997811823095999,2.952938465600101,-5.834515500747117,0.8031450143180118,0.0,0.0,0.0,1.0
1718117780.938742,map,True,False,6,4,0.0,0.0,1.0605792999267578,-1.5247374773025513,0.0,0.0,0.0,0.020918491181943017,0.9997811823095999,2.952938465600101,-5.834515500747117,0.8031450143180118,0.0,0.0,0.0,1.0
1718117780.9437833,map,True,False,6,4,0.0,0.0,1.0605792999267578,-1.5247374773025513,0.0,0.0,0.0,0.020918491181943017,0.9997811823095999,2.952938465600101,-5.834515500747117,0.8031450143180118,0.0,0.0,0.0,1.0
1718117780.9487672,map,True,False,6,4,0.0,0.0,1.0605792999267578,-1.5247374773025513,0.0,0.0,0.0,0.020918491181943017,0.9997811823095999,2.952938465600101,-5.834515500747117,0.8031450143180118,0.0,0.0,0.0,1.0
1718117780.9519303,map,True,False,6,4,0.0,0.0,1.0605792999267578,-1.5247374773025513,0.0,0.0,0.0,0.020918491181943017,0.9997811823095999,2.952938465600101,-5.834515500747117,0.8031450143180118,0.0,0.0,0.0,1.0
1718117780.9550183,map,True,False,6,4,0.0,0.0,1.0605792999267578,-1.5247374773025513,0.0,0.0,0.0,0.020918491181943017,0.9997811823095999,2.952938465600101,-5.834515500747117,0.8031450143180118,0.0,0.0,0.0,1.0
1718117780.9597774,map,True,False,6,4,0.0,0.0,1.0605792999267578,-1.5247374773025513,0.0,0.0,0.0,0.020918491181943017,0.9997811823095999,2.952938465600101,-5.834515500747117,0.8031450143180118,0.0,0.0,0.0,1.0
1718117780.9634776,map,True,False,6,4,0.0,0.0,1.0605792999267578,-1.5247374773025513,0.0,0.0,0.0,0.020918491181943017,0.9997811823095999,2.952938465600101,-5.834515500747117,0.8031450143180118,0.0,0.0,0.0,1.0
1718117780.9674006,map,True,False,6,4,0.0,0.0,1.0605792999267578,-1.5247374773025513,0.0,0.0,0.0,0.020918491181943017,0.9997811823095999,2.952938465600101,-5.834515500747117,0.8031450143180118,0.0,0.0,0.0,1.0
1718117780.9749415,map,True,False,6,4,0.0,0.0,1.0605792999267578,-1.5247374773025513,0.0,0.0,0.0,0.020918491181943017,0.9997811823095999,2.952938465600101,-5.834515500747117,0.8031450143180118,0.0,0.0,0.0,1.0
1718117780.9792635,map,True,False,6,4,0.0,0.0,1.0605792999267578,-1.5247374773025513,0.0,0.0,0.0,0.020918491181943017,0.9997811823095999,2.952938465600101,-5.834515500747117,0.8031450143180118,0.0,0.0,0.0,1.0
1718117780.982371,map,True,False,6,4,0.0,0.0,1.0605792999267578,-1.5247374773025513,0.0,0.0,0.0,0.020918491181943017,0.9997811823095999,2.952938465600101,-5.834515500747117,0.8031450143180118,0.0,0.0,0.0,1.0
1718117780.9866588,map,True,False,6,4,0.0,0.0,1.0605792999267578,-1.5247374773025513,0.0,0.0,0.0,0.020918491181943017,0.9997811823095999,2.952938465600101,-5.834515500747117,0.8031450143180118,0.0,0.0,0.0,1.0
1718117780.9913163,map,True,False,6,4,0.0,0.0,1.0605792999267578,-1.5247374773025513,0.0,0.0,0.0,0.020918491181943017,0.9997811823095999,2.952938465600101,-5.834515500747117,0.8031450143180118,0.0,0.0,0.0,1.0
1718117780.9964042,map,True,False,6,4,0.0,0.0,1.0605792999267578,-1.5247374773025513,0.0,0.0,0.0,0.020918491181943017,0.9997811823095999,2.952938465600101,-5.834515500747117,0.8031450143180118,0.0,0.0,0.0,1.0
1718117780.9999955,map,True,False,6,4,0.0,0.0,1.0605792999267578,-1.5247374773025513,0.0,0.0,0.0,0.020918491181943017,0.9997811823095999,2.952938465600101,-5.834515500747117,0.8031450143180118,0.0,0.0,0.0,1.0
1718117781.0076895,map,True,False,6,5,0.0,0.0,1.0605792999267578,-1.5247374773025513,0.0,0.0,0.0,0.020918491181943017,0.9997811823095999,3.192346090360381,-6.140929666757792,0.8130911403653045,0.0,0.0,0.0,1.0
1718117781.0118697,map,True,False,6,5,0.0,0.0,1.0605792999267578,-1.5247374773025513,0.0,0.0,0.0,0.020918491181943017,0.9997811823095999,3.192346090360381,-6.140929666757792,0.8130911403653045,0.0,0.0,0.0,1.0
1718117781.0160794,map,True,False,6,5,0.0,0.0,1.0605792999267578,-1.5247374773025513,0.0,0.0,0.0,0.020918491181943017,0.9997811823095999,3.192346090360381,-6.140929666757792,0.8130911403653045,0.0,0.0,0.0,1.0
1718117781.0218663,map,True,False,6,5,0.0,0.0,1.0605792999267578,-1.5247374773025513,0.0,0.0,0.0,0.020918491181943017,0.9997811823095999,3.1923306003861422,-6.14100509254712,0.7984282694237683,0.0,0.0,0.0,1.0
1718117781.024349,map,True,False,6,5,0.0,0.0,1.0605792999267578,-1.5247374773025513,0.0,0.0,0.0,0.020918491181943017,0.9997811823095999,3.1923306003861422,-6.14100509254712,0.7984282694237683,0.0,0.0,0.0,1.0
1718117781.0345469,map,True,False,6,4,0.0,0.0,1.0605792999267578,-1.5247374773025513,0.0,0.0,0.0,0.020918491181943017,0.9997811823095999,3.1461613067833256,-5.933203455627414,0.7932041982568558,0.0,0.0,0.0,1.0
1718117781.0433044,map,True,False,6,4,0.0,0.0,1.0605792999267578,-1.5247374773025513,0.0,0.0,0.0,0.020918491181943017,0.9997811823095999,3.1461613067833256,-5.933203455627414,0.7932041982568558,0.0,0.0,0.0,1.0
1718117781.053963,map,True,False,6,4,0.0,0.0,1.0605792999267578,-1.5247374773025513,0.0,0.0,0.0,0.020918491181943017,0.9997811823095999,3.1461613067833256,-5.933203455627414,0.7932041982568558,0.0,0.0,0.0,1.0
1718117781.0573812,map,True,False,6,4,0.0,0.0,1.0605792999267578,-1.5247374773025513,0.0,0.0,0.0,0.020918491181943017,0.9997811823095999,3.1461613067833256,-5.933203455627414,0.7932041982568558,0.0,0.0,0.0,1.0
1718117781.0603993,map,True,False,6,4,0.0,0.0,1.0605792999267578,-1.5247374773025513,0.0,0.0,0.0,0.020918491181943017,0.9997811823095999,3.1461613067833256,-5.933203455627414,0.7932041982568558,0.0,0.0,0.0,1.0
1718117781.0844753,map,True,False,6,4,0.0,0.0,1.0605792999267578,-1.5247374773025513,0.0,0.0,0.0,0.020918491181943017,0.9997811823095999,3.1461613067833256,-5.933203455627414,0.7932041982568558,0.0,0.0,0.0,1.0
1718117781.087105,map,True,False,6,4,0.0,0.0,1.0605792999267578,-1.5247374773025513,0.0,0.0,0.0,0.020918491181943017,0.9997811823095999,3.1461613067833256,-5.933203455627414,0.7932041982568558,0.0,0.0,0.0,1.0
1718117781.092433,map,True,False,6,4,0.0,0.0,1.0605792999267578,-1.5247374773025513,0.0,0.0,0.0,0.020918491181943017,0.9997811823095999,3.1461613067833256,-5.933203455627414,0.7932041982568558,0.0,0.0,0.0,1.0
1718117781.0977006,map,True,False,6,4,0.0,0.0,1.0605792999267578,-1.5247374773025513,0.0,0.0,0.0,0.020918491181943017,0.9997811823095999,3.1461613067833256,-5.933203455627414,0.7932041982568558,0.0,0.0,0.0,1.0
1718117781.1058052,map,True,False,6,4,0.0,0.0,1.0605792999267578,-1.5247374773025513,0.0,0.0,0.0,0.020918491181943017,0.9997811823095999,3.1461613067833256,-5.933203455627414,0.7932041982568558,0.0,0.0,0.0,1.0
1718117781.1081512,map,True,False,6,4,0.0,0.0,1.0605792999267578,-1.5247374773025513,0.0,0.0,0.0,0.020918491181943017,0.9997811823095999,3.1461613067833256,-5.933203455627414,0.7932041982568558,0.0,0.0,0.0,1.0
1718117781.157798,map,True,False,6,4,0.0,0.0,1.0605792999267578,-1.5247374773025513,0.0,0.0,0.0,0.020918491181943017,0.9997811823095999,3.1461613067833256,-5.933203455627414,0.7932041982568558,0.0,0.0,0.0,1.0
1718117781.208335,map,True,False,6,4,0.0,0.0,1.0605792999267578,-1.5247374773025513,0.0,0.0,0.0,0.020918491181943017,0.9997811823095999,3.1461613067833256,-5.933203455627414,0.7932041982568558,0.0,0.0,0.0,1.0
1718117781.3600233,map,True,False,6,4,0.0,0.0,1.0605792999267578,-1.5247374773025513,0.0,0.0,0.0,0.020918491181943017,0.9997811823095999,3.0412587529767063,-5.225974496571202,0.7874754152376066,0.0,0.0,0.0,1.0
1718117781.41021,map,True,False,6,4,0.0,0.0,1.0605792999267578,-1.5247374773025513,0.0,0.0,0.0,0.020918491181943017,0.9997811823095999,3.0412587529767063,-5.225974496571202,0.7874754152376066,0.0,0.0,0.0,1.0
1718117781.511273,map,True,False,6,4,0.0,0.0,1.0605792999267578,-1.5247374773025513,0.0,0.0,0.0,0.020918491181943017,0.9997811823095999,3.0412587529767063,-5.225974496571202,0.7874754152376066,0.0,0.0,0.0,1.0
1718117781.6097262,map,True,False,6,4,0.0,0.0,1.0605792999267578,-1.5247374773025513,0.0,0.0,0.0,0.020918491181943017,0.9997811823095999,3.0412587529767063,-5.225974496571202,0.7874754152376066,0.0,0.0,0.0,1.0
1718117781.6609104,map,True,False,6,4,0.0,0.0,1.0605792999267578,-1.5247374773025513,0.0,0.0,0.0,0.020918491181943017,0.9997811823095999,3.0412587529767063,-5.225974496571202,0.7874754152376066,0.0,0.0,0.0,1.0
1718117781.710448,map,True,False,6,3,0.0,0.0,1.1830451488494873,-1.5511058568954468,0.0,0.0,0.0,0.021736111466359176,0.9997637439831412,3.1073303270793566,-4.968765542248843,0.7692552060786726,0.0,0.0,0.0,1.0
1718117781.8104517,map,True,False,6,3,0.0,0.0,1.1830451488494873,-1.5511058568954468,0.0,0.0,0.0,0.021736111466359176,0.9997637439831412,3.1073303270793566,-4.968765542248843,0.7692552060786726,0.0,0.0,0.0,1.0
1718117781.9108334,map,True,False,6,3,0.0,0.0,1.1830451488494873,-1.5511058568954468,0.0,0.0,0.0,0.021736111466359176,0.9997637439831412,3.1073303270793566,-4.968765542248843,0.7692552060786726,0.0,0.0,0.0,1.0
1718117781.964525,map,True,False,6,3,0.0,0.0,1.1830451488494873,-1.5511058568954468,0.0,0.0,0.0,0.021736111466359176,0.9997637439831412,3.1073303270793566,-4.968765542248843,0.7692552060786726,0.0,0.0,0.0,1.0
1718117782.062876,map,True,False,6,4,0.0,0.0,1.1830451488494873,-1.5511058568954468,0.0,0.0,0.0,0.021736111466359176,0.9997637439831412,3.2795193693988027,-5.2011149149266265,0.7751709884619252,0.0,0.0,0.0,1.0
1718117782.115333,map,True,False,6,4,0.0,0.0,1.1830451488494873,-1.5511058568954468,0.0,0.0,0.0,0.021736111466359176,0.9997637439831412,3.2795193693988027,-5.2011149149266265,0.7751709884619252,0.0,0.0,0.0,1.0
1718117782.2130775,map,True,False,6,4,0.0,0.0,1.1830451488494873,-1.5511058568954468,0.0,0.0,0.0,0.021736111466359176,0.9997637439831412,3.2795193693988027,-5.2011149149266265,0.7751709884619252,0.0,0.0,0.0,1.0
1718117782.4135058,map,True,False,6,3,0.0,0.0,1.1830451488494873,-1.5511058568954468,0.0,0.0,0.0,0.021736111466359176,0.9997637439831412,3.214550092571807,-4.539499905310601,0.7486659665244499,0.0,0.0,0.0,1.0
1718117782.5137303,map,True,False,5,3,0.0,0.0,1.3103253841400146,-1.5788401365280151,0.0,0.0,0.0,0.02412179518426199,0.9997090273963233,3.214550092571807,-4.539499905310601,0.7486659665244499,0.0,0.0,0.0,1.0
1718117782.6136827,map,True,False,5,3,0.0,0.0,1.3103253841400146,-1.5788401365280151,0.0,0.0,0.0,0.02412179518426199,0.9997090273963233,3.214550092571807,-4.539499905310601,0.7486659665244499,0.0,0.0,0.0,1.0
1718117782.664593,map,True,False,5,3,0.0,0.0,1.3103253841400146,-1.5788401365280151,0.0,0.0,0.0,0.02412179518426199,0.9997090273963233,3.2280489952581544,-4.417303289241109,0.7457206492592529,0.0,0.0,0.0,1.0
1718117782.765509,map,True,False,5,3,0.0,0.0,1.3103253841400146,-1.5788401365280151,0.0,0.0,0.0,0.02412179518426199,0.9997090273963233,3.177765396854177,-4.261682655271759,0.7510050779154959,0.0,0.0,0.0,1.0
1718117782.8657362,map,True,False,5,3,0.0,0.0,1.3103253841400146,-1.5788401365280151,0.0,0.0,0.0,0.02412179518426199,0.9997090273963233,3.177765396854177,-4.261682655271759,0.7510050779154959,0.0,0.0,0.0,1.0
1718117782.921971,map,True,False,5,3,0.0,0.0,1.3103253841400146,-1.5788401365280151,0.0,0.0,0.0,0.02412179518426199,0.9997090273963233,3.177765396854177,-4.261682655271759,0.7510050779154959,0.0,0.0,0.0,1.0
1718117782.9723604,map,True,False,5,3,0.0,0.0,1.3103253841400146,-1.5788401365280151,0.0,0.0,0.0,0.02412179518426199,0.9997090273963233,3.177765396854177,-4.261682655271759,0.7510050779154959,0.0,0.0,0.0,1.0
1718117782.98529,map,True,False,5,3,0.0,0.0,1.3103253841400146,-1.5788401365280151,0.0,0.0,0.0,0.02412179518426199,0.9997090273963233,3.177765396854177,-4.261682655271759,0.7510050779154959,0.0,0.0,0.0,1.0
1718117782.9875515,map,True,False,5,3,0.0,0.0,1.3103253841400146,-1.5788401365280151,0.0,0.0,0.0,0.02412179518426199,0.9997090273963233,3.177765396854177,-4.261682655271759,0.7510050779154959,0.0,0.0,0.0,1.0
1718117783.0344408,map,True,False,5,3,0.0,0.0,1.3103253841400146,-1.5788401365280151,0.0,0.0,0.0,0.02412179518426199,0.9997090273963233,3.3781598971139473,-4.315014992896639,0.753239654609161,0.0,0.0,0.0,1.0
1718117783.0386746,map,True,False,5,3,0.0,0.0,1.3103253841400146,-1.5788401365280151,0.0,0.0,0.0,0.02412179518426199,0.9997090273963233,3.3781598971139473,-4.315014992896639,0.753239654609161,0.0,0.0,0.0,1.0
1718117783.0428953,map,True,False,5,3,0.0,0.0,1.3103253841400146,-1.5788401365280151,0.0,0.0,0.0,0.02412179518426199,0.9997090273963233,3.3781598971139473,-4.315014992896639,0.753239654609161,0.0,0.0,0.0,1.0
1718117783.0467641,map,True,False,5,3,0.0,0.0,1.3103253841400146,-1.5788401365280151,0.0,0.0,0.0,0.02412179518426199,0.9997090273963233,3.3781598971139473,-4.315014992896639,0.753239654609161,0.0,0.0,0.0,1.0
1718117783.060314,map,True,False,5,3,0.0,0.0,1.3103253841400146,-1.5788401365280151,0.0,0.0,0.0,0.02412179518426199,0.9997090273963233,3.3781598971139473,-4.315014992896639,0.753239654609161,0.0,0.0,0.0,1.0
1718117783.0633607,map,True,False,5,3,0.0,0.0,1.3103253841400146,-1.5788401365280151,0.0,0.0,0.0,0.02412179518426199,0.9997090273963233,3.3781598971139473,-4.315014992896639,0.753239654609161,0.0,0.0,0.0,1.0
1718117783.0674264,map,True,False,5,3,0.0,0.0,1.3103253841400146,-1.5788401365280151,0.0,0.0,0.0,0.02412179518426199,0.9997090273963233,3.3781598971139473,-4.315014992896639,0.753239654609161,0.0,0.0,0.0,1.0
1718117783.0813088,map,True,False,5,3,0.0,0.0,1.3103253841400146,-1.5788401365280151,0.0,0.0,0.0,0.02412179518426199,0.9997090273963233,3.3781598971139473,-4.315014992896639,0.753239654609161,0.0,0.0,0.0,1.0
1718117783.0874348,map,True,False,5,3,0.0,0.0,1.3103253841400146,-1.5788401365280151,0.0,0.0,0.0,0.02412179518426199,0.9997090273963233,3.3781598971139473,-4.315014992896639,0.753239654609161,0.0,0.0,0.0,1.0
1718117783.090986,map,True,False,5,3,0.0,0.0,1.3103253841400146,-1.5788401365280151,0.0,0.0,0.0,0.02412179518426199,0.9997090273963233,3.3781598971139473,-4.315014992896639,0.753239654609161,0.0,0.0,0.0,1.0
1718117783.103907,map,True,False,5,3,0.0,0.0,1.3103253841400146,-1.5788401365280151,0.0,0.0,0.0,0.02412179518426199,0.9997090273963233,3.3781598971139473,-4.315014992896639,0.753239654609161,0.0,0.0,0.0,1.0
1718117783.1271565,map,True,False,5,3,0.0,0.0,1.3103253841400146,-1.5788401365280151,0.0,0.0,0.0,0.02412179518426199,0.9997090273963233,3.3781598971139473,-4.315014992896639,0.753239654609161,0.0,0.0,0.0,1.0
1718117783.1367,map,True,False,5,3,0.0,0.0,1.3103253841400146,-1.5788401365280151,0.0,0.0,0.0,0.02412179518426199,0.9997090273963233,3.3781598971139473,-4.315014992896639,0.753239654609161,0.0,0.0,0.0,1.0
1718117783.1391644,map,True,False,5,3,0.0,0.0,1.3103253841400146,-1.5788401365280151,0.0,0.0,0.0,0.02412179518426199,0.9997090273963233,3.3781598971139473,-4.315014992896639,0.753239654609161,0.0,0.0,0.0,1.0
1718117783.1428244,map,True,False,5,3,0.0,0.0,1.3103253841400146,-1.5788401365280151,0.0,0.0,0.0,0.02412179518426199,0.9997090273963233,3.3781598971139473,-4.315014992896639,0.753239654609161,0.0,0.0,0.0,1.0
1718117783.1516876,map,True,False,5,3,0.0,0.0,1.3103253841400146,-1.5788401365280151,0.0,0.0,0.0,0.02412179518426199,0.9997090273963233,3.3781598971139473,-4.315014992896639,0.753239654609161,0.0,0.0,0.0,1.0
1718117783.1554134,map,True,False,5,3,0.0,0.0,1.3103253841400146,-1.5788401365280151,0.0,0.0,0.0,0.02412179518426199,0.9997090273963233,3.3781598971139473,-4.315014992896639,0.753239654609161,0.0,0.0,0.0,1.0
1718117783.1595595,map,True,False,5,3,0.0,0.0,1.3103253841400146,-1.5788401365280151,0.0,0.0,0.0,0.02412179518426199,0.9997090273963233,3.3781598971139473,-4.315014992896639,0.753239654609161,0.0,0.0,0.0,1.0
1718117783.1709912,map,True,False,5,3,0.0,0.0,1.3103253841400146,-1.5788401365280151,0.0,0.0,0.0,0.02412179518426199,0.9997090273963233,3.3781598971139473,-4.315014992896639,0.753239654609161,0.0,0.0,0.0,1.0
1718117783.230357,map,True,False,5,3,0.0,0.0,1.3103253841400146,-1.5788401365280151,0.0,0.0,0.0,0.02412179518426199,0.9997090273963233,3.3781598971139473,-4.315014992896639,0.753239654609161,0.0,0.0,0.0,1.0
1718117783.3795865,map,True,False,5,3,0.0,0.0,1.493302345275879,-1.6245783567428589,0.0,0.0,0.0,0.026807946160409334,0.9996406088179607,3.3344720562451773,-4.071682848598932,0.7426964659223625,0.0,0.0,0.0,1.0
1718117783.4321795,map,True,False,5,3,0.0,0.0,1.493302345275879,-1.6245783567428589,0.0,0.0,0.0,0.026807946160409334,0.9996406088179607,3.3344720562451773,-4.071682848598932,0.7426964659223625,0.0,0.0,0.0,1.0
1718117783.4807024,map,True,False,5,3,0.0,0.0,1.493302345275879,-1.6245783567428589,0.0,0.0,0.0,0.026807946160409334,0.9996406088179607,3.3344720562451773,-4.071682848598932,0.7426964659223625,0.0,0.0,0.0,1.0
1718117783.5800264,map,True,False,5,3,0.0,0.0,1.493302345275879,-1.6245783567428589,0.0,0.0,0.0,0.026807946160409334,0.9996406088179607,3.3344720562451773,-4.071682848598932,0.7426964659223625,0.0,0.0,0.0,1.0
1718117783.6319313,map,True,False,5,3,0.0,0.0,1.493302345275879,-1.6245783567428589,0.0,0.0,0.0,0.026807946160409334,0.9996406088179607,3.3344720562451773,-4.071682848598932,0.7426964659223625,0.0,0.0,0.0,1.0
1718117783.7333376,map,True,False,5,2,0.0,0.0,1.493302345275879,-1.6245783567428589,0.0,0.0,0.0,0.026807946160409334,0.9996406088179607,3.4162071207266154,-3.755977789975276,0.7132121620159106,0.0,0.0,0.0,1.0
1718117783.784114,map,True,False,5,2,0.0,0.0,1.493302345275879,-1.6245783567428589,0.0,0.0,0.0,0.026807946160409334,0.9996406088179607,3.4162071207266154,-3.755977789975276,0.7132121620159106,0.0,0.0,0.0,1.0
1718117783.832594,map,True,False,5,2,0.0,0.0,1.493302345275879,-1.6245783567428589,0.0,0.0,0.0,0.026807946160409334,0.9996406088179607,3.4162071207266154,-3.755977789975276,0.7132121620159106,0.0,0.0,0.0,1.0
1718117783.8834105,map,True,False,5,2,0.0,0.0,1.493302345275879,-1.6245783567428589,0.0,0.0,0.0,0.026807946160409334,0.9996406088179607,3.4162071207266154,-3.755977789975276,0.7132121620159106,0.0,0.0,0.0,1.0
1718117783.9363317,map,True,False,5,2,0.0,0.0,1.5237740278244019,-1.6253993511199951,0.0,0.0,0.0,0.027525917425762395,0.9996210959948463,3.4162071207266154,-3.755977789975276,0.7132121620159106,0.0,0.0,0.0,1.0
1718117784.034861,map,True,False,5,2,0.0,0.0,1.5237740278244019,-1.6253993511199951,0.0,0.0,0.0,0.027525917425762395,0.9996210959948463,3.4852149074448984,-3.4838813979938426,0.6992799695768842,0.0,0.0,0.0,1.0
1718117784.0854125,map,True,False,5,2,0.0,0.0,1.5237740278244019,-1.6253993511199951,0.0,0.0,0.0,0.027525917425762395,0.9996210959948463,3.4852149074448984,-3.4838813979938426,0.6992799695768842,0.0,0.0,0.0,1.0
1718117784.1852484,map,True,False,5,2,0.0,0.0,1.5237740278244019,-1.6253993511199951,0.0,0.0,0.0,0.027525917425762395,0.9996210959948463,3.4852149074448984,-3.4838813979938426,0.6992799695768842,0.0,0.0,0.0,1.0
1718117784.2359004,map,True,False,5,2,0.0,0.0,1.5237740278244019,-1.6253993511199951,0.0,0.0,0.0,0.027525917425762395,0.9996210959948463,3.4852149074448984,-3.4838813979938426,0.6992799695768842,0.0,0.0,0.0,1.0
1718117784.3852487,map,True,False,5,2,0.0,0.0,1.5237740278244019,-1.6253993511199951,0.0,0.0,0.0,0.027525917425762395,0.9996210959948463,3.5877317108777604,-3.3087417818665967,0.6817530646984892,0.0,0.0,0.0,1.0
1718117784.4351268,map,True,False,5,2,0.0,0.0,1.5237740278244019,-1.6253993511199951,0.0,0.0,0.0,0.027525917425762395,0.9996210959948463,3.5877317108777604,-3.3087417818665967,0.6817530646984892,0.0,0.0,0.0,1.0
1718117784.4854412,map,True,False,5,2,0.0,0.0,1.5237740278244019,-1.6253993511199951,0.0,0.0,0.0,0.027525917425762395,0.9996210959948463,3.5877317108777604,-3.3087417818665967,0.6817530646984892,0.0,0.0,0.0,1.0
1718117784.5362864,map,True,False,5,2,0.0,0.0,1.5237740278244019,-1.6253993511199951,0.0,0.0,0.0,0.027525917425762395,0.9996210959948463,3.5877317108777604,-3.3087417818665967,0.6817530646984892,0.0,0.0,0.0,1.0
1718117784.5862916,map,True,False,5,2,0.0,0.0,1.5237740278244019,-1.6253993511199951,0.0,0.0,0.0,0.027525917425762395,0.9996210959948463,3.5877317108777604,-3.3087417818665967,0.6817530646984892,0.0,0.0,0.0,1.0
1718117784.6365867,map,True,False,5,2,0.0,0.0,1.5237740278244019,-1.6253993511199951,0.0,0.0,0.0,0.027525917425762395,0.9996210959948463,3.5877317108777604,-3.3087417818665967,0.6817530646984892,0.0,0.0,0.0,1.0
1718117784.6868236,map,True,False,4,2,0.0,0.0,1.729562759399414,-1.663644790649414,0.0,0.0,0.0,0.028599022434994438,0.999590968878967,3.6580497998574497,-3.0898459657172355,0.681198388755782,0.0,0.0,0.0,1.0
1718117784.7372174,map,True,False,4,2,0.0,0.0,1.729562759399414,-1.663644790649414,0.0,0.0,0.0,0.028599022434994438,0.999590968878967,3.5746685915969696,-3.115525025575643,0.6814929458798471,0.0,0.0,0.0,1.0
1718117784.8390963,map,True,False,4,2,0.0,0.0,1.729562759399414,-1.663644790649414,0.0,0.0,0.0,0.028599022434994438,0.999590968878967,3.5746685915969696,-3.115525025575643,0.6814929458798471,0.0,0.0,0.0,1.0
1718117784.8889465,map,True,False,4,2,0.0,0.0,1.729562759399414,-1.663644790649414,0.0,0.0,0.0,0.028599022434994438,0.999590968878967,3.5746685915969696,-3.115525025575643,0.6814929458798471,0.0,0.0,0.0,1.0
1718117784.9408326,map,True,False,4,2,0.0,0.0,1.729562759399414,-1.663644790649414,0.0,0.0,0.0,0.028599022434994438,0.999590968878967,3.5746685915969696,-3.115525025575643,0.6814929458798471,0.0,0.0,0.0,1.0
1718117784.9917145,map,True,False,4,2,0.0,0.0,1.729562759399414,-1.663644790649414,0.0,0.0,0.0,0.028599022434994438,0.999590968878967,3.5746685915969696,-3.115525025575643,0.6814929458798471,0.0,0.0,0.0,1.0
1718117785.0930955,map,True,False,4,2,0.0,0.0,1.729562759399414,-1.663644790649414,0.0,0.0,0.0,0.028599022434994438,0.999590968878967,3.7492154070194963,-2.835294081391213,0.6804893975957932,0.0,0.0,0.0,1.0
1718117785.141381,map,True,False,4,2,0.0,0.0,1.729562759399414,-1.663644790649414,0.0,0.0,0.0,0.028599022434994438,0.999590968878967,3.7492154070194963,-2.835294081391213,0.6804893975957932,0.0,0.0,0.0,1.0
1718117785.2404592,map,True,False,4,2,0.0,0.0,1.729562759399414,-1.663644790649414,0.0,0.0,0.0,0.028599022434994438,0.999590968878967,3.7492154070194963,-2.835294081391213,0.6804893975957932,0.0,0.0,0.0,1.0
1718117785.3903089,map,True,False,4,1,0.0,0.0,1.856986403465271,-1.688007116317749,0.0,0.0,0.0,0.02876555496335446,0.9995861836374619,3.684548681096259,-2.524887813263713,0.6819891652933113,0.0,0.0,0.0,1.0
1718117785.4901552,map,True,False,4,1,0.0,0.0,1.856986403465271,-1.688007116317749,0.0,0.0,0.0,0.02876555496335446,0.9995861836374619,3.684548681096259,-2.524887813263713,0.6819891652933113,0.0,0.0,0.0,1.0
1718117785.540754,map,True,False,4,1,0.0,0.0,1.856986403465271,-1.688007116317749,0.0,0.0,0.0,0.02876555496335446,0.9995861836374619,3.684548681096259,-2.524887813263713,0.6819891652933113,0.0,0.0,0.0,1.0
1718117785.5910497,map,True,False,4,1,0.0,0.0,1.856986403465271,-1.688007116317749,0.0,0.0,0.0,0.02876555496335446,0.9995861836374619,3.684548681096259,-2.524887813263713,0.6819891652933113,0.0,0.0,0.0,1.0
1718117785.6406703,map,True,False,4,1,0.0,0.0,1.856986403465271,-1.688007116317749,0.0,0.0,0.0,0.02876555496335446,0.9995861836374619,3.684548681096259,-2.524887813263713,0.6819891652933113,0.0,0.0,0.0,1.0
1718117785.693217,map,True,False,4,1,0.0,0.0,1.856986403465271,-1.688007116317749,0.0,0.0,0.0,0.02876555496335446,0.9995861836374619,3.778912866378509,-2.4023238896204453,0.6813767045484768,0.0,0.0,0.0,1.0
1718117785.7944174,map,True,False,4,1,0.0,0.0,1.856986403465271,-1.688007116317749,0.0,0.0,0.0,0.02876555496335446,0.9995861836374619,3.850716470389006,-2.3348050185040696,0.6846394815519862,0.0,0.0,0.0,1.0
1718117785.8419912,map,True,False,4,1,0.0,0.0,1.856986403465271,-1.688007116317749,0.0,0.0,0.0,0.02876555496335446,0.9995861836374619,3.850716470389006,-2.3348050185040696,0.6846394815519862,0.0,0.0,0.0,1.0
1718117785.8946955,map,True,False,4,1,0.0,0.0,1.856986403465271,-1.688007116317749,0.0,0.0,0.0,0.02876555496335446,0.9995861836374619,3.850716470389006,-2.3348050185040696,0.6846394815519862,0.0,0.0,0.0,1.0
1718117785.9437625,map,True,False,4,1,0.0,0.0,1.856986403465271,-1.688007116317749,0.0,0.0,0.0,0.02876555496335446,0.9995861836374619,3.850716470389006,-2.3348050185040696,0.6846394815519862,0.0,0.0,0.0,1.0
1718117785.9965732,map,True,False,4,1,0.0,0.0,1.856986403465271,-1.688007116317749,0.0,0.0,0.0,0.02876555496335446,0.9995861836374619,3.850716470389006,-2.3348050185040696,0.6846394815519862,0.0,0.0,0.0,1.0
1718117786.0451205,map,True,False,4,1,0.0,0.0,1.856986403465271,-1.688007116317749,0.0,0.0,0.0,0.02876555496335446,0.9995861836374619,3.850716470389006,-2.3348050185040696,0.6846394815519862,0.0,0.0,0.0,1.0
1718117786.0948672,map,True,False,4,1,0.0,0.0,1.856986403465271,-1.688007116317749,0.0,0.0,0.0,0.02876555496335446,0.9995861836374619,3.850716470389006,-2.3348050185040696,0.6846394815519862,0.0,0.0,0.0,1.0
1718117786.1943514,map,True,False,4,1,0.0,0.0,1.856986403465271,-1.688007116317749,0.0,0.0,0.0,0.02876555496335446,0.9995861836374619,3.850716470389006,-2.3348050185040696,0.6846394815519862,0.0,0.0,0.0,1.0
1718117786.2448506,map,True,False,4,1,0.0,0.0,1.949093222618103,-1.72426176071167,0.0,0.0,0.0,0.029505824473811466,0.9995646124980669,3.850716470389006,-2.3348050185040696,0.6846394815519862,0.0,0.0,0.0,1.0
