timestamp_sec,frame_id,game_played,yielding,player1discrete,player2discrete,player1yieldprob,player2yieldprob,player1_pose_x,player1_pose_y,player1_pose_z,player1_pose_orient_x,player1_pose_orient_y,player1_pose_orient_z,player1_pose_orient_w,player2_pose_x,player2_pose_y,player2_pose_z,player2_pose_orient_x,player2_pose_orient_y,player2_pose_orient_z,player2_pose_orient_w
1718124211.5729537,map,True,False,5,7,0.0,0.0,1.4717997312545776,-1.626983404159546,0.0,0.0,0.0,0.03318111073016801,0.9994493547969459,3.1820677137089013,-8.176377044662027,0.7523879238120783,0.0,0.0,0.0,1.0
1718124211.6228232,map,True,False,5,7,0.0,0.0,1.4717997312545776,-1.626983404159546,0.0,0.0,0.0,0.03318111073016801,0.9994493547969459,3.1820677137089013,-8.176377044662027,0.7523879238120783,0.0,0.0,0.0,1.0
1718124211.6739602,map,True,False,5,7,0.0,0.0,1.4717997312545776,-1.626983404159546,0.0,0.0,0.0,0.03318111073016801,0.9994493547969459,3.1820677137089013,-8.176377044662027,0.7523879238120783,0.0,0.0,0.0,1.0
1718124211.723403,map,True,False,5,7,0.0,0.0,1.4717997312545776,-1.626983404159546,0.0,0.0,0.0,0.03318111073016801,0.9994493547969459,3.1820677137089013,-8.176377044662027,0.7523879238120783,0.0,0.0,0.0,1.0
1718124211.8253329,map,True,False,5,7,0.0,0.0,1.4717997312545776,-1.626983404159546,0.0,0.0,0.0,0.03318111073016801,0.9994493547969459,3.1820677137089013,-8.176377044662027,0.7523879238120783,0.0,0.0,0.0,1.0
1718124211.8766613,map,True,False,5,6,0.0,0.0,1.4717997312545776,-1.626983404159546,0.0,0.0,0.0,0.03318111073016801,0.9994493547969459,3.2123981303362674,-7.882484305982418,0.8500600628714354,0.0,0.0,0.0,1.0
1718124211.9747787,map,True,False,5,7,0.0,0.0,1.4717997312545776,-1.626983404159546,0.0,0.0,0.0,0.03318111073016801,0.9994493547969459,3.2374151622995906,-8.070015999813407,0.8645692762512092,0.0,0.0,0.0,1.0
1718124212.075549,map,True,False,5,7,0.0,0.0,1.4717997312545776,-1.626983404159546,0.0,0.0,0.0,0.03318111073016801,0.9994493547969459,3.2374151622995906,-8.070015999813407,0.8645692762512092,0.0,0.0,0.0,1.0
1718124212.1255376,map,True,False,5,7,0.0,0.0,1.4717997312545776,-1.626983404159546,0.0,0.0,0.0,0.03318111073016801,0.9994493547969459,3.2374151622995906,-8.070015999813407,0.8645692762512092,0.0,0.0,0.0,1.0
1718124212.1767755,map,True,False,5,7,0.0,0.0,1.4717997312545776,-1.626983404159546,0.0,0.0,0.0,0.03318111073016801,0.9994493547969459,3.2374151622995906,-8.070015999813407,0.8645692762512092,0.0,0.0,0.0,1.0
1718124212.2269623,map,True,False,5,6,0.0,0.0,1.4717997312545776,-1.626983404159546,0.0,0.0,0.0,0.03318111073016801,0.9994493547969459,3.216629170783831,-7.537360442334415,0.9794067135413036,0.0,0.0,0.0,1.0
1718124212.5269787,map,True,False,5,6,0.0,0.0,1.5487786531448364,-1.6411648988723755,0.0,0.0,0.0,0.033858325598016444,0.9994266475670113,3.2658263408040886,-7.493132403319214,0.9246200732169526,0.0,0.0,0.0,1.0
1718124212.5781069,map,True,False,5,6,0.0,0.0,1.5487786531448364,-1.6411648988723755,0.0,0.0,0.0,0.033858325598016444,0.9994266475670113,3.2658263408040886,-7.493132403319214,0.9246200732169526,0.0,0.0,0.0,1.0
1718124212.6285143,map,True,False,5,6,0.0,0.0,1.5487786531448364,-1.6411648988723755,0.0,0.0,0.0,0.033858325598016444,0.9994266475670113,3.2658263408040886,-7.493132403319214,0.9246200732169526,0.0,0.0,0.0,1.0
1718124212.6786847,map,True,False,5,6,0.0,0.0,1.5487786531448364,-1.6411648988723755,0.0,0.0,0.0,0.033858325598016444,0.9994266475670113,3.2658263408040886,-7.493132403319214,0.9246200732169526,0.0,0.0,0.0,1.0
1718124212.7305815,map,True,False,5,6,0.0,0.0,1.5487786531448364,-1.6411648988723755,0.0,0.0,0.0,0.033858325598016444,0.9994266475670113,3.2658263408040886,-7.493132403319214,0.9246200732169526,0.0,0.0,0.0,1.0
1718124212.7812517,map,True,False,5,6,0.0,0.0,1.5487786531448364,-1.6411648988723755,0.0,0.0,0.0,0.033858325598016444,0.9994266475670113,3.2658263408040886,-7.493132403319214,0.9246200732169526,0.0,0.0,0.0,1.0
1718124212.8353055,map,True,False,5,6,0.0,0.0,1.5487786531448364,-1.6411648988723755,0.0,0.0,0.0,0.033858325598016444,0.9994266475670113,3.2658263408040886,-7.493132403319214,0.9246200732169526,0.0,0.0,0.0,1.0
1718124212.931396,map,True,False,5,6,0.0,0.0,1.5487786531448364,-1.6411648988723755,0.0,0.0,0.0,0.033858325598016444,0.9994266475670113,3.3683214663073224,-7.7420223543665525,0.7114782439973342,0.0,0.0,0.0,1.0
1718124212.9840248,map,True,False,5,6,0.0,0.0,1.5487786531448364,-1.6411648988723755,0.0,0.0,0.0,0.033858325598016444,0.9994266475670113,3.3683214663073224,-7.7420223543665525,0.7114782439973342,0.0,0.0,0.0,1.0
1718124213.082558,map,True,False,5,6,0.0,0.0,1.5487786531448364,-1.6411648988723755,0.0,0.0,0.0,0.033858325598016444,0.9994266475670113,3.3683214663073224,-7.7420223543665525,0.7114782439973342,0.0,0.0,0.0,1.0
1718124213.1824777,map,True,False,5,6,0.0,0.0,1.5487786531448364,-1.6411648988723755,0.0,0.0,0.0,0.033858325598016444,0.9994266475670113,3.3843203329774925,-7.558360889890313,0.6845702627910906,0.0,0.0,0.0,1.0
1718124213.2339833,map,True,False,5,6,0.0,0.0,1.5487786531448364,-1.6411648988723755,0.0,0.0,0.0,0.033858325598016444,0.9994266475670113,3.3333797996017562,-7.12339795341137,0.9087097799344304,0.0,0.0,0.0,1.0
1718124213.5467572,map,True,False,4,5,0.0,0.0,1.6794424057006836,-1.6764230728149414,0.0,0.0,0.0,0.034644471939217054,0.9993997053584118,3.3861396229567875,-6.867027163715997,1.0045267455165496,0.0,0.0,0.0,1.0
1718124213.6477616,map,True,False,4,5,0.0,0.0,1.6794424057006836,-1.6764230728149414,0.0,0.0,0.0,0.034644471939217054,0.9993997053584118,3.3572468484614064,-6.6622305157708315,0.8744729019472647,0.0,0.0,0.0,1.0
1718124213.6966338,map,True,False,4,5,0.0,0.0,1.6794424057006836,-1.6764230728149414,0.0,0.0,0.0,0.034644471939217054,0.9993997053584118,3.3572468484614064,-6.6622305157708315,0.8744729019472647,0.0,0.0,0.0,1.0
1718124213.7496207,map,True,False,4,5,0.0,0.0,1.6794424057006836,-1.6764230728149414,0.0,0.0,0.0,0.034644471939217054,0.9993997053584118,3.3572468484614064,-6.6622305157708315,0.8744729019472647,0.0,0.0,0.0,1.0
1718124213.7994058,map,True,False,4,5,0.0,0.0,1.6794424057006836,-1.6764230728149414,0.0,0.0,0.0,0.034644471939217054,0.9993997053584118,3.3572468484614064,-6.6622305157708315,0.8744729019472647,0.0,0.0,0.0,1.0
1718124213.9060557,map,True,False,4,5,0.0,0.0,1.6794424057006836,-1.6764230728149414,0.0,0.0,0.0,0.034644471939217054,0.9993997053584118,3.379928975966559,-6.63363010568264,0.8440560748336166,0.0,0.0,0.0,1.0
1718124213.949356,map,True,False,4,5,0.0,0.0,1.6794424057006836,-1.6764230728149414,0.0,0.0,0.0,0.034644471939217054,0.9993997053584118,3.375369922047694,-6.600920948561271,0.8502183139312922,0.0,0.0,0.0,1.0
1718124214.0001416,map,True,False,4,5,0.0,0.0,1.6794424057006836,-1.6764230728149414,0.0,0.0,0.0,0.034644471939217054,0.9993997053584118,3.375369922047694,-6.600920948561271,0.8502183139312922,0.0,0.0,0.0,1.0
1718124214.099576,map,True,False,4,5,0.0,0.0,1.6794424057006836,-1.6764230728149414,0.0,0.0,0.0,0.034644471939217054,0.9993997053584118,3.375369922047694,-6.600920948561271,0.8502183139312922,0.0,0.0,0.0,1.0
1718124214.1521668,map,True,False,4,5,0.0,0.0,1.6794424057006836,-1.6764230728149414,0.0,0.0,0.0,0.034644471939217054,0.9993997053584118,3.375369922047694,-6.600920948561271,0.8502183139312922,0.0,0.0,0.0,1.0
1718124214.2025707,map,True,False,4,5,0.0,0.0,1.6970882415771484,-1.6820361614227295,0.0,0.0,0.0,0.03452156275181157,0.9994039547311991,3.375369922047694,-6.600920948561271,0.8502183139312922,0.0,0.0,0.0,1.0
1718124214.3002565,map,True,False,4,5,0.0,0.0,1.6970882415771484,-1.6820361614227295,0.0,0.0,0.0,0.03452156275181157,0.9994039547311991,3.5378213920463475,-6.7247178299226755,0.8174408163668797,0.0,0.0,0.0,1.0
1718124214.3994067,map,True,False,4,5,0.0,0.0,1.6970882415771484,-1.6820361614227295,0.0,0.0,0.0,0.03452156275181157,0.9994039547311991,3.5378213920463475,-6.7247178299226755,0.8174408163668797,0.0,0.0,0.0,1.0
1718124214.4495063,map,True,False,4,5,0.0,0.0,1.6970882415771484,-1.6820361614227295,0.0,0.0,0.0,0.03452156275181157,0.9994039547311991,3.5378213920463475,-6.7247178299226755,0.8174408163668797,0.0,0.0,0.0,1.0
1718124214.5490494,map,True,False,4,5,0.0,0.0,1.6970882415771484,-1.6820361614227295,0.0,0.0,0.0,0.03452156275181157,0.9994039547311991,3.5378213920463475,-6.7247178299226755,0.8174408163668797,0.0,0.0,0.0,1.0
1718124214.600093,map,True,False,4,5,0.0,0.0,1.6970882415771484,-1.6820361614227295,0.0,0.0,0.0,0.03452156275181157,0.9994039547311991,3.5596077634069143,-6.3159788746443555,0.812848518696461,0.0,0.0,0.0,1.0
1718124214.6992946,map,True,False,4,5,0.0,0.0,1.6970882415771484,-1.6820361614227295,0.0,0.0,0.0,0.03452156275181157,0.9994039547311991,3.5166202156689197,-6.00212062867399,0.8166550709082622,0.0,0.0,0.0,1.0
1718124214.7501395,map,True,False,4,5,0.0,0.0,1.6970882415771484,-1.6820361614227295,0.0,0.0,0.0,0.03452156275181157,0.9994039547311991,3.5166202156689197,-6.00212062867399,0.8166550709082622,0.0,0.0,0.0,1.0
1718124214.8004947,map,True,False,4,5,0.0,0.0,1.6970882415771484,-1.6820361614227295,0.0,0.0,0.0,0.03452156275181157,0.9994039547311991,3.5166202156689197,-6.00212062867399,0.8166550709082622,0.0,0.0,0.0,1.0
1718124214.8514404,map,True,False,4,5,0.0,0.0,1.6970882415771484,-1.6820361614227295,0.0,0.0,0.0,0.03452156275181157,0.9994039547311991,3.5166202156689197,-6.00212062867399,0.8166550709082622,0.0,0.0,0.0,1.0
1718124214.9519675,map,True,False,4,5,0.0,0.0,1.6970882415771484,-1.6820361614227295,0.0,0.0,0.0,0.03452156275181157,0.9994039547311991,3.5638979668687725,-5.980338429081302,0.8030824842420687,0.0,0.0,0.0,1.0
1718124215.0045567,map,True,False,4,5,0.0,0.0,1.6970882415771484,-1.6820361614227295,0.0,0.0,0.0,0.03452156275181157,0.9994039547311991,3.5638979668687725,-5.980338429081302,0.8030824842420687,0.0,0.0,0.0,1.0
1718124215.1027253,map,True,False,4,5,0.0,0.0,1.6970882415771484,-1.6820361614227295,0.0,0.0,0.0,0.03452156275181157,0.9994039547311991,3.5638979668687725,-5.980338429081302,0.8030824842420687,0.0,0.0,0.0,1.0
1718124215.152746,map,True,False,4,5,0.0,0.0,1.6970882415771484,-1.6820361614227295,0.0,0.0,0.0,0.03452156275181157,0.9994039547311991,3.5638979668687725,-5.980338429081302,0.8030824842420687,0.0,0.0,0.0,1.0
1718124215.2028604,map,True,False,4,5,0.0,0.0,1.9832618236541748,-1.7442400455474854,0.0,0.0,0.0,0.03679772423136685,0.9993227363981644,3.5638979668687725,-5.980338429081302,0.8030824842420687,0.0,0.0,0.0,1.0
1718124215.3032846,map,True,True,4,4,0.5922520728754596,0.5922520728754596,1.9832618236541748,-1.7442400455474854,0.0,0.0,0.0,0.03679772423136685,0.9993227363981644,3.6414906724570306,-5.881681890251828,0.7999714203566779,0.0,0.0,0.0,1.0
1718124215.4026027,map,True,True,4,4,0.5922520728754596,0.5922520728754596,1.9832618236541748,-1.7442400455474854,0.0,0.0,0.0,0.03679772423136685,0.9993227363981644,3.6414906724570306,-5.881681890251828,0.7999714203566779,0.0,0.0,0.0,1.0
1718124215.4538615,map,True,True,4,4,0.5922520728754596,0.5922520728754596,1.9832618236541748,-1.7442400455474854,0.0,0.0,0.0,0.03679772423136685,0.9993227363981644,3.6414906724570306,-5.881681890251828,0.7999714203566779,0.0,0.0,0.0,1.0
1718124215.5042439,map,True,False,4,4,0.5922520728754596,0.5922520728754596,1.9832618236541748,-1.7442400455474854,0.0,0.0,0.0,0.03679772423136685,0.9993227363981644,3.6414906724570306,-5.881681890251828,0.7999714203566779,0.0,0.0,0.0,1.0
1718124215.5549798,map,True,True,4,4,0.5922520728754596,0.5922520728754596,1.9832618236541748,-1.7442400455474854,0.0,0.0,0.0,0.03679772423136685,0.9993227363981644,3.6414906724570306,-5.881681890251828,0.7999714203566779,0.0,0.0,0.0,1.0
1718124215.6544995,map,True,True,4,4,0.5922520728754596,0.5922520728754596,1.9832618236541748,-1.7442400455474854,0.0,0.0,0.0,0.03679772423136685,0.9993227363981644,3.688298929893073,-5.732760994503573,0.7420128443671726,0.0,0.0,0.0,1.0
1718124215.7578568,map,True,False,4,4,0.5922520728754596,0.5922520728754596,1.9832618236541748,-1.7442400455474854,0.0,0.0,0.0,0.03679772423136685,0.9993227363981644,3.688298929893073,-5.732760994503573,0.7420128443671726,0.0,0.0,0.0,1.0
1718124215.8552644,map,True,True,4,4,0.5922520728754596,0.5922520728754596,1.9832618236541748,-1.7442400455474854,0.0,0.0,0.0,0.03679772423136685,0.9993227363981644,3.688298929893073,-5.732760994503573,0.7420128443671726,0.0,0.0,0.0,1.0
1718124215.9559882,map,True,True,4,4,0.5922520728754596,0.5922520728754596,1.9832618236541748,-1.7442400455474854,0.0,0.0,0.0,0.03679772423136685,0.9993227363981644,3.633828913168192,-5.132159292494112,0.7530001372187054,0.0,0.0,0.0,1.0
1718124216.0069883,map,True,True,4,4,0.5922520728754596,0.5922520728754596,1.9832618236541748,-1.7442400455474854,0.0,0.0,0.0,0.03679772423136685,0.9993227363981644,3.633828913168192,-5.132159292494112,0.7530001372187054,0.0,0.0,0.0,1.0
1718124216.057598,map,True,True,4,4,0.5922520728754596,0.5922520728754596,1.9832618236541748,-1.7442400455474854,0.0,0.0,0.0,0.03679772423136685,0.9993227363981644,3.633828913168192,-5.132159292494112,0.7530001372187054,0.0,0.0,0.0,1.0
1718124216.1570134,map,True,False,3,4,0.0,0.0,2.134147882461548,-1.788047432899475,0.0,0.0,0.0,0.03793576791655241,0.9992801787557984,3.633828913168192,-5.132159292494112,0.7530001372187054,0.0,0.0,0.0,1.0
1718124216.2074063,map,True,False,3,4,0.0,0.0,2.134147882461548,-1.788047432899475,0.0,0.0,0.0,0.03793576791655241,0.9992801787557984,3.633828913168192,-5.132159292494112,0.7530001372187054,0.0,0.0,0.0,1.0
1718124216.2583532,map,True,True,3,3,0.6616527499769684,0.6616527499769684,2.134147882461548,-1.788047432899475,0.0,0.0,0.0,0.03793576791655241,0.9992801787557984,3.6577912304835114,-4.8580724017726356,0.7422248140929175,0.0,0.0,0.0,1.0
1718124216.3084183,map,True,True,3,3,0.6616527499769684,0.6616527499769684,2.134147882461548,-1.788047432899475,0.0,0.0,0.0,0.03793576791655241,0.9992801787557984,3.656845362718662,-4.720258124300688,0.7130228007308068,0.0,0.0,0.0,1.0
1718124216.3614347,map,True,False,3,3,0.6616527499769684,0.6616527499769684,2.134147882461548,-1.788047432899475,0.0,0.0,0.0,0.03793576791655241,0.9992801787557984,3.656845362718662,-4.720258124300688,0.7130228007308068,0.0,0.0,0.0,1.0
1718124216.460554,map,True,True,3,3,0.6616527499769684,0.6616527499769684,2.134147882461548,-1.788047432899475,0.0,0.0,0.0,0.03793576791655241,0.9992801787557984,3.656845362718662,-4.720258124300688,0.7130228007308068,0.0,0.0,0.0,1.0
1718124216.5103965,map,True,True,3,3,0.6616527499769684,0.6616527499769684,2.134147882461548,-1.788047432899475,0.0,0.0,0.0,0.03793576791655241,0.9992801787557984,3.656845362718662,-4.720258124300688,0.7130228007308068,0.0,0.0,0.0,1.0
1718124216.560403,map,True,False,3,3,0.6616527499769684,0.6616527499769684,2.134147882461548,-1.788047432899475,0.0,0.0,0.0,0.03793576791655241,0.9992801787557984,3.656845362718662,-4.720258124300688,0.7130228007308068,0.0,0.0,0.0,1.0
1718124216.6609337,map,True,True,3,3,0.6616527499769684,0.6616527499769684,2.134147882461548,-1.788047432899475,0.0,0.0,0.0,0.03793576791655241,0.9992801787557984,3.7070050716953817,-4.788435124114941,0.7638213393014481,0.0,0.0,0.0,1.0
1718124216.760963,map,True,True,3,3,0.6616527499769684,0.6616527499769684,2.134147882461548,-1.788047432899475,0.0,0.0,0.0,0.03793576791655241,0.9992801787557984,3.7070050716953817,-4.788435124114941,0.7638213393014481,0.0,0.0,0.0,1.0
1718124216.8110278,map,True,True,3,3,0.6616527499769684,0.6616527499769684,2.134147882461548,-1.788047432899475,0.0,0.0,0.0,0.03793576791655241,0.9992801787557984,3.7070050716953817,-4.788435124114941,0.7638213393014481,0.0,0.0,0.0,1.0
1718124216.8625307,map,True,False,3,3,0.6616527499769684,0.6616527499769684,2.134147882461548,-1.788047432899475,0.0,0.0,0.0,0.03793576791655241,0.9992801787557984,3.7070050716953817,-4.788435124114941,0.7638213393014481,0.0,0.0,0.0,1.0
1718124216.9109652,map,True,False,3,3,0.6616527499769684,0.6616527499769684,2.134147882461548,-1.788047432899475,0.0,0.0,0.0,0.03793576791655241,0.9992801787557984,3.7070050716953817,-4.788435124114941,0.7638213393014481,0.0,0.0,0.0,1.0
1718124216.9622905,map,True,True,3,3,0.6616527499769684,0.6616527499769684,2.134147882461548,-1.788047432899475,0.0,0.0,0.0,0.03793576791655241,0.9992801787557984,3.725476862873672,-4.555444050391866,0.7236220411152926,0.0,0.0,0.0,1.0
1718124217.0621207,map,True,True,3,3,0.6616527499769684,0.6616527499769684,2.3018674850463867,-1.8370176553726196,0.0,0.0,0.0,0.040272616825345824,0.9991887348310825,3.725476862873672,-4.555444050391866,0.7236220411152926,0.0,0.0,0.0,1.0
1718124217.1133273,map,True,False,3,3,0.6616527499769684,0.6616527499769684,2.3018674850463867,-1.8370176553726196,0.0,0.0,0.0,0.040272616825345824,0.9991887348310825,3.725476862873672,-4.555444050391866,0.7236220411152926,0.0,0.0,0.0,1.0
1718124217.1636207,map,True,True,3,3,0.6616527499769684,0.6616527499769684,2.3018674850463867,-1.8370176553726196,0.0,0.0,0.0,0.040272616825345824,0.9991887348310825,3.725476862873672,-4.555444050391866,0.7236220411152926,0.0,0.0,0.0,1.0
1718124217.2153184,map,True,True,3,3,0.6616527499769684,0.6616527499769684,2.3018674850463867,-1.8370176553726196,0.0,0.0,0.0,0.040272616825345824,0.9991887348310825,3.725476862873672,-4.555444050391866,0.7236220411152926,0.0,0.0,0.0,1.0
1718124217.3151262,map,True,False,3,3,0.6616527499769684,0.6616527499769684,2.3018674850463867,-1.8370176553726196,0.0,0.0,0.0,0.040272616825345824,0.9991887348310825,3.792788410927742,-4.501794743462036,0.7062909106056598,0.0,0.0,0.0,1.0
1718124217.4134724,map,True,True,3,3,0.6616527499769684,0.6616527499769684,2.3018674850463867,-1.8370176553726196,0.0,0.0,0.0,0.040272616825345824,0.9991887348310825,3.792788410927742,-4.501794743462036,0.7062909106056598,0.0,0.0,0.0,1.0
1718124217.5122392,map,True,True,3,3,0.6616527499769684,0.6616527499769684,2.3018674850463867,-1.8370176553726196,0.0,0.0,0.0,0.040272616825345824,0.9991887348310825,3.792788410927742,-4.501794743462036,0.7062909106056598,0.0,0.0,0.0,1.0
1718124217.5650125,map,True,False,3,3,0.6616527499769684,0.6616527499769684,2.3018674850463867,-1.8370176553726196,0.0,0.0,0.0,0.040272616825345824,0.9991887348310825,3.792788410927742,-4.501794743462036,0.7062909106056598,0.0,0.0,0.0,1.0
1718124217.66298,map,True,True,3,3,0.6616527499769684,0.6616527499769684,2.3018674850463867,-1.8370176553726196,0.0,0.0,0.0,0.040272616825345824,0.9991887348310825,3.7761149925825794,-4.29395339610436,0.6891677193955926,0.0,0.0,0.0,1.0
1718124217.7621524,map,True,False,2,3,0.0,0.0,2.3937361240386963,-1.8574098348617554,0.0,0.0,0.0,0.04086757028961685,0.9991645750581188,3.7761149925825794,-4.29395339610436,0.6891677193955926,0.0,0.0,0.0,1.0
1718124217.8151693,map,True,False,2,3,0.0,0.0,2.3937361240386963,-1.8574098348617554,0.0,0.0,0.0,0.04086757028961685,0.9991645750581188,3.7761149925825794,-4.29395339610436,0.6891677193955926,0.0,0.0,0.0,1.0
1718124217.867256,map,True,False,2,3,0.0,0.0,2.3937361240386963,-1.8574098348617554,0.0,0.0,0.0,0.04086757028961685,0.9991645750581188,3.7761149925825794,-4.29395339610436,0.6891677193955926,0.0,0.0,0.0,1.0
1718124217.9648561,map,True,False,2,2,0.49874686716791977,0.49874686716791977,2.3937361240386963,-1.8574098348617554,0.0,0.0,0.0,0.04086757028961685,0.9991645750581188,3.7395352528115087,-3.8754258053331236,0.6876192402142359,0.0,0.0,0.0,1.0
1718124218.0181592,map,True,True,2,2,0.49874686716791977,0.49874686716791977,2.3937361240386963,-1.8574098348617554,0.0,0.0,0.0,0.04086757028961685,0.9991645750581188,3.7307522821057684,-3.835059842259783,0.6874776279920883,0.0,0.0,0.0,1.0
1718124218.065964,map,True,False,2,2,0.49874686716791977,0.49874686716791977,2.3937361240386963,-1.8574098348617554,0.0,0.0,0.0,0.04086757028961685,0.9991645750581188,3.7307522821057684,-3.835059842259783,0.6874776279920883,0.0,0.0,0.0,1.0
1718124218.1659467,map,True,False,2,2,0.49874686716791977,0.49874686716791977,2.3937361240386963,-1.8574098348617554,0.0,0.0,0.0,0.04086757028961685,0.9991645750581188,3.7307522821057684,-3.835059842259783,0.6874776279920883,0.0,0.0,0.0,1.0
1718124218.2171988,map,True,True,2,2,0.49874686716791977,0.49874686716791977,2.3937361240386963,-1.8574098348617554,0.0,0.0,0.0,0.04086757028961685,0.9991645750581188,3.7307522821057684,-3.835059842259783,0.6874776279920883,0.0,0.0,0.0,1.0
1718124218.2667797,map,True,False,2,3,0.0,0.0,2.3937361240386963,-1.8574098348617554,0.0,0.0,0.0,0.04086757028961685,0.9991645750581188,3.792962002151842,-3.921404013413106,0.6844940964731694,0.0,0.0,0.0,1.0
1718124218.3641675,map,True,False,2,3,0.0,0.0,2.3937361240386963,-1.8574098348617554,0.0,0.0,0.0,0.04086757028961685,0.9991645750581188,3.7842386706230124,-3.8834443786217747,0.6875922341516174,0.0,0.0,0.0,1.0
1718124218.4159153,map,True,False,2,3,0.0,0.0,2.4727134704589844,-1.8828057050704956,0.0,0.0,0.0,0.04216291213699722,0.999110750352319,3.7842386706230124,-3.8834443786217747,0.6875922341516174,0.0,0.0,0.0,1.0
1718124218.4658065,map,True,False,2,3,0.0,0.0,2.4727134704589844,-1.8828057050704956,0.0,0.0,0.0,0.04216291213699722,0.999110750352319,3.7842386706230124,-3.8834443786217747,0.6875922341516174,0.0,0.0,0.0,1.0
1718124218.5655885,map,True,False,2,3,0.0,0.0,2.4727134704589844,-1.8828057050704956,0.0,0.0,0.0,0.04216291213699722,0.999110750352319,3.7842386706230124,-3.8834443786217747,0.6875922341516174,0.0,0.0,0.0,1.0
1718124218.6704981,map,True,True,2,2,0.49874686716791977,0.49874686716791977,2.4727134704589844,-1.8828057050704956,0.0,0.0,0.0,0.04216291213699722,0.999110750352319,3.779350342183324,-3.645140724831089,0.6866828808690338,0.0,0.0,0.0,1.0
1718124218.717701,map,True,False,2,2,0.49874686716791977,0.49874686716791977,2.4727134704589844,-1.8828057050704956,0.0,0.0,0.0,0.04216291213699722,0.999110750352319,3.779350342183324,-3.645140724831089,0.6866828808690338,0.0,0.0,0.0,1.0
1718124218.7662728,map,True,False,2,2,0.49874686716791977,0.49874686716791977,2.4727134704589844,-1.8828057050704956,0.0,0.0,0.0,0.04216291213699722,0.999110750352319,3.779350342183324,-3.645140724831089,0.6866828808690338,0.0,0.0,0.0,1.0
1718124218.8216083,map,True,False,2,2,0.49874686716791977,0.49874686716791977,2.4727134704589844,-1.8828057050704956,0.0,0.0,0.0,0.04216291213699722,0.999110750352319,3.779350342183324,-3.645140724831089,0.6866828808690338,0.0,0.0,0.0,1.0
1718124218.9171877,map,True,True,2,2,0.49874686716791977,0.49874686716791977,2.4727134704589844,-1.8828057050704956,0.0,0.0,0.0,0.04216291213699722,0.999110750352319,3.779350342183324,-3.645140724831089,0.6866828808690338,0.0,0.0,0.0,1.0
1718124218.9678764,map,True,False,2,2,0.49874686716791977,0.49874686716791977,2.4727134704589844,-1.8828057050704956,0.0,0.0,0.0,0.04216291213699722,0.999110750352319,3.807313253099111,-3.4627952692434034,0.6859606958941635,0.0,0.0,0.0,1.0
1718124219.0200593,map,True,False,2,2,0.49874686716791977,0.49874686716791977,2.4727134704589844,-1.8828057050704956,0.0,0.0,0.0,0.04216291213699722,0.999110750352319,3.807313253099111,-3.4627952692434034,0.6859606958941635,0.0,0.0,0.0,1.0
1718124219.069015,map,True,False,2,2,0.49874686716791977,0.49874686716791977,2.4727134704589844,-1.8828057050704956,0.0,0.0,0.0,0.04216291213699722,0.999110750352319,3.807313253099111,-3.4627952692434034,0.6859606958941635,0.0,0.0,0.0,1.0
1718124219.1210477,map,True,False,2,2,0.49874686716791977,0.49874686716791977,2.4727134704589844,-1.8828057050704956,0.0,0.0,0.0,0.04216291213699722,0.999110750352319,3.807313253099111,-3.4627952692434034,0.6859606958941635,0.0,0.0,0.0,1.0
1718124219.170805,map,True,True,2,2,0.49874686716791977,0.49874686716791977,2.5328378677368164,-1.9107556343078613,0.0,0.0,0.0,0.04294489003817408,0.9990774458887971,3.807313253099111,-3.4627952692434034,0.6859606958941635,0.0,0.0,0.0,1.0
1718124219.2202728,map,True,True,2,2,0.49874686716791977,0.49874686716791977,2.5328378677368164,-1.9107556343078613,0.0,0.0,0.0,0.04294489003817408,0.9990774458887971,3.807313253099111,-3.4627952692434034,0.6859606958941635,0.0,0.0,0.0,1.0
1718124219.2724452,map,True,False,2,2,0.49874686716791977,0.49874686716791977,2.5328378677368164,-1.9107556343078613,0.0,0.0,0.0,0.04294489003817408,0.9990774458887971,3.816113114410432,-3.345387125936851,0.68550904617621,0.0,0.0,0.0,1.0
1718124219.3703365,map,True,True,2,2,0.49874686716791977,0.49874686716791977,2.5328378677368164,-1.9107556343078613,0.0,0.0,0.0,0.04294489003817408,0.9990774458887971,3.8120934665898583,-3.338415132502539,0.6877903032488212,0.0,0.0,0.0,1.0
1718124219.420911,map,True,True,2,2,0.49874686716791977,0.49874686716791977,2.5328378677368164,-1.9107556343078613,0.0,0.0,0.0,0.04294489003817408,0.9990774458887971,3.8120934665898583,-3.338415132502539,0.6877903032488212,0.0,0.0,0.0,1.0
1718124219.47353,map,True,True,2,2,0.49874686716791977,0.49874686716791977,2.5328378677368164,-1.9107556343078613,0.0,0.0,0.0,0.04294489003817408,0.9990774458887971,3.8120934665898583,-3.338415132502539,0.6877903032488212,0.0,0.0,0.0,1.0
1718124219.5238101,map,True,True,2,2,0.49874686716791977,0.49874686716791977,2.5328378677368164,-1.9107556343078613,0.0,0.0,0.0,0.04294489003817408,0.9990774458887971,3.8120934665898583,-3.338415132502539,0.6877903032488212,0.0,0.0,0.0,1.0
1718124219.6242316,map,True,False,2,2,0.49874686716791977,0.49874686716791977,2.5328378677368164,-1.9107556343078613,0.0,0.0,0.0,0.04294489003817408,0.9990774458887971,3.8375209644681836,-3.38099403974016,0.6856430776825738,0.0,0.0,0.0,1.0
1718124219.672778,map,True,False,2,2,0.49874686716791977,0.49874686716791977,2.5328378677368164,-1.9107556343078613,0.0,0.0,0.0,0.04294489003817408,0.9990774458887971,3.8375209644681836,-3.38099403974016,0.6856430776825738,0.0,0.0,0.0,1.0
1718124219.7733178,map,True,True,2,2,0.49874686716791977,0.49874686716791977,2.5328378677368164,-1.9107556343078613,0.0,0.0,0.0,0.04294489003817408,0.9990774458887971,3.8375209644681836,-3.38099403974016,0.6856430776825738,0.0,0.0,0.0,1.0
1718124219.8224456,map,True,True,2,2,0.49874686716791977,0.49874686716791977,2.5328378677368164,-1.9107556343078613,0.0,0.0,0.0,0.04294489003817408,0.9990774458887971,3.8375209644681836,-3.38099403974016,0.6856430776825738,0.0,0.0,0.0,1.0
1718124219.8729444,map,True,False,2,2,0.49874686716791977,0.49874686716791977,2.5328378677368164,-1.9107556343078613,0.0,0.0,0.0,0.04294489003817408,0.9990774458887971,3.8375209644681836,-3.38099403974016,0.6856430776825738,0.0,0.0,0.0,1.0
1718124219.9736276,map,True,False,2,2,0.49874686716791977,0.49874686716791977,2.6461143493652344,-1.945791482925415,0.0,0.0,0.0,0.04457833933651431,0.9990058964506608,3.818749844319796,-3.2684541916394045,0.6831385613237544,0.0,0.0,0.0,1.0
1718124220.0243251,map,True,False,2,2,0.49874686716791977,0.49874686716791977,2.6461143493652344,-1.945791482925415,0.0,0.0,0.0,0.04457833933651431,0.9990058964506608,3.841115248878199,-3.279394932641554,0.6831455542518681,0.0,0.0,0.0,1.0
1718124220.1251752,map,True,False,2,2,0.49874686716791977,0.49874686716791977,2.6461143493652344,-1.945791482925415,0.0,0.0,0.0,0.04457833933651431,0.9990058964506608,3.841115248878199,-3.279394932641554,0.6831455542518681,0.0,0.0,0.0,1.0
1718124220.2241929,map,True,True,2,2,0.49874686716791977,0.49874686716791977,2.6461143493652344,-1.945791482925415,0.0,0.0,0.0,0.04457833933651431,0.9990058964506608,3.841115248878199,-3.279394932641554,0.6831455542518681,0.0,0.0,0.0,1.0
1718124220.325535,map,True,True,2,2,0.49874686716791977,0.49874686716791977,2.6461143493652344,-1.945791482925415,0.0,0.0,0.0,0.04457833933651431,0.9990058964506608,3.853900449751939,-3.273038916397999,0.6831551862978259,0.0,0.0,0.0,1.0
1718124220.4245045,map,True,True,2,2,0.49874686716791977,0.49874686716791977,2.6461143493652344,-1.945791482925415,0.0,0.0,0.0,0.04457833933651431,0.9990058964506608,3.853900449751939,-3.273038916397999,0.6831551862978259,0.0,0.0,0.0,1.0
1718124220.5276594,map,True,False,2,2,0.49874686716791977,0.49874686716791977,2.664827346801758,-1.9545304775238037,0.0,0.0,0.0,0.04480221546535641,0.998995872855611,3.853900449751939,-3.273038916397999,0.6831551862978259,0.0,0.0,0.0,1.0
1718124220.575538,map,True,True,2,2,0.49874686716791977,0.49874686716791977,2.664827346801758,-1.9545304775238037,0.0,0.0,0.0,0.04480221546535641,0.998995872855611,3.853900449751939,-3.273038916397999,0.6831551862978259,0.0,0.0,0.0,1.0
1718124220.6757576,map,True,True,2,2,0.49874686716791977,0.49874686716791977,2.664827346801758,-1.9545304775238037,0.0,0.0,0.0,0.04480221546535641,0.998995872855611,3.907906481578334,-3.3747036167425186,0.6834134472184002,0.0,0.0,0.0,1.0
1718124220.725802,map,True,False,2,2,0.49874686716791977,0.49874686716791977,2.664827346801758,-1.9545304775238037,0.0,0.0,0.0,0.04480221546535641,0.998995872855611,3.907906481578334,-3.3747036167425186,0.6834134472184002,0.0,0.0,0.0,1.0
1718124220.7772145,map,True,True,2,2,0.49874686716791977,0.49874686716791977,2.664827346801758,-1.9545304775238037,0.0,0.0,0.0,0.04480221546535641,0.998995872855611,3.907906481578334,-3.3747036167425186,0.6834134472184002,0.0,0.0,0.0,1.0
1718124220.8295918,map,True,False,2,2,0.49874686716791977,0.49874686716791977,2.664827346801758,-1.9545304775238037,0.0,0.0,0.0,0.04480221546535641,0.998995872855611,3.907906481578334,-3.3747036167425186,0.6834134472184002,0.0,0.0,0.0,1.0
1718124220.927192,map,True,True,2,2,0.49874686716791977,0.49874686716791977,2.664827346801758,-1.9545304775238037,0.0,0.0,0.0,0.04480221546535641,0.998995872855611,3.907906481578334,-3.3747036167425186,0.6834134472184002,0.0,0.0,0.0,1.0
1718124220.9795551,map,True,True,2,2,0.49874686716791977,0.49874686716791977,2.664827346801758,-1.9545304775238037,0.0,0.0,0.0,0.04480221546535641,0.998995872855611,3.9009725363710346,-3.384514245903009,0.6986922087520108,0.0,0.0,0.0,1.0
1718124221.02996,map,True,False,2,2,0.49874686716791977,0.49874686716791977,2.664827346801758,-1.9545304775238037,0.0,0.0,0.0,0.04480221546535641,0.998995872855611,3.9009725363710346,-3.384514245903009,0.6986922087520108,0.0,0.0,0.0,1.0
1718124221.081311,map,True,True,2,2,0.49874686716791977,0.49874686716791977,2.664827346801758,-1.9545304775238037,0.0,0.0,0.0,0.04480221546535641,0.998995872855611,3.9009725363710346,-3.384514245903009,0.6986922087520108,0.0,0.0,0.0,1.0
1718124221.181055,map,True,False,2,2,0.49874686716791977,0.49874686716791977,2.664827346801758,-1.9545304775238037,0.0,0.0,0.0,0.04480221546535641,0.998995872855611,3.9009725363710346,-3.384514245903009,0.6986922087520108,0.0,0.0,0.0,1.0
