car_pos_meter , car_pos_cell, car_speed, ped_pos_meter, ped_pos_cell, ped_speed
-5.125, 5, 2, 2.718248, 3, 1
-4.604377, 4, 2, 2.718167, 3, 1
-4.083755, 4, 2, 2.718165, 3, 1
-3.563132, 3, 1, 2.718025, 3, 1
-3.303756, 3, 1, 2.718009, 3, 1
-3.044381, 3, 1, 2.718367, 3, 1
-2.785005, 2, 2, 2.717828, 3, 1
-2.264382, 2, 2, 2.718723, 3, 1
-1.743758, 1, 2, 2.718639, 3, 1
-1.223132, 1, 2, 2.719283, 3, 1
-0.7025067, 0, 2, 2.718975, 3, 1
-0.1818814, 0, 2, 2.719101, 3, 1
0.3387435, 0, 2, 2.719565, 3, 1
0.859369, 0, 2, 2.719799, 3, 1
1.379995, -1, 2, 2.719469, 3, 1
1.90062, -1, 2, 2.718777, 3, 1
2.421244, -2, 2, 2.718516, 3, 1
2.941866, -2, 2, 2.718367, 3, 1
3.462489, -3, 2, 2.718373, 3, 1
3.983112, -3, 2, 2.719149, 3, 1
4.503735, -4, 2, 2.718083, 3, 1
5.024357, -5, 2, 2.718902, 3, 1
5.54498, -5, 2, 2.718772, 3, 1
6.065603, -6, 2, 2.71879, 3, 1
6.586226, -6, 2, 2.717803, 3, 1
7.106848, -7, 2, 2.71706, 3, 1
7.627471, -7, 2, 2.717631, 3, 1
8.148098, -8, 2, 2.718845, 3, 1
8.668732, -8, 2, 2.719542, 3, 1
9.189367, -9, 2, 2.693043, 3, 1
9.710001, -9, 2, 2.694175, 3, 1
10.23064, -10, 2, 2.694637, 3, 1
10.75127, -10, 2, 2.695266, 3, 1
11.27191, -11, 2, 2.695218, 3, 1
11.79254, -11, 2, 2.695411, 3, 1
12.31318, -12, 2, 2.694845, 3, 1
12.83381, -12, 2, 2.694653, 3, 1
13.35444, -13, 2, 2.694542, 3, 1
13.87508, -13, 2, 2.694854, 3, 1
14.39571, -14, 2, 2.69497, 3, 1
14.91635, -14, 2, 2.695053, 3, 1
15.43698, -15, 2, 2.695709, 3, 1
15.95762, -15, 2, 2.69552, 3, 1
16.47823, -16, 2, 2.69629, 3, 1
16.99884, -16, 2, 2.695815, 3, 1
17.51945, -17, 2, 2.696278, 3, 1
18.04006, -18, 2, 2.695054, 3, 1
18.56067, -18, 2, 2.695301, 3, 1
19.08128, -19, 2, 2.696087, 3, 1
19.60189, -19, 2, 2.695815, 3, 1
20.12251, -20, 2, 2.695328, 3, 1
20.64312, -20, 2, 2.720659, 3, 1
21.16373, -21, 2, 2.715617, 3, 1
21.68434, -21, 2, 2.712894, 3, 1
22.20495, -22, 2, 2.711877, 3, 1
22.72556, -22, 2, 2.713328, 3, 1
23.24617, -23, 2, 2.713561, 3, 1
23.76678, -23, 2, 2.713161, 3, 1
24.28739, -24, 2, 2.713127, 3, 1
24.808, -24, 2, 2.71338, 3, 1
25.32861, -25, 2, 2.712566, 3, 1
25.84922, -25, 2, 2.713886, 3, 1
