car_pos_meter , car_pos_cell, car_speed, ped_pos_meter, ped_pos_cell, ped_speed
-5.125, 5, 1, 3.994021, 5, 1
-5.119375, 5, 2, 3.975697, 5, 1
-5.1055, 5, 1, 3.95714, 5, 1
-5.099875, 5, 1, 3.947824, 5, 1
-5.094251, 5, 2, 3.928676, 5, 1
-5.080376, 5, 2, 3.908599, 5, 1
-5.066501, 5, 1, 3.888534, 5, 1
-5.060876, 5, 1, 3.867634, 5, 1
-5.055251, 5, 2, 3.857169, 5, 1
-5.041376, 5, 2, 3.836997, 4, 1
-5.027501, 5, 2, 3.817333, 4, 1
-5.013626, 5, 2, 3.798594, 4, 1
-4.999751, 4, 1, 3.780585, 4, 1
-4.994126, 4, 2, 3.772142, 4, 1
-4.980251, 4, 2, 3.755414, 4, 1
-4.966376, 4, 2, 3.739306, 4, 1
-4.952501, 4, 1, 3.723556, 4, 1
-4.946877, 4, 1, 3.707948, 4, 1
-4.941252, 4, 1, 3.700286, 4, 1
-4.935627, 4, 1, 3.6849, 4, 1
-4.930002, 4, 2, 3.669566, 4, 1
-4.916127, 4, 1, 3.654337, 4, 1
-4.910502, 4, 1, 3.639272, 4, 1
-4.904878, 4, 2, 3.631728, 4, 1
-4.891003, 4, 2, 3.617104, 4, 1
-4.877128, 4, 1, 3.602185, 4, 1
-4.871503, 4, 1, 3.587105, 4, 1
-4.865878, 4, 1, 3.571959, 4, 1
-4.860253, 4, 1, 3.564277, 4, 1
-4.854629, 4, 1, 3.548532, 4, 1
-4.849004, 4, 2, 3.53243, 4, 1
-4.835129, 4, 2, 3.515825, 4, 1
-4.821254, 4, 1, 3.498884, 4, 1
-4.815629, 4, 2, 3.490206, 4, 1
-4.801754, 4, 2, 3.472713, 4, 1
-4.787879, 4, 1, 3.454615, 4, 1
-4.782254, 4, 1, 3.436075, 4, 1
-4.776629, 4, 1, 3.417482, 4, 1
-4.771005, 4, 2, 3.407928, 4, 1
-4.75713, 4, 2, 3.389127, 4, 1
-4.743255, 4, 2, 3.370072, 4, 1
-4.72938, 4, 1, 3.351558, 4, 1
-4.723755, 4, 1, 3.333816, 4, 1
-4.71813, 4, 1, 3.324816, 4, 1
-4.712505, 4, 1, 3.307271, 4, 1
-4.706881, 4, 1, 3.289991, 4, 1
-4.701256, 4, 1, 3.272679, 4, 1
-4.695631, 4, 2, 3.255603, 4, 1
-4.681756, 4, 1, 3.247023, 4, 1
-4.676131, 4, 2, 3.230843, 4, 1
-4.662256, 4, 1, 3.215187, 4, 1
-4.656631, 4, 1, 3.200119, 4, 1
-4.651007, 4, 1, 3.185518, 4, 1
-4.645382, 4, 1, 3.17805, 4, 1
-4.639757, 4, 1, 3.164088, 4, 1
-4.634132, 4, 1, 3.150309, 4, 1
-4.628508, 4, 2, 3.13649, 4, 1
-4.614633, 4, 2, 3.122701, 4, 1
-4.600758, 4, 1, 3.115289, 4, 1
-4.595133, 4, 2, 3.101384, 4, 1
-4.581258, 4, 2, 3.087416, 4, 1
-4.567383, 4, 2, 3.073263, 3, 1
-4.553508, 4, 2, 3.059128, 3, 1
-4.539633, 4, 2, 3.051935, 3, 1
-4.525758, 4, 2, 3.037521, 3, 1
-4.511883, 4, 2, 3.022542, 3, 1
-4.498008, 4, 2, 3.007219, 3, 1
-4.484133, 4, 2, 2.99155, 3, 1
-4.470258, 4, 2, 2.983233, 3, 1
-4.456383, 4, 2, 2.967044, 3, 1
-4.442508, 4, 2, 2.950665, 3, 1
-4.428633, 4, 2, 2.933903, 3, 1
-4.414758, 4, 2, 2.916845, 3, 1
-4.400883, 4, 2, 2.907965, 3, 1
-4.387008, 4, 2, 2.891036, 3, 1
-4.373133, 4, 2, 2.873325, 3, 1
-4.359258, 4, 2, 2.855585, 3, 1
-4.345383, 4, 2, 2.837893, 3, 1
-4.331508, 4, 2, 2.828674, 3, 1
-4.317633, 4, 2, 2.811009, 3, 1
-4.303758, 4, 2, 2.792606, 3, 1
-4.289883, 4, 2, 2.773827, 3, 1
-4.276008, 4, 2, 2.755044, 3, 1
-4.262133, 4, 2, 2.745309, 3, 1
-4.248258, 4, 2, 2.72704, 3, 1
-4.234383, 4, 2, 2.70898, 3, 1
-4.220508, 4, 2, 2.691881, 3, 1
-4.206633, 4, 2, 2.675636, 3, 1
-4.192758, 4, 2, 2.668137, 3, 1
-4.178883, 4, 2, 2.653709, 3, 1
-4.165008, 4, 2, 2.638993, 3, 1
-4.151133, 4, 2, 2.624619, 3, 1
-4.137258, 4, 2, 2.610449, 3, 1
-4.123383, 4, 2, 2.603015, 3, 1
-4.109508, 4, 2, 2.588706, 3, 1
-4.095633, 4, 2, 2.574167, 3, 1
-4.081758, 4, 2, 2.559561, 3, 1
-4.067883, 4, 2, 2.545334, 3, 1
-4.054008, 4, 2, 2.537906, 3, 1
-4.040133, 4, 2, 2.523606, 3, 1
-4.026258, 4, 2, 2.508667, 3, 1
-4.012383, 4, 2, 2.494215, 3, 1
-3.998507, 3, 1, 2.4794, 3, 1
-3.992882, 3, 1, 2.464587, 3, 1
-3.987257, 3, 2, 2.456889, 3, 1
-3.973382, 3, 1, 2.441219, 3, 1
-3.967757, 3, 2, 2.42507, 3, 1
-3.953882, 3, 1, 2.408856, 3, 1
-3.948257, 3, 1, 2.400138, 3, 1
-3.942632, 3, 1, 2.383953, 3, 1
-3.937007, 3, 1, 2.367451, 3, 1
-3.931382, 3, 2, 2.350755, 3, 1
-3.917507, 3, 1, 2.334337, 3, 1
-3.911882, 3, 1, 2.326128, 3, 1
-3.906257, 3, 1, 2.310355, 3, 1
-3.900632, 3, 2, 2.294675, 2, 1
-3.886757, 3, 2, 2.279868, 2, 1
-3.872882, 3, 2, 2.265399, 2, 1
-3.859007, 3, 2, 2.250879, 2, 1
-3.845132, 3, 2, 2.243824, 2, 1
-3.831257, 3, 2, 2.229801, 2, 1
-3.817382, 3, 2, 2.215812, 2, 1
-3.803507, 3, 2, 2.202222, 2, 1
-3.789632, 3, 2, 2.18888, 2, 1
-3.775757, 3, 2, 2.182609, 2, 1
-3.761882, 3, 2, 2.170546, 2, 1
-3.748007, 3, 2, 2.158364, 2, 1
-3.734132, 3, 2, 2.146481, 2, 1
-3.720257, 3, 2, 2.135238, 2, 1
-3.706382, 3, 2, 2.129696, 2, 1
-3.692507, 3, 2, 2.11853, 2, 1
-3.678632, 3, 2, 2.107321, 2, 1
-3.664757, 3, 2, 2.096246, 2, 1
-3.650882, 3, 2, 2.085419, 2, 1
-3.637007, 3, 2, 2.079833, 2, 1
-3.623132, 3, 2, 2.068935, 2, 1
-3.609257, 3, 2, 2.05764, 2, 1
-3.595382, 3, 2, 2.046848, 2, 1
-3.581507, 3, 2, 2.036461, 2, 1
-3.567632, 3, 2, 2.031012, 2, 1
-3.553757, 3, 2, 2.020409, 2, 1
-3.539882, 3, 2, 2.00951, 2, 1
-3.526007, 3, 2, 1.998747, 2, 1
-3.512132, 3, 2, 1.987809, 2, 1
-3.498257, 3, 2, 1.982426, 2, 1
-3.484382, 3, 2, 1.971332, 2, 1
-3.470507, 3, 2, 1.960152, 2, 1
-3.456632, 3, 2, 1.948784, 2, 1
-3.442757, 3, 2, 1.942547, 2, 1
-3.428882, 3, 2, 1.930866, 2, 1
-3.415007, 3, 2, 1.918945, 2, 1
-3.401132, 3, 2, 1.906408, 2, 1
-3.387257, 3, 2, 1.89342, 2, 1
-3.373382, 3, 2, 1.880194, 2, 1
-3.359507, 3, 2, 1.873607, 2, 1
-3.345632, 3, 2, 1.859636, 2, 1
-3.331757, 3, 2, 1.84584, 2, 1
-3.317882, 3, 2, 1.831539, 2, 1
-3.304007, 3, 2, 1.816875, 2, 1
-3.290132, 3, 2, 1.809441, 2, 1
-3.276257, 3, 2, 1.79438, 2, 1
-3.262382, 3, 2, 1.778758, 2, 1
-3.248507, 3, 2, 1.762669, 2, 1
-3.234632, 3, 2, 1.746178, 2, 1
-3.220757, 3, 2, 1.738219, 2, 1
-3.206882, 3, 2, 1.722253, 2, 1
-3.193007, 3, 2, 1.706254, 2, 1
-3.179132, 3, 2, 1.691137, 2, 1
-3.165257, 3, 2, 1.676341, 2, 1
-3.151382, 3, 2, 1.669507, 2, 1
-3.137507, 3, 2, 1.655961, 2, 1
-3.123632, 3, 2, 1.643162, 2, 1
-3.109757, 3, 2, 1.630557, 2, 1
-3.095882, 3, 2, 1.624418, 2, 1
-3.082007, 3, 2, 1.612451, 2, 1
-3.068132, 3, 2, 1.600617, 2, 1
-3.054257, 3, 2, 1.589037, 2, 1
-3.040382, 3, 2, 1.578197, 2, 1
-3.026507, 3, 2, 1.567853, 2, 1
-3.012632, 3, 2, 1.562468, 2, 1
-2.998757, 2, 1, 1.552506, 2, 1
-2.993132, 2, 2, 1.542592, 2, 1
-2.979257, 2, 2, 1.533215, 1, 1
-2.965382, 2, 2, 1.528139, 1, 1
-2.951507, 2, 2, 1.518254, 1, 1
-2.937632, 2, 2, 1.50854, 1, 1
-2.923757, 2, 2, 1.498698, 1, 1
-2.909882, 2, 2, 1.489129, 1, 1
-2.896007, 2, 2, 1.479092, 1, 1
-2.882132, 2, 2, 1.474123, 1, 1
-2.868257, 2, 2, 1.464552, 1, 1
-2.854382, 2, 2, 1.45508, 1, 1
-2.840507, 2, 2, 1.445932, 1, 1
-2.826632, 2, 2, 1.437053, 1, 1
-2.812757, 2, 2, 1.432514, 1, 1
-2.798882, 2, 2, 1.423878, 1, 1
-2.785007, 2, 2, 1.416035, 1, 1
-2.771132, 2, 2, 1.408873, 1, 1
-2.757257, 2, 2, 1.402663, 1, 1
-2.743382, 2, 2, 1.399591, 1, 1
-2.729507, 2, 2, 1.393557, 1, 1
-2.715632, 2, 2, 1.38766, 1, 1
-2.701757, 2, 2, 1.38228, 1, 1
-2.687882, 2, 2, 1.376656, 1, 1
-2.674007, 2, 2, 1.373693, 1, 1
-2.660132, 2, 2, 1.36774, 1, 1
-2.646257, 2, 2, 1.361777, 1, 1
-2.632382, 2, 2, 1.355756, 1, 1
-2.618507, 2, 2, 1.349519, 1, 1
-2.604632, 2, 2, 1.346383, 1, 1
-2.590757, 2, 2, 1.339388, 1, 1
-2.576882, 2, 2, 1.332479, 1, 1
-2.563007, 2, 2, 1.325768, 1, 1
-2.549132, 2, 2, 1.318973, 1, 1
-2.535257, 2, 2, 1.315559, 1, 1
-2.521382, 2, 2, 1.308898, 1, 1
-2.507507, 2, 2, 1.301987, 1, 1
-2.493632, 2, 2, 1.295077, 1, 1
-2.479757, 2, 2, 1.288073, 1, 1
-2.465882, 2, 2, 1.284477, 1, 1
-2.452007, 2, 2, 1.277714, 1, 1
-2.438132, 2, 2, 1.270107, 1, 1
-2.424257, 2, 2, 1.262996, 1, 1
-2.410382, 2, 2, 1.255551, 1, 1
-2.396507, 2, 2, 1.25189, 1, 1
-2.382632, 2, 2, 1.244703, 1, 1
-2.368757, 2, 2, 1.23756, 1, 1
-2.354882, 2, 2, 1.23051, 1, 1
-2.341007, 2, 2, 1.22404, 1, 1
-2.327132, 2, 2, 1.220791, 1, 1
-2.313257, 2, 2, 1.214188, 1, 1
-2.299381, 2, 2, 1.207925, 1, 1
-2.285506, 2, 2, 1.20116, 1, 1
-2.271631, 2, 2, 1.194742, 1, 1
-2.257756, 2, 2, 1.191648, 1, 1
-2.243881, 2, 2, 1.185529, 1, 1
-2.230006, 2, 2, 1.179662, 1, 1
-2.216131, 2, 2, 1.174624, 1, 1
-2.202256, 2, 2, 1.169663, 1, 1
-2.188381, 2, 2, 1.167149, 1, 1
-2.174506, 2, 2, 1.162202, 1, 1
-2.160631, 2, 2, 1.156991, 1, 1
-2.146756, 2, 2, 1.15195, 1, 1
-2.132881, 2, 2, 1.147215, 1, 1
-2.119006, 2, 2, 1.144977, 1, 1
-2.105131, 2, 2, 1.140546, 1, 1
-2.091256, 2, 2, 1.13586, 1, 1
-2.077381, 2, 2, 1.131131, 1, 1
-2.063506, 2, 2, 1.126646, 1, 1
-2.049631, 2, 2, 1.124641, 1, 1
-2.035756, 2, 2, 1.120576, 1, 1
-2.021881, 2, 2, 1.117159, 1, 1
-2.008006, 2, 2, 1.113877, 1, 1
-1.994131, 1, 2, 1.111166, 1, 1
-1.980256, 1, 2, 1.109658, 1, 1
-1.966381, 1, 2, 1.106782, 1, 1
-1.952506, 1, 2, 1.104352, 1, 1
-1.938631, 1, 2, 1.101722, 1, 1
-1.924756, 1, 2, 1.099115, 1, 1
-1.910881, 1, 2, 1.097947, 1, 1
-1.897006, 1, 2, 1.095282, 1, 1
-1.883131, 1, 2, 1.092242, 1, 1
-1.869256, 1, 2, 1.088712, 1, 1
-1.855381, 1, 2, 1.084917, 1, 1
-1.841506, 1, 2, 1.083088, 1, 1
-1.827631, 1, 2, 1.078929, 1, 1
-1.813756, 1, 2, 1.074396, 1, 1
-1.799881, 1, 2, 1.069856, 1, 1
-1.786006, 1, 2, 1.064894, 1, 1
-1.772131, 1, 2, 1.062139, 1, 1
-1.758256, 1, 2, 1.056687, 1, 1
-1.744381, 1, 2, 1.051404, 1, 1
-1.730506, 1, 2, 1.045503, 1, 1
-1.716631, 1, 2, 1.039613, 1, 1
-1.702756, 1, 2, 1.036901, 1, 1
-1.688881, 1, 2, 1.030556, 1, 1
-1.675006, 1, 2, 1.024005, 1, 1
-1.661131, 1, 2, 1.016943, 1, 1
-1.647256, 1, 2, 1.009899, 1, 1
-1.633381, 1, 2, 1.006185, 1, 1
-1.619506, 1, 2, 0.9984446, 1, 1
-1.605631, 1, 2, 0.9905868, 1, 1
-1.591756, 1, 2, 0.9825318, 1, 1
-1.577881, 1, 2, 0.9738226, 1, 1
-1.564006, 1, 2, 0.9694748, 1, 1
-1.550131, 1, 2, 0.960355, 1, 1
-1.536256, 1, 2, 0.9514389, 1, 1
-1.522381, 1, 2, 0.942158, 1, 1
-1.508506, 1, 2, 0.9320023, 1, 1
-1.494631, 1, 2, 0.9268339, 1, 1
-1.480756, 1, 2, 0.9164872, 1, 1
-1.466881, 1, 2, 0.9055059, 1, 1
-1.453006, 1, 2, 0.8946471, 1, 1
-1.439131, 1, 2, 0.8839784, 1, 1
-1.425256, 1, 2, 0.8786535, 1, 1
-1.411381, 1, 2, 0.8670669, 1, 1
-1.397506, 1, 2, 0.8550644, 1, 1
-1.383631, 1, 2, 0.8422661, 1, 1
-1.369756, 1, 2, 0.828819, 1, 1
-1.355881, 1, 2, 0.8216891, 1, 1
-1.342006, 1, 2, 0.8075337, 1, 1
-1.328131, 1, 2, 0.7935965, 1, 1
-1.314256, 1, 2, 0.7802851, 1, 1
-1.300381, 1, 2, 0.7668252, 0, 1
-1.286506, 1, 2, 0.7597499, 0, 1
-1.272631, 1, 2, 0.7462914, 0, 1
-1.258756, 1, 2, 0.7326174, 0, 1
-1.244881, 1, 2, 0.719137, 0, 1
-1.231006, 1, 2, 0.7058342, 0, 1
-1.217131, 1, 2, 0.698915, 0, 1
-1.203256, 1, 2, 0.6854105, 0, 1
-1.189381, 1, 2, 0.6715219, 0, 1
-1.175506, 1, 2, 0.6575983, 0, 1
-1.161631, 1, 2, 0.643872, 0, 1
-1.147756, 1, 2, 0.6364951, 0, 1
-1.133881, 1, 2, 0.6222928, 0, 1
-1.120006, 1, 2, 0.6077518, 0, 1
-1.106131, 1, 2, 0.5931849, 0, 1
-1.092256, 1, 2, 0.5789115, 0, 1
-1.078381, 1, 2, 0.5715995, 0, 1
-1.064506, 1, 2, 0.5577095, 0, 1
-1.050631, 1, 2, 0.543736, 0, 1
-1.036756, 1, 2, 0.5299869, 0, 1
-1.022881, 1, 2, 0.5167353, 0, 1
-1.009006, 1, 2, 0.5101092, 0, 1
-0.9951308, 0, 2, 0.4974096, 0, 1
-0.9812558, 0, 2, 0.4845433, 0, 1
-0.9673808, 0, 2, 0.4718561, 0, 1
-0.9535058, 0, 2, 0.4586954, 0, 1
-0.9396307, 0, 2, 0.4520769, 0, 1
-0.9257557, 0, 2, 0.438812, 0, 1
-0.9118807, 0, 2, 0.4252219, 0, 1
-0.8980057, 0, 2, 0.411679, 0, 1
-0.8841307, 0, 2, 0.3980136, 0, 1
-0.8702557, 0, 2, 0.3912418, 0, 1
-0.8563807, 0, 2, 0.3774042, 0, 1
-0.8425057, 0, 2, 0.3633742, 0, 1
-0.8286307, 0, 2, 0.3486698, 0, 1
-0.8147557, 0, 2, 0.3336649, 0, 1
-0.8008807, 0, 2, 0.3261633, 0, 1
-0.7870057, 0, 2, 0.3108072, 0, 1
-0.7731307, 0, 2, 0.2949443, 0, 1
-0.7592556, 0, 2, 0.2786269, 0, 1
-0.7453806, 0, 2, 0.2620018, 0, 1
-0.7315056, 0, 2, 0.2538462, 0, 1
-0.7176306, 0, 2, 0.2365096, 0, 1
-0.7037556, 0, 2, 0.218662, 0, 1
-0.6898806, 0, 2, 0.2000232, 0, 1
-0.6760056, 0, 2, 0.1808767, 0, 1
-0.6621306, 0, 2, 0.1712313, 0, 1
-0.6482556, 0, 2, 0.1516042, 0, 1
-0.6343806, 0, 2, 0.1319165, 0, 1
-0.6205056, 0, 2, 0.1122808, 0, 1
-0.6066306, 0, 2, 0.09239769, 0, 1
-0.5927556, 0, 2, 0.08257389, 0, 1
-0.5788805, 0, 2, 0.06258821, 0, 1
-0.5650055, 0, 2, 0.04191732, 0, 1
-0.5511305, 0, 2, 0.02267957, 0, 1
-0.5372555, 0, 2, 0.003922224, 0, 1
-0.5233805, 0, 2, -0.01340103, 0, 1
-0.5095055, 0, 2, -0.02131557, 0, 1
-0.4956305, 0, 2, -0.03570652, 0, 1
-0.4817555, 0, 2, -0.04895687, 0, 1
-0.4678805, 0, 2, -0.06141996, 0, 1
-0.4540055, 0, 2, -0.07345581, 0, 1
-0.4401305, 0, 2, -0.07953167, 0, 1
-0.4262555, 0, 2, -0.09092045, 0, 1
-0.4123805, 0, 2, -0.102448, 0, 1
-0.3985054, 0, 2, -0.1135612, 0, 1
-0.3846304, 0, 2, -0.1238532, 0, 1
-0.3707554, 0, 2, -0.1288409, 0, 1
-0.3568804, 0, 2, -0.1378689, 0, 1
-0.3430054, 0, 2, -0.1464019, 0, 1
-0.3291304, 0, 2, -0.1543097, 0, 1
-0.3152554, 0, 2, -0.1605501, 0, 1
-0.3013804, 0, 2, -0.1634574, 0, 1
-0.2875054, 0, 2, -0.1681871, 0, 1
-0.2736304, 0, 2, -0.1721721, 0, 1
-0.2597554, 0, 2, -0.1757135, 0, 1
-0.2458804, 0, 2, -0.1783476, 0, 1
-0.2320054, 0, 2, -0.1795454, 0, 1
-0.2181304, 0, 2, -0.1814981, 0, 1
-0.2042553, 0, 2, -0.1831188, 0, 1
-0.1903803, 0, 2, -0.1843805, 0, 1
-0.1765053, 0, 2, -0.1852169, 0, 1
-0.1626303, 0, 2, -0.1855898, 0, 1
-0.1487553, 0, 2, -0.1860132, 0, 1
-0.1348803, 0, 2, -0.185782, 0, 1
-0.1210053, 0, 2, -0.1861701, 0, 1
-0.1071303, 0, 2, -0.1862187, 0, 1
-0.0932553, 0, 2, -0.1861176, 0, 1
-0.0793803, 0, 2, -0.1858177, 0, 1
-0.0655053, 0, 2, -0.18507, 0, 1
-0.0516303, 0, 2, -0.1839857, 0, 1
-0.0377553, 0, 2, -0.1830645, 0, 1
-0.0238803, 0, 2, -0.1810017, 0, 1
-0.0100053, 0, 2, -0.1785622, 0, 1
0.003869697, 0, 2, -0.1754408, 0, 1
0.0177447, 0, 2, -0.1721635, 0, 1
0.0316197, 0, 2, -0.1686435, 0, 1
0.0454947, 0, 2, -0.1666193, 0, 1
0.0593697, 0, 2, -0.1626511, 0, 1
0.0732447, 0, 2, -0.1584892, 0, 1
0.0871197, 0, 2, -0.1538954, 0, 1
0.1009947, 0, 2, -0.149343, 0, 1
0.1148697, 0, 2, -0.1469312, 0, 1
0.1287447, 0, 2, -0.1420155, 0, 1
0.1426197, 0, 2, -0.1367693, 0, 1
0.1564947, 0, 2, -0.1314206, 0, 1
0.1703697, 0, 2, -0.1259403, 0, 1
0.1842447, 0, 2, -0.1230855, 0, 1
0.1981197, 0, 2, -0.1171861, 0, 1
0.2119947, 0, 2, -0.111259, 0, 1
0.2258697, 0, 2, -0.1050272, 0, 1
0.2397448, 0, 2, -0.1018052, 0, 1
0.2536198, 0, 2, -0.09548187, 0, 1
0.2674948, 0, 2, -0.08913708, 0, 1
0.2813698, 0, 2, -0.08276844, 0, 1
0.2952448, 0, 2, -0.07656002, 0, 1
0.3091198, 0, 2, -0.07049179, 0, 1
0.3229948, 0, 2, -0.06747198, 0, 1
0.3368698, 0, 2, -0.06176519, 0, 1
0.3507448, 0, 2, -0.05616808, 0, 1
0.3646198, 0, 2, -0.05082035, 0, 1
0.3784948, 0, 2, -0.0458107, 0, 1
0.3923698, 0, 2, -0.04313326, 0, 1
0.4062448, 0, 2, -0.03823566, 0, 1
0.4201199, 0, 2, -0.03349638, 0, 1
0.4339949, 0, 2, -0.02894354, 0, 1
0.4478699, 0, 2, -0.02485657, 0, 1
0.4617449, 0, 2, -0.02298164, 0, 1
0.4756199, 0, 2, -0.0195899, 0, 1
0.4894949, 0, 2, -0.01645088, 0, 1
0.5033699, 0, 2, -0.0135808, 0, 1
0.5172449, 0, 2, -0.01120186, 0, 1
0.5311199, 0, 2, -0.01019669, 0, 1
0.5449949, 0, 2, -0.009602547, 0, 1
0.5588699, 0, 2, -0.008317947, 0, 1
0.5727449, 0, 2, -0.008000851, 0, 1
0.5866199, 0, 2, -0.007856369, 0, 1
0.6004949, 0, 2, -0.008203983, 0, 1
0.6143699, 0, 2, -0.009565353, 0, 1
0.6282449, 0, 2, -0.01160288, 0, 1
0.6421199, 0, 2, -0.01379585, 0, 1
0.655995, 0, 2, -0.01651907, 0, 1
0.66987, 0, 2, -0.01796913, 0, 1
0.683745, 0, 2, -0.02103519, 0, 1
0.69762, 0, 2, -0.02480888, 0, 1
0.711495, 0, 2, -0.02850103, 0, 1
0.72537, 0, 2, -0.03252697, 0, 1
0.739245, 0, 2, -0.03441238, 0, 1
0.75312, 0, 2, -0.03843355, 0, 1
0.766995, 0, 2, -0.0424633, 0, 1
0.78087, 0, 2, -0.0460186, 0, 1
0.794745, 0, 2, -0.04765368, 0, 1
0.80862, 0, 2, -0.0506773, 0, 1
0.822495, 0, 2, -0.05328035, 0, 1
0.8363701, 0, 2, -0.05525637, 0, 1
0.8502451, 0, 2, -0.05732965, 0, 1
0.8641201, 0, 2, -0.05997181, 0, 1
0.8779951, 0, 2, -0.06122303, 0, 1
0.8918701, 0, 2, -0.06403685, 0, 1
0.9057451, 0, 2, -0.06602669, 0, 1
0.9196201, 0, 2, -0.06822681, 0, 1
0.9334951, 0, 2, -0.06972837, 0, 1
0.9473701, 0, 2, -0.06944561, 0, 1
0.9612451, 0, 2, -0.06909704, 0, 1
0.9751201, 0, 2, -0.0680604, 0, 1
0.9889951, 0, 2, -0.06677914, 0, 1
1.00287, -1, 2, -0.06535196, 0, 1
1.016745, -1, 2, -0.06387997, 0, 1
1.03062, -1, 2, -0.06139088, 0, 1
1.044495, -1, 2, -0.05832577, 0, 1
1.05837, -1, 2, -0.05495882, 0, 1
1.072245, -1, 2, -0.05093956, 0, 1
1.08612, -1, 2, -0.04876375, 0, 1
1.099995, -1, 2, -0.04495907, 0, 1
1.11387, -1, 2, -0.04064703, 0, 1
1.127745, -1, 2, -0.03685808, 0, 1
1.14162, -1, 2, -0.03287029, 0, 1
1.155495, -1, 2, -0.03064251, 0, 1
1.16937, -1, 2, -0.02713394, 0, 1
1.183245, -1, 2, -0.02262306, 0, 1
1.19712, -1, 2, -0.01753759, 0, 1
1.210995, -1, 2, -0.01170111, 0, 1
1.22487, -1, 2, -0.008281708, 0, 1
1.238745, -1, 2, -0.001075745, 0, 1
1.25262, -1, 2, 0.007261038, 0, 1
1.266495, -1, 2, 0.01587009, 0, 1
1.28037, -1, 2, 0.02491426, 0, 1
1.294245, -1, 2, 0.03000832, 0, 1
1.30812, -1, 2, 0.03958178, 0, 1
1.321995, -1, 2, 0.0506978, 0, 1
1.33587, -1, 2, 0.06212783, 0, 1
1.349745, -1, 2, 0.07371998, 0, 1
1.36362, -1, 2, 0.08014727, 0, 1
1.377495, -1, 2, 0.09279823, 0, 1
1.39137, -1, 2, 0.1063843, 0, 1
1.405245, -1, 2, 0.1203628, 0, 1
1.41912, -1, 2, 0.1340811, 0, 1
1.432995, -1, 2, 0.1411963, 0, 1
1.44687, -1, 2, 0.1553049, 0, 1
1.460745, -1, 2, 0.1693747, 0, 1
1.47462, -1, 2, 0.1831009, 0, 1
1.488495, -1, 2, 0.1962008, 0, 1
1.50237, -1, 2, 0.2029657, 0, 1
1.516245, -1, 2, 0.2159038, 0, 1
1.53012, -1, 2, 0.2294748, 0, 1
1.543995, -1, 2, 0.2425783, 0, 1
1.55787, -1, 2, 0.255043, 0, 1
1.571745, -1, 2, 0.2614501, 0, 1
1.58562, -1, 2, 0.2733741, 0, 1
1.599495, -1, 2, 0.2850974, 0, 1
1.61337, -1, 2, 0.2968886, 0, 1
1.627245, -1, 2, 0.3083565, 0, 1
1.64112, -1, 2, 0.3140748, 0, 1
1.654995, -1, 2, 0.3251302, 0, 1
1.66887, -1, 2, 0.3361964, 0, 1
1.682745, -1, 2, 0.3472118, 0, 1
1.69662, -1, 2, 0.3580198, 0, 1
1.710495, -1, 2, 0.3634768, 0, 1
1.72437, -1, 2, 0.3745027, 0, 1
