car_pos_meter , car_pos_cell, car_speed, ped_pos_meter, ped_pos_cell, ped_speed
-30.37037, 30, 2, 3.990762, 31, 1
-30.28815, 30, 2, 3.984368, 31, 1
-30.20592, 30, 2, 3.970506, 30, 1
-30.1237, 30, 2, 3.956131, 30, 1
-30.04148, 30, 2, 3.941389, 30, 1
-29.95926, 29, 2, 3.926635, 30, 1
-29.87704, 29, 2, 3.919108, 30, 1
-29.79481, 29, 2, 3.903463, 30, 1
-27.73926, 27, 2, 3.598628, 28, 1
-25.6837, 25, 2, 3.264978, 25, 1
-23.62814, 23, 2, 2.873937, 22, 1
-21.57259, 21, 2, 2.402021, 18, 1
-19.51703, 19, 2, 1.91585, 14, 1
-17.46147, 17, 2, 1.43904, 11, 1
-15.40592, 15, 2, 1.100399, 8, 1
-13.35036, 13, 2, 0.7540255, 5, 1
-11.2948, 11, 2, 0.3859239, 3, 1
-9.239247, 9, 2, 0.0759275, 0, 1
-7.183691, 7, 2, -0.07389736, 0, 1
-5.128134, 5, 2, -0.2268658, -1, 1
-3.072577, 3, 2, -0.3639088, -2, 1
-1.017021, 1, 2, -0.4040494, -3, 1
