car_pos_meter , car_pos_cell, car_speed, ped_pos_meter, ped_pos_cell, ped_speed
-3.727273, 3, 1, 3.992903, 3, 1
-3.719727, 3, 1, 3.97766, 3, 1
-3.712182, 3, 1, 3.970142, 3, 1
-3.704636, 3, 1, 3.955345, 3, 1
-3.697091, 3, 2, 3.940905, 3, 1
-3.681946, 3, 1, 3.92663, 3, 1
-3.6744, 3, 1, 3.919384, 3, 1
-3.666855, 3, 2, 3.904763, 3, 1
-3.651709, 3, 1, 3.889842, 3, 1
-3.644164, 3, 1, 3.874531, 3, 1
-3.636618, 3, 1, 3.85928, 3, 1
-3.629073, 3, 1, 3.843343, 3, 1
-3.621527, 3, 1, 3.835243, 3, 1
-3.613982, 3, 2, 3.818568, 3, 1
-3.598836, 3, 2, 3.801711, 3, 1
-3.583691, 3, 1, 3.784469, 3, 1
-3.576145, 3, 1, 3.766781, 3, 1
-3.5686, 3, 1, 3.757724, 3, 1
-3.561054, 3, 2, 3.739271, 3, 1
-3.545909, 3, 1, 3.720549, 3, 1
-3.538364, 3, 1, 3.701252, 3, 1
-3.530818, 3, 1, 3.681444, 3, 1
-3.523273, 3, 2, 3.67139, 3, 1
-3.508127, 3, 2, 3.651546, 3, 1
-3.492982, 3, 1, 3.631361, 3, 1
-3.485436, 3, 1, 3.611087, 3, 1
-3.477891, 3, 2, 3.5907, 3, 1
-3.462746, 3, 1, 3.580474, 3, 1
-3.4552, 3, 1, 3.560296, 3, 1
-3.447655, 3, 1, 3.540354, 3, 1
-3.440109, 3, 1, 3.520964, 3, 1
-3.432564, 3, 2, 3.501613, 3, 1
-3.417418, 3, 1, 3.491912, 3, 1
-3.409873, 3, 2, 3.47267, 3, 1
-3.394727, 3, 1, 3.453325, 3, 1
-3.387182, 3, 1, 3.434031, 3, 1
-3.379637, 3, 2, 3.414594, 3, 1
-3.364491, 3, 1, 3.405126, 3, 1
-3.356946, 3, 2, 3.385907, 3, 1
-3.3418, 3, 1, 3.367025, 3, 1
-3.334255, 3, 1, 3.348083, 3, 1
-3.32671, 3, 2, 3.329018, 2, 1
-3.311564, 3, 2, 3.319508, 2, 1
-3.296419, 3, 2, 3.3003, 2, 1
-3.281273, 3, 2, 3.280955, 2, 1
-3.266128, 3, 2, 3.261804, 2, 1
-3.250983, 3, 2, 3.241932, 2, 1
-3.235837, 3, 2, 3.232193, 2, 1
-3.220692, 3, 2, 3.212786, 2, 1
-3.205546, 3, 2, 3.19319, 2, 1
-3.190401, 3, 2, 3.173124, 2, 1
-3.175256, 3, 2, 3.15288, 2, 1
-3.16011, 3, 2, 3.142594, 2, 1
-3.144965, 3, 2, 3.122269, 2, 1
-3.129819, 3, 2, 3.101546, 2, 1
-3.114674, 3, 2, 3.081277, 2, 1
-3.099529, 3, 2, 3.06122, 2, 1
-3.084383, 3, 2, 3.051359, 2, 1
-3.069238, 3, 2, 3.031514, 2, 1
-3.054092, 3, 2, 3.011869, 2, 1
-3.038947, 3, 2, 2.99294, 2, 1
-3.023802, 3, 2, 2.974117, 2, 1
-3.008656, 3, 2, 2.964978, 2, 1
-2.993511, 2, 1, 2.946537, 2, 1
-2.985965, 2, 1, 2.928951, 2, 1
-2.97842, 2, 2, 2.91201, 2, 1
-2.963274, 2, 2, 2.895188, 2, 1
-2.948129, 2, 2, 2.886994, 2, 1
-2.932984, 2, 1, 2.87062, 2, 1
-2.925438, 2, 1, 2.854464, 2, 1
-2.917893, 2, 2, 2.838664, 2, 1
-2.902747, 2, 1, 2.822402, 2, 1
-2.895202, 2, 1, 2.814325, 2, 1
-2.887656, 2, 1, 2.797919, 2, 1
-2.880111, 2, 1, 2.781072, 2, 1
-2.872566, 2, 2, 2.763834, 2, 1
-2.85742, 2, 1, 2.745984, 2, 1
-2.849875, 2, 2, 2.737129, 2, 1
-2.834729, 2, 2, 2.718225, 2, 1
-2.819584, 2, 2, 2.699183, 2, 1
-2.804439, 2, 2, 2.679902, 2, 1
-2.789293, 2, 1, 2.659874, 2, 1
-2.781748, 2, 1, 2.649871, 2, 1
-2.774202, 2, 1, 2.628996, 2, 1
-2.766657, 2, 2, 2.607456, 2, 1
-2.751511, 2, 2, 2.586757, 2, 1
-2.736366, 2, 1, 2.565799, 2, 1
-2.728821, 2, 1, 2.555518, 2, 1
-2.721275, 2, 1, 2.534592, 2, 1
-2.71373, 2, 2, 2.513832, 2, 1
-2.698584, 2, 2, 2.493351, 2, 1
-2.683439, 2, 1, 2.472872, 2, 1
-2.675893, 2, 1, 2.462861, 2, 1
-2.668348, 2, 1, 2.442724, 2, 1
-2.660802, 2, 2, 2.423604, 2, 1
-2.645657, 2, 2, 2.404974, 2, 1
-2.630512, 2, 1, 2.385857, 2, 1
-2.622966, 2, 2, 2.376723, 2, 1
-2.607821, 2, 1, 2.358029, 2, 1
-2.600275, 2, 2, 2.339656, 2, 1
-2.58513, 2, 1, 2.321001, 2, 1
-2.577584, 2, 1, 2.302113, 2, 1
-2.570039, 2, 1, 2.292636, 2, 1
-2.562493, 2, 2, 2.272952, 2, 1
-2.547348, 2, 2, 2.253517, 2, 1
-2.532203, 2, 1, 2.234614, 2, 1
-2.524657, 2, 2, 2.215432, 1, 1
-2.509512, 2, 2, 2.205806, 1, 1
-2.494366, 2, 2, 2.18641, 1, 1
-2.479221, 2, 2, 2.167045, 1, 1
-2.464076, 2, 2, 2.14799, 1, 1
-2.44893, 2, 2, 2.128456, 1, 1
-2.433785, 2, 2, 2.118822, 1, 1
-2.418639, 2, 2, 2.098519, 1, 1
-2.403494, 2, 2, 2.078495, 1, 1
-2.388349, 2, 2, 2.058106, 1, 1
-2.373203, 2, 2, 2.037721, 1, 1
-2.358058, 2, 2, 2.027284, 1, 1
-2.342912, 2, 2, 2.005904, 1, 1
-2.327767, 2, 2, 1.98537, 1, 1
-2.312622, 2, 2, 1.964466, 1, 1
-2.297476, 2, 2, 1.94318, 1, 1
-2.282331, 2, 2, 1.932647, 1, 1
-2.267185, 2, 2, 1.911872, 1, 1
-2.25204, 2, 2, 1.891424, 1, 1
-2.236895, 2, 2, 1.871672, 1, 1
-2.221749, 2, 2, 1.851762, 1, 1
-2.206604, 2, 2, 1.842411, 1, 1
-2.191459, 2, 2, 1.823556, 1, 1
-2.176313, 2, 2, 1.805528, 1, 1
-2.161168, 2, 2, 1.787444, 1, 1
-2.146023, 2, 2, 1.769076, 1, 1
-2.130877, 2, 2, 1.760005, 1, 1
-2.115732, 2, 2, 1.741818, 1, 1
-2.100586, 2, 2, 1.723629, 1, 1
-2.085441, 2, 2, 1.705482, 1, 1
-2.070296, 2, 2, 1.686845, 1, 1
-2.05515, 2, 2, 1.677658, 1, 1
-2.040005, 2, 2, 1.658557, 1, 1
-2.024859, 2, 2, 1.63929, 1, 1
-2.009714, 2, 2, 1.61978, 1, 1
-1.994569, 1, 2, 1.599708, 1, 1
-1.979423, 1, 2, 1.590138, 1, 1
-1.964278, 1, 2, 1.570426, 1, 1
-1.949132, 1, 2, 1.550345, 1, 1
-1.933987, 1, 2, 1.529972, 1, 1
-1.918842, 1, 2, 1.510023, 1, 1
-1.903696, 1, 2, 1.499882, 1, 1
-1.888551, 1, 2, 1.47979, 1, 1
-1.873405, 1, 2, 1.45939, 1, 1
-1.85826, 1, 2, 1.438783, 1, 1
-1.843115, 1, 2, 1.419032, 1, 1
-1.827969, 1, 2, 1.408957, 1, 1
-1.812824, 1, 2, 1.389138, 1, 1
-1.797678, 1, 2, 1.369529, 1, 1
-1.782533, 1, 2, 1.350381, 1, 1
-1.767388, 1, 2, 1.33127, 1, 1
-1.752242, 1, 2, 1.321508, 1, 1
-1.737097, 1, 2, 1.302208, 1, 1
-1.721952, 1, 2, 1.2826, 1, 1
-1.706806, 1, 2, 1.262759, 1, 1
-1.691661, 1, 2, 1.242908, 1, 1
-1.676515, 1, 2, 1.233033, 1, 1
-1.66137, 1, 2, 1.212763, 1, 1
-1.646225, 1, 2, 1.192518, 1, 1
-1.631079, 1, 2, 1.1724, 1, 1
-1.615934, 1, 2, 1.152071, 1, 1
-1.600788, 1, 2, 1.14168, 1, 1
-1.585643, 1, 2, 1.121755, 1, 1
-1.570498, 1, 2, 1.101514, 0, 1
-1.555352, 1, 2, 1.080724, 0, 1
-1.540207, 1, 2, 1.059866, 0, 1
-1.525061, 1, 2, 1.049114, 0, 1
-1.509916, 1, 2, 1.028129, 0, 1
-1.494771, 1, 2, 1.007008, 0, 1
-1.479625, 1, 2, 0.9854093, 0, 1
-1.46448, 1, 2, 0.9639945, 0, 1
-1.449335, 1, 2, 0.9532728, 0, 1
-1.434189, 1, 2, 0.9322605, 0, 1
-1.419044, 1, 2, 0.91153, 0, 1
-1.403898, 1, 2, 0.8908854, 0, 1
-1.388753, 1, 2, 0.8703835, 0, 1
-1.373607, 1, 2, 0.8600764, 0, 1
-1.358462, 1, 2, 0.8396175, 0, 1
-1.343316, 1, 2, 0.8193061, 0, 1
-1.328171, 1, 2, 0.7993073, 0, 1
-1.313025, 1, 2, 0.7794831, 0, 1
-1.29788, 1, 2, 0.7698181, 0, 1
-1.282734, 1, 2, 0.7508829, 0, 1
-1.267589, 1, 2, 0.7328398, 0, 1
-1.252443, 1, 2, 0.7146056, 0, 1
-1.237298, 1, 2, 0.6971076, 0, 1
-1.222152, 1, 2, 0.6881094, 0, 1
-1.207007, 1, 2, 0.6701984, 0, 1
-1.191861, 1, 2, 0.6526852, 0, 1
-1.176716, 1, 2, 0.6347215, 0, 1
-1.16157, 1, 2, 0.6165922, 0, 1
-1.146425, 1, 2, 0.6074061, 0, 1
-1.131279, 1, 2, 0.5891304, 0, 1
-1.116134, 1, 2, 0.570595, 0, 1
-1.100989, 1, 2, 0.5518203, 0, 1
-1.085843, 1, 2, 0.5330625, 0, 1
-1.070698, 1, 2, 0.5234938, 0, 1
-1.055552, 1, 2, 0.5044744, 0, 1
-1.040407, 1, 2, 0.4851387, 0, 1
-1.025261, 1, 2, 0.4654517, 0, 1
-1.010116, 1, 2, 0.4461739, 0, 1
-0.9949703, 0, 2, 0.4261591, 0, 1
-0.9798248, 0, 2, 0.4158902, 0, 1
-0.9646793, 0, 2, 0.3957009, 0, 1
-0.9495338, 0, 2, 0.3757582, 0, 1
-0.9343883, 0, 2, 0.3562698, 0, 1
-0.9192429, 0, 2, 0.3368058, 0, 1
-0.9040974, 0, 2, 0.3271427, 0, 1
-0.8889519, 0, 2, 0.3086319, 0, 1
-0.8738064, 0, 2, 0.2905679, 0, 1
-0.8586609, 0, 2, 0.2730672, 0, 1
-0.8435155, 0, 2, 0.2551453, 0, 1
-0.82837, 0, 2, 0.2460334, 0, 1
-0.8132246, 0, 2, 0.2282715, 0, 1
-0.7980791, 0, 2, 0.2103968, 0, 1
-0.7829336, 0, 2, 0.1924095, 0, 1
-0.7677881, 0, 2, 0.1745889, 0, 1
-0.7526426, 0, 2, 0.1655281, 0, 1
-0.7374972, 0, 2, 0.1474285, 0, 1
-0.7223517, 0, 2, 0.1294055, 0, 1
-0.7072062, 0, 2, 0.1114087, 0, 1
-0.6920607, 0, 2, 0.092906, 0, 1
-0.6769152, 0, 2, 0.08340931, 0, 1
-0.6617698, 0, 2, 0.06410265, 0, 1
-0.6466243, 0, 2, 0.04417229, 0, 1
-0.6314788, 0, 2, 0.03288245, 0, 1
-0.6163334, 0, 2, 0.001159906, 0, 1
-0.6011879, 0, 2, -0.02100945, 0, 1
-0.5860424, 0, 2, -0.03239107, 0, 1
-0.5708969, 0, 2, -0.0557456, 0, 1
-0.5557514, 0, 2, -0.07976484, 0, 1
-0.540606, 0, 2, -0.1035671, 0, 1
-0.5254605, 0, 2, -0.1271501, 0, 1
-0.510315, 0, 2, -0.1395273, 0, 1
-0.4951696, 0, 2, -0.1628094, 0, 1
-0.4800241, 0, 2, -0.1855817, 0, 1
-0.4648786, 0, 2, -0.2076569, 0, 1
-0.4497331, 0, 2, -0.2279768, 0, 1
-0.4345877, 0, 2, -0.2379675, 0, 1
-0.4194422, 0, 2, -0.2563066, 0, 1
-0.4042967, 0, 2, -0.2746964, 0, 1
-0.3891512, 0, 2, -0.2924619, 0, 1
-0.3740058, 0, 2, -0.3097014, 0, 1
-0.3588603, 0, 2, -0.3184433, 0, 1
-0.3437148, 0, 2, -0.3346281, 0, 1
-0.3285694, 0, 2, -0.3502102, 0, 1
-0.3134239, 0, 2, -0.3652687, 0, 1
-0.2982785, 0, 2, -0.3723211, 0, 1
-0.283133, 0, 2, -0.3864813, 0, 1
-0.2679876, 0, 2, -0.4001527, 0, 1
-0.2528421, 0, 2, -0.4141359, 0, 1
-0.2376967, 0, 2, -0.4208107, 0, 1
-0.2225512, 0, 2, -0.4348545, 0, 1
-0.2074058, 0, 2, -0.4487667, 0, 1
-0.1922603, 0, 2, -0.4627528, 0, 1
-0.1771149, 0, 2, -0.4768324, 0, 1
-0.1619694, 0, 2, -0.4905896, 0, 1
-0.1468239, 0, 2, -0.4971886, 0, 1
-0.1316785, 0, 2, -0.5103378, 0, 1
-0.116533, 0, 2, -0.5230303, 0, 1
-0.1013876, 0, 2, -0.5358739, 0, 1
-0.08624213, 0, 2, -0.542182, 0, 1
-0.07109668, 0, 2, -0.5550447, 0, 1
-0.05595123, 0, 2, -0.5671983, 0, 1
-0.04080577, 0, 2, -0.5792742, 0, 1
-0.02566032, 0, 2, -0.5922198, 0, 1
-0.01051487, 0, 2, -0.6049623, 0, 1
0.004630588, 0, 2, -0.6110792, 0, 1
0.01977604, 0, 2, -0.6239877, 0, 1
0.03492149, 0, 2, -0.6367679, 0, 1
0.05006695, 0, 2, -0.6495996, 0, 1
0.0652124, 0, 2, -0.661068, 0, 1
0.08035786, 0, 2, -0.6665015, 0, 1
0.09550331, 0, 2, -0.6769705, 0, 1
0.1106488, 0, 2, -0.6865273, 0, 1
0.1257942, 0, 2, -0.6959796, 0, 1
0.1409397, 0, 2, -0.7047601, 0, 1
0.1560851, 0, 2, -0.7087221, 0, 1
0.1712306, 0, 2, -0.716527, 0, 1
0.186376, 0, 2, -0.7236958, 0, 1
0.2015215, 0, 2, -0.7305241, 0, 1
0.2166669, 0, 2, -0.7370071, 0, 1
0.2318124, 0, 2, -0.7398024, 0, 1
0.2469578, 0, 2, -0.7452235, 0, 1
0.2621033, 0, 2, -0.750206, 0, 1
0.2772487, 0, 2, -0.7556124, 0, 1
0.2923942, 0, 2, -0.7610006, 0, 1
0.3075397, 0, 2, -0.7635946, 0, 1
0.3226851, 0, 2, -0.7684078, 0, 1
0.3378306, 0, 2, -0.7732143, 0, 1
0.352976, 0, 2, -0.7779827, 0, 1
0.3681215, 0, 2, -0.7825909, 0, 1
0.383267, 0, 2, -0.7848229, 0, 1
0.3984124, 0, 2, -0.7897234, 0, 1
0.4135579, 0, 2, -0.7939773, 0, 1
0.4287034, 0, 2, -0.7976189, 0, 1
0.4438489, 0, 2, -0.8022809, 0, 1
0.4589944, 0, 2, -0.8034983, 0, 1
0.4741398, 0, 2, -0.807126, 0, 1
0.4892853, 0, 2, -0.8104033, 0, 1
0.5044308, 0, 2, -0.8136554, 0, 1
0.5195763, 0, 2, -0.8172741, 0, 1
0.5347217, 0, 2, -0.8186522, 0, 1
0.5498672, 0, 2, -0.8216095, 0, 1
0.5650127, 0, 2, -0.8242173, 0, 1
0.5801582, 0, 2, -0.8263597, 0, 1
0.5953036, 0, 2, -0.828229, 0, 1
0.6104491, 0, 2, -0.8287206, 0, 1
0.6255946, 0, 2, -0.8295827, 0, 1
0.64074, 0, 2, -0.8308406, 0, 1
0.6558855, 0, 2, -0.8322773, 0, 1
0.671031, 0, 2, -0.8335958, 0, 1
0.6861765, 0, 2, -0.8343444, 0, 1
0.701322, 0, 2, -0.8359785, 0, 1
0.7164674, 0, 2, -0.8370786, 0, 1
0.7316129, 0, 2, -0.8379979, 0, 1
0.7467584, 0, 2, -0.8386321, 0, 1
0.7619038, 0, 2, -0.8388863, 0, 1
0.7770493, 0, 2, -0.8394699, 0, 1
0.7921948, 0, 2, -0.8397036, 0, 1
0.8073403, 0, 2, -0.8396053, 0, 1
0.8224857, 0, 2, -0.8392763, 0, 1
0.8376312, 0, 2, -0.8391223, 0, 1
0.8527767, 0, 2, -0.8388739, 0, 1
0.8679222, 0, 2, -0.8386011, 0, 1
0.8830677, 0, 2, -0.8383636, 0, 1
0.8982131, 0, 2, -0.8382721, 0, 1
0.9133586, 0, 2, -0.8382616, 0, 1
0.928504, 0, 2, -0.838275, 0, 1
0.9436495, 0, 2, -0.8385086, 0, 1
0.958795, 0, 2, -0.8391647, 0, 1
0.9739405, 0, 2, -0.8397088, 0, 1
0.989086, 0, 2, -0.8400407, 0, 1
1.004231, -1, 2, -0.8407903, 0, 1
1.019377, -1, 2, -0.8415914, 0, 1
1.034522, -1, 2, -0.8426275, 0, 1
1.049668, -1, 2, -0.8438148, 0, 1
1.064813, -1, 2, -0.8441324, 0, 1
1.079959, -1, 2, -0.8445597, 0, 1
1.095104, -1, 2, -0.8453679, 0, 1
1.11025, -1, 2, -0.8466139, 0, 1
1.125395, -1, 2, -0.8487072, 0, 1
1.140541, -1, 2, -0.850194, 0, 1
1.155686, -1, 2, -0.8537931, 0, 1
1.170832, -1, 2, -0.8584805, 0, 1
1.185977, -1, 2, -0.8641715, 0, 1
1.201123, -1, 2, -0.8707948, 0, 1
1.216268, -1, 2, -0.8741274, 0, 1
1.231414, -1, 2, -0.8801718, 0, 1
1.246559, -1, 2, -0.8856735, 0, 1
1.261705, -1, 2, -0.8906026, 0, 1
1.27685, -1, 2, -0.8947134, 0, 1
1.291996, -1, 2, -0.8967543, 0, 1
1.307141, -1, 2, -0.9001369, 0, 1
1.322286, -1, 2, -0.9025493, 0, 1
1.337432, -1, 2, -0.9041409, 0, 1
1.352577, -1, 2, -0.9050589, 0, 1
1.367723, -1, 2, -0.9053164, 0, 1
1.382868, -1, 2, -0.9052219, 0, 1
1.398014, -1, 2, -0.9051256, 0, 1
1.413159, -1, 2, -0.9045067, 0, 1
1.428305, -1, 2, -0.9046888, 0, 1
1.44345, -1, 2, -0.9047203, 0, 1
1.458596, -1, 2, -0.9043241, 0, 1
1.473741, -1, 2, -0.9041057, 0, 1
1.488886, -1, 2, -0.9032998, 0, 1
1.504032, -1, 2, -0.9025955, 0, 1
1.519177, -1, 2, -0.9018073, 0, 1
1.534323, -1, 2, -0.9002714, 0, 1
1.549468, -1, 2, -0.8980398, 0, 1
1.564613, -1, 2, -0.8952446, 0, 1
1.579759, -1, 2, -0.8921213, 0, 1
1.594904, -1, 2, -0.89044, 0, 1
1.610049, -1, 2, -0.8868589, 0, 1
1.625195, -1, 2, -0.8827257, 0, 1
1.64034, -1, 2, -0.8779831, 0, 1
1.655486, -1, 2, -0.8726292, 0, 1
1.670631, -1, 2, -0.869915, 0, 1
1.685776, -1, 2, -0.8647118, 0, 1
1.700922, -1, 2, -0.859169, 0, 1
1.716067, -1, 2, -0.8528748, 0, 1
1.731213, -1, 2, -0.8463492, 0, 1
1.746358, -1, 2, -0.8428259, 0, 1
1.761503, -1, 2, -0.8357534, 0, 1
1.776649, -1, 2, -0.8286238, 0, 1
1.791794, -1, 2, -0.821053, 0, 1
1.80694, -1, 2, -0.8174925, 0, 1
1.822085, -1, 2, -0.8102956, 0, 1
1.83723, -1, 2, -0.803462, 0, 1
1.852376, -1, 2, -0.797061, 0, 1
1.867521, -1, 2, -0.7907934, 0, 1
1.882666, -1, 2, -0.7840872, 0, 1
1.897812, -1, 2, -0.7808213, 0, 1
1.912957, -1, 2, -0.7737203, 0, 1
1.928103, -1, 2, -0.7669287, 0, 1
1.943248, -1, 2, -0.7598643, 0, 1
1.958393, -1, 2, -0.7524815, 0, 1
1.973539, -1, 2, -0.7488194, 0, 1
1.988684, -1, 2, -0.7406578, 0, 1
2.00383, -2, 2, -0.7321076, 0, 1
2.018975, -2, 2, -0.7218018, 0, 1
2.03412, -2, 2, -0.7100086, 0, 1
2.049266, -2, 2, -0.7039137, 0, 1
2.064411, -2, 2, -0.6908765, 0, 1
2.079556, -2, 2, -0.6770077, 0, 1
2.094702, -2, 2, -0.6619654, 0, 1
2.109847, -2, 2, -0.6455812, 0, 1
2.124993, -2, 2, -0.6371694, 0, 1
2.140138, -2, 2, -0.6197758, 0, 1
2.155283, -2, 2, -0.6018381, 0, 1
2.170429, -2, 2, -0.5830307, 0, 1
2.185574, -2, 2, -0.5640397, 0, 1
2.20072, -2, 2, -0.5543413, 0, 1
2.215865, -2, 2, -0.5347457, 0, 1
2.23101, -2, 2, -0.5148859, 0, 1
2.246156, -2, 2, -0.4948678, 0, 1
2.261301, -2, 2, -0.4746485, 0, 1
2.276447, -2, 2, -0.464469, 0, 1
2.291592, -2, 2, -0.4441118, 0, 1
2.306737, -2, 2, -0.4231348, 0, 1
2.321883, -2, 2, -0.4012499, 0, 1
2.337028, -2, 2, -0.3791699, 0, 1
2.352174, -2, 2, -0.3676577, 0, 1
2.367319, -2, 2, -0.3448625, 0, 1
2.382464, -2, 2, -0.3222551, 0, 1
2.39761, -2, 2, -0.2999234, 0, 1
2.412755, -2, 2, -0.2789278, 0, 1
2.427901, -2, 2, -0.2686534, 0, 1
2.443046, -2, 2, -0.2489147, 0, 1
2.458191, -2, 2, -0.2290392, 0, 1
2.473337, -2, 2, -0.2091746, 0, 1
2.488482, -2, 2, -0.189178, 0, 1
2.503628, -2, 2, -0.1792011, 0, 1
2.518773, -2, 2, -0.1592345, 0, 1
2.533918, -2, 2, -0.138957, 0, 1
2.549064, -2, 2, -0.1205931, 0, 1
2.564209, -2, 2, -0.1005116, 0, 1
2.579354, -2, 2, -0.09052992, 0, 1
2.5945, -2, 2, -0.07078075, 0, 1
2.609645, -2, 2, -0.05237055, 0, 1
2.62479, -2, 2, -0.03266907, 0, 1
2.639936, -2, 2, -0.01290894, 0, 1
2.655081, -2, 2, -0.002959728, 0, 1
2.670227, -2, 2, 0.0172348, 0, 1
2.685372, -2, 2, 0.03794479, 0, 1
2.700517, -2, 2, 0.05852628, 0, 1
2.715663, -2, 2, 0.07949424, 0, 1
2.730808, -2, 2, 0.08983994, 0, 1
2.745954, -2, 2, 0.1100857, 0, 1
2.761099, -2, 2, 0.1297259, 0, 1
2.776244, -2, 2, 0.1475186, 0, 1
2.79139, -2, 2, 0.1674216, 0, 1
2.806535, -2, 2, 0.1771059, 0, 1
2.821681, -2, 2, 0.1966181, 0, 1
2.836826, -2, 2, 0.2169123, 0, 1
2.851971, -2, 2, 0.2360883, 0, 1
2.867117, -2, 2, 0.2560759, 0, 1
2.882262, -2, 2, 0.2658811, 0, 1
2.897408, -2, 2, 0.2865446, 0, 1
2.912553, -2, 2, 0.3068042, 0, 1
2.927698, -2, 2, 0.3278463, 0, 1
2.942844, -2, 2, 0.3484211, 0, 1
2.957989, -2, 2, 0.3692284, 0, 1
2.973135, -2, 2, 0.3795147, 0, 1
2.98828, -2, 2, 0.3997409, 0, 1
3.003425, -3, 2, 0.4199414, 0, 1
3.018571, -3, 2, 0.4401445, 0, 1
