car_pos_meter , car_pos_cell, car_speed, ped_pos_meter, ped_pos_cell, ped_speed
-5.125, 5, 2, 3.129866, 4, 1
-4.083755, 4, 2, 3.129359, 4, 1
-3.042509, 3, 2, 3.128836, 4, 1
-2.001264, 2, 2, 3.128711, 4, 1
-0.9600121, 0, 2, 3.127838, 4, 1
0.08123848, 0, 2, 3.127179, 4, 1
1.122489, -1, 2, 3.121069, 4, 1
2.16374, -2, 2, 3.114949, 4, 1
3.204985, -3, 2, 3.118186, 4, 1
4.246231, -4, 2, 3.100792, 4, 1
5.287476, -5, 2, 3.194649, 4, 1
6.328722, -6, 2, 3.288128, 4, 1
7.369967, -7, 2, 3.276452, 4, 1
8.411222, -8, 2, 3.264397, 4, 1
9.452491, -9, 2, 3.256687, 4, 1
10.49376, -10, 2, 3.252191, 4, 1
