car_pos_meter , car_pos_cell, car_speed, ped_pos_meter, ped_pos_cell, ped_speed
-41, 41, 2, 3.998821, 39, 1
-40.8334, 40, 2, 3.985273, 39, 1
-40.6668, 40, 2, 3.971774, 39, 1
-40.5002, 40, 2, 3.95814, 39, 1
-40.3336, 40, 2, 3.950994, 39, 1
-40.167, 40, 2, 3.937475, 39, 1
-40.0004, 40, 2, 3.922926, 39, 1
-39.83381, 39, 2, 3.908188, 39, 1
-39.66721, 39, 2, 3.893287, 38, 1
-39.50061, 39, 2, 3.877829, 38, 1
-39.33401, 39, 2, 3.870399, 38, 1
-39.16741, 39, 2, 3.854577, 38, 1
-39.00081, 39, 2, 3.838616, 38, 1
-38.83421, 38, 2, 3.822433, 38, 1
-38.66761, 38, 2, 3.805593, 38, 1
-38.50101, 38, 2, 3.797367, 37, 1
-38.33441, 38, 2, 3.780815, 37, 1
-38.16781, 38, 2, 3.764274, 37, 1
-38.00121, 38, 2, 3.747727, 37, 1
-37.83461, 37, 2, 3.730995, 37, 1
-37.66801, 37, 2, 3.722947, 37, 1
-37.50142, 37, 2, 3.706882, 37, 1
-37.33482, 37, 2, 3.691061, 36, 1
-37.16822, 37, 2, 3.675786, 36, 1
-37.00162, 37, 2, 3.66045, 36, 1
-36.83502, 36, 2, 3.65316, 36, 1
-36.66842, 36, 2, 3.637936, 36, 1
-36.50182, 36, 2, 3.622856, 36, 1
-36.33522, 36, 2, 3.607693, 36, 1
-36.16862, 36, 2, 3.591979, 35, 1
-36.00202, 36, 2, 3.584234, 35, 1
-35.83542, 35, 2, 3.568125, 35, 1
-35.66882, 35, 2, 3.552162, 35, 1
-35.50222, 35, 2, 3.536241, 35, 1
-35.33562, 35, 2, 3.528304, 35, 1
-35.16903, 35, 2, 3.512388, 35, 1
-35.00243, 35, 2, 3.495894, 34, 1
-34.83583, 34, 2, 3.47945, 34, 1
-34.66923, 34, 2, 3.462783, 34, 1
-34.50263, 34, 2, 3.445352, 34, 1
-34.33603, 34, 2, 3.436754, 34, 1
-34.16943, 34, 2, 3.419097, 34, 1
-34.00283, 34, 2, 3.401679, 34, 1
-33.83623, 33, 2, 3.383668, 33, 1
-33.66963, 33, 2, 3.365207, 33, 1
-33.50303, 33, 2, 3.356266, 33, 1
-33.33643, 33, 2, 3.337633, 33, 1
-33.16983, 33, 2, 3.319084, 33, 1
-33.00323, 33, 2, 3.301119, 33, 1
-32.83664, 32, 2, 3.282995, 32, 1
-32.67004, 32, 2, 3.274462, 32, 1
-32.50344, 32, 2, 3.257121, 32, 1
-32.33684, 32, 2, 3.239614, 32, 1
-32.17024, 32, 2, 3.222513, 32, 1
-32.00364, 32, 2, 3.214019, 32, 1
-31.83704, 31, 2, 3.198116, 31, 1
-31.67044, 31, 2, 3.182161, 31, 1
-31.50384, 31, 2, 3.166422, 31, 1
-31.33724, 31, 2, 3.151276, 31, 1
-31.17064, 31, 2, 3.136095, 31, 1
-31.00404, 31, 2, 3.128993, 31, 1
-30.83744, 30, 2, 3.113933, 31, 1
-30.67085, 30, 2, 3.098651, 30, 1
-30.50425, 30, 2, 3.083622, 30, 1
-30.33765, 30, 2, 3.068004, 30, 1
-30.17105, 30, 2, 3.060537, 30, 1
-30.00445, 30, 2, 3.044719, 30, 1
-29.83785, 29, 2, 3.029029, 30, 1
-29.67125, 29, 2, 3.013147, 30, 1
-29.50465, 29, 2, 2.996266, 29, 1
-29.33805, 29, 2, 2.988371, 29, 1
-29.17145, 29, 2, 2.971454, 29, 1
-29.00485, 29, 2, 2.954272, 29, 1
-28.83825, 28, 2, 2.936836, 29, 1
-28.67165, 28, 2, 2.918821, 29, 1
-28.50505, 28, 2, 2.909873, 29, 1
-28.33846, 28, 2, 2.890636, 28, 1
-28.17186, 28, 2, 2.872043, 28, 1
-28.00526, 28, 2, 2.853021, 28, 1
-27.83866, 27, 2, 2.833378, 28, 1
-27.67206, 27, 2, 2.823497, 28, 1
-27.50546, 27, 2, 2.80304, 28, 1
-27.33886, 27, 2, 2.782938, 27, 1
-27.17226, 27, 2, 2.762738, 27, 1
-27.00566, 27, 2, 2.741824, 27, 1
-26.83906, 26, 2, 2.731645, 27, 1
-26.67246, 26, 2, 2.711332, 27, 1
-26.50586, 26, 2, 2.691175, 26, 1
-26.33926, 26, 2, 2.671483, 26, 1
-26.17266, 26, 2, 2.651739, 26, 1
-26.00607, 26, 2, 2.642329, 26, 1
-25.83947, 25, 2, 2.623417, 26, 1
-25.67287, 25, 2, 2.60513, 26, 1
-25.50627, 25, 2, 2.58658, 25, 1
-25.33967, 25, 2, 2.567482, 25, 1
-25.17307, 25, 2, 2.557858, 25, 1
-25.00647, 25, 2, 2.537946, 25, 1
-24.83987, 24, 2, 2.518236, 25, 1
-24.67327, 24, 2, 2.49816, 24, 1
-24.50667, 24, 2, 2.478012, 24, 1
-24.34007, 24, 2, 2.467926, 24, 1
-24.17347, 24, 2, 2.447516, 24, 1
-24.00687, 24, 2, 2.426118, 24, 1
-23.84027, 23, 2, 2.404487, 24, 1
-23.67368, 23, 2, 2.381734, 23, 1
-23.50708, 23, 1, 2.370176, 23, 1
-23.42408, 23, 2, 2.346599, 23, 1
-23.25748, 23, 2, 2.323071, 23, 1
-23.09088, 23, 2, 2.300248, 23, 1
-22.92428, 22, 2, 2.27721, 22, 1
-22.75768, 22, 2, 2.265625, 22, 1
-22.59108, 22, 2, 2.242384, 22, 1
-22.42448, 22, 2, 2.220091, 22, 1
-22.25788, 22, 2, 2.197357, 21, 1
-22.09128, 22, 2, 2.174675, 21, 1
-21.92468, 21, 2, 2.163345, 21, 1
-21.75808, 21, 2, 2.140965, 21, 1
-21.59148, 21, 2, 2.118354, 21, 1
-21.42488, 21, 2, 2.09598, 20, 1
-21.25829, 21, 2, 2.073426, 20, 1
-21.09169, 21, 2, 2.062471, 20, 1
-20.92509, 20, 2, 2.040389, 20, 1
-20.75849, 20, 2, 2.018505, 20, 1
-20.59189, 20, 2, 1.996787, 19, 1
-20.42529, 20, 2, 1.985676, 19, 1
-20.25869, 20, 2, 1.963852, 19, 1
-20.09209, 20, 2, 1.942014, 19, 1
-19.92549, 19, 2, 1.920369, 19, 1
-19.75889, 19, 2, 1.89862, 18, 1
-19.59229, 19, 2, 1.876446, 18, 1
-19.42569, 19, 2, 1.865382, 18, 1
-19.25909, 19, 2, 1.843299, 18, 1
-19.09249, 19, 2, 1.82154, 18, 1
-18.9259, 18, 2, 1.79937, 17, 1
-18.7593, 18, 2, 1.777, 17, 1
-18.5927, 18, 2, 1.765958, 17, 1
-18.4261, 18, 2, 1.74377, 17, 1
-18.2595, 18, 2, 1.720744, 17, 1
-18.0929, 18, 2, 1.697539, 16, 1
-17.9263, 17, 2, 1.674702, 16, 1
-17.7597, 17, 2, 1.663185, 16, 1
-17.5931, 17, 2, 1.640874, 16, 1
-17.4265, 17, 2, 1.618739, 16, 1
-17.2599, 17, 2, 1.596764, 15, 1
-17.0933, 17, 2, 1.575561, 15, 1
-16.9267, 16, 2, 1.564758, 15, 1
-16.76011, 16, 2, 1.543436, 15, 1
-16.59351, 16, 2, 1.521941, 15, 1
-16.42691, 16, 2, 1.500089, 15, 1
-16.26031, 16, 2, 1.478113, 14, 1
-16.09371, 16, 2, 1.46704, 14, 1
-15.92711, 15, 2, 1.444669, 14, 1
-15.76051, 15, 2, 1.422007, 14, 1
-15.59391, 15, 2, 1.399346, 13, 1
-15.42731, 15, 2, 1.376511, 13, 1
-15.26071, 15, 2, 1.364655, 13, 1
-15.09411, 15, 2, 1.341956, 13, 1
-14.92751, 14, 2, 1.318901, 13, 1
-14.76091, 14, 2, 1.295773, 12, 1
-14.59431, 14, 2, 1.273338, 12, 1
-14.42771, 14, 2, 1.262261, 12, 1
-14.26111, 14, 2, 1.239953, 12, 1
-14.09451, 14, 2, 1.218372, 12, 1
-13.92791, 13, 2, 1.196321, 11, 1
-13.7613, 13, 2, 1.174525, 11, 1
-13.5947, 13, 2, 1.163402, 11, 1
-13.4281, 13, 2, 1.141041, 11, 1
-13.2615, 13, 2, 1.119276, 11, 1
-13.0949, 13, 2, 1.097496, 10, 1
-12.9283, 12, 2, 1.075646, 10, 1
-12.7617, 12, 2, 1.064623, 10, 1
-12.5951, 12, 2, 1.043257, 10, 1
-12.4285, 12, 2, 1.022028, 10, 1
-12.2619, 12, 2, 1.001394, 10, 1
-12.0953, 12, 2, 0.9811194, 9, 1
-11.9287, 11, 2, 0.9709044, 9, 1
-11.7621, 11, 2, 0.9507277, 9, 1
-11.5955, 11, 2, 0.931195, 9, 1
-11.4289, 11, 2, 0.9113474, 9, 1
-11.2623, 11, 2, 0.891551, 8, 1
-11.0957, 11, 2, 0.8817897, 8, 1
-10.9291, 10, 2, 0.8620512, 8, 1
-10.7625, 10, 2, 0.8421009, 8, 1
-10.5959, 10, 2, 0.8220727, 8, 1
-10.4293, 10, 2, 0.8020205, 8, 1
-10.2627, 10, 2, 0.7916336, 7, 1
-10.0961, 10, 2, 0.7709777, 7, 1
-9.9295, 9, 2, 0.7497396, 7, 1
-9.762899, 9, 2, 0.7279968, 7, 1
-9.596299, 9, 2, 0.7063737, 7, 1
-9.429699, 9, 2, 0.6950951, 6, 1
-9.263099, 9, 2, 0.6726985, 6, 1
-9.096498, 9, 2, 0.6505556, 6, 1
-8.929898, 8, 2, 0.6284702, 6, 1
-8.763298, 8, 2, 0.6061194, 6, 1
-8.596698, 8, 2, 0.594938, 5, 1
-8.430098, 8, 2, 0.5724461, 5, 1
-8.263497, 8, 2, 0.5498774, 5, 1
-8.096897, 8, 2, 0.5271668, 5, 1
-7.930297, 7, 2, 0.5043175, 5, 1
-7.763697, 7, 2, 0.4927959, 4, 1
-7.597096, 7, 2, 0.4706149, 4, 1
-7.430496, 7, 2, 0.4479179, 4, 1
-7.263896, 7, 2, 0.4249742, 4, 1
-7.097296, 7, 2, 0.4017727, 4, 1
-6.930696, 6, 2, 0.3902466, 3, 1
-6.764095, 6, 2, 0.3672717, 3, 1
-6.597495, 6, 2, 0.3446774, 3, 1
-6.430895, 6, 2, 0.3222833, 3, 1
-6.264295, 6, 2, 0.2999399, 2, 1
-6.097694, 6, 2, 0.288837, 2, 1
-5.931094, 5, 2, 0.2671535, 2, 1
-5.764494, 5, 2, 0.2449861, 2, 1
-5.597894, 5, 2, 0.2225499, 2, 1
-5.431293, 5, 2, 0.2000365, 2, 1
-5.264693, 5, 2, 0.1886797, 1, 1
-5.098093, 5, 2, 0.1662338, 1, 1
-4.931493, 4, 2, 0.1435244, 1, 1
-4.764893, 4, 2, 0.1208634, 1, 1
-4.598292, 4, 2, 0.09798479, 0, 1
-4.431692, 4, 2, 0.08675218, 0, 1
-4.265092, 4, 2, 0.06435156, 0, 1
-4.098492, 4, 2, 0.04238033, 0, 1
-3.931892, 3, 2, 0.02017093, 0, 1
-3.765292, 3, 2, -0.001685619, 0, 1
-3.598692, 3, 2, -0.012609, 0, 1
-3.432092, 3, 2, -0.03454208, 0, 1
-3.265492, 3, 2, -0.05636263, 0, 1
-3.098892, 3, 2, -0.07936859, 0, 1
-2.932292, 2, 2, -0.1031384, -1, 1
-2.765692, 2, 2, -0.1151218, -1, 1
-2.599092, 2, 2, -0.1387153, -1, 1
-2.432492, 2, 2, -0.1614237, -1, 1
-2.265892, 2, 2, -0.1830177, -1, 1
-2.099292, 2, 2, -0.2036285, -2, 1
-1.932692, 1, 2, -0.2134404, -2, 1
-1.766092, 1, 2, -0.2318697, -2, 1
-1.599492, 1, 2, -0.2496328, -2, 1
-1.432892, 1, 2, -0.2668562, -2, 1
-1.266292, 1, 2, -0.2843256, -2, 1
-1.099692, 1, 2, -0.2926445, -2, 1
-0.9330919, 0, 2, -0.3092947, -3, 1
-0.7664919, 0, 2, -0.3259344, -3, 1
-0.5998919, 0, 2, -0.3424034, -3, 1
-0.4332919, 0, 2, -0.359621, -3, 1
-0.2666919, 0, 2, -0.3681297, -3, 1
-0.1000919, 0, 2, -0.3849449, -3, 1
0.06650805, 0, 2, -0.4009771, -4, 1
0.233108, 0, 2, -0.4162989, -4, 1
0.399708, 0, 2, -0.4314771, -4, 1
0.566308, 0, 2, -0.4470124, -4, 1
0.732908, 0, 2, -0.4544363, -4, 1
0.899508, 0, 2, -0.469419, -4, 1
1.066108, -1, 2, -0.485703, -4, 1
1.232708, -1, 2, -0.5018883, -5, 1
1.399308, -1, 2, -0.5098114, -5, 1
1.565908, -1, 2, -0.5254307, -5, 1
1.732508, -1, 2, -0.5402389, -5, 1
1.899108, -1, 2, -0.5540323, -5, 1
2.065708, -2, 2, -0.5678148, -5, 1
2.232308, -2, 2, -0.574667, -5, 1
2.398908, -2, 2, -0.5884929, -5, 1
2.565508, -2, 2, -0.6026678, -6, 1
2.732108, -2, 2, -0.6171679, -6, 1
2.898708, -2, 2, -0.6318331, -6, 1
3.065308, -3, 2, -0.6460586, -6, 1
3.231908, -3, 2, -0.6526871, -6, 1
3.398508, -3, 2, -0.6656537, -6, 1
3.565108, -3, 2, -0.6782103, -6, 1
3.731708, -3, 2, -0.6914611, -6, 1
3.898308, -3, 2, -0.704731, -7, 1
4.064908, -4, 2, -0.7112975, -7, 1
4.231508, -4, 2, -0.7241149, -7, 1
4.398108, -4, 2, -0.7360978, -7, 1
4.564709, -4, 2, -0.748065, -7, 1
4.731309, -4, 2, -0.7598648, -7, 1
4.897909, -4, 2, -0.7654858, -7, 1
5.064509, -5, 2, -0.7766562, -7, 1
5.23111, -5, 2, -0.7824645, -7, 1
5.39771, -5, 2, -0.7885561, -7, 1
5.56431, -5, 2, -0.8127966, -8, 1
5.73091, -5, 2, -0.8240271, -8, 1
5.897511, -5, 2, -0.8348689, -8, 1
6.064111, -6, 2, -0.8402023, -8, 1
6.230711, -6, 2, -0.8509226, -8, 1
6.397311, -6, 2, -0.8611631, -8, 1
6.563911, -6, 2, -0.8701086, -8, 1
6.730512, -6, 2, -0.8789744, -8, 1
6.897112, -6, 2, -0.8833265, -8, 1
7.063712, -7, 2, -0.8915472, -8, 1
7.230312, -7, 2, -0.8988128, -8, 1
7.396913, -7, 2, -0.9046774, -9, 1
7.563513, -7, 2, -0.9104285, -9, 1
7.730113, -7, 2, -0.9128036, -9, 1
7.896713, -7, 2, -0.9174299, -9, 1
8.063313, -8, 2, -0.9212351, -9, 1
8.229914, -8, 2, -0.9240026, -9, 1
8.396514, -8, 2, -0.9253597, -9, 1
8.563114, -8, 2, -0.9276977, -9, 1
8.729714, -8, 2, -0.9298215, -9, 1
8.896315, -8, 2, -0.9316349, -9, 1
9.062915, -9, 2, -0.9338207, -9, 1
9.229515, -9, 2, -0.9346852, -9, 1
9.396115, -9, 2, -0.9353838, -9, 1
9.562716, -9, 2, -0.9364309, -9, 1
9.729316, -9, 2, -0.9367485, -9, 1
9.895916, -9, 2, -0.9367876, -9, 1
10.06252, -10, 2, -0.9367738, -9, 1
10.22912, -10, 2, -0.9369049, -9, 1
10.39572, -10, 2, -0.9370251, -9, 1
10.56232, -10, 2, -0.9367962, -9, 1
10.72892, -10, 2, -0.9363518, -9, 1
10.89552, -10, 2, -0.9355025, -9, 1
11.06212, -11, 2, -0.9341311, -9, 1
11.22872, -11, 2, -0.9327226, -9, 1
11.39532, -11, 2, -0.9312091, -9, 1
11.56192, -11, 2, -0.9302063, -9, 1
11.72852, -11, 2, -0.9285259, -9, 1
11.89512, -11, 2, -0.9266024, -9, 1
12.06172, -12, 2, -0.9249072, -9, 1
12.22832, -12, 2, -0.9234161, -9, 1
12.39492, -12, 2, -0.9226098, -9, 1
12.56152, -12, 2, -0.9219017, -9, 1
12.72812, -12, 2, -0.9211941, -9, 1
12.89472, -12, 2, -0.920342, -9, 1
13.06132, -13, 2, -0.9201202, -9, 1
13.22792, -13, 2, -0.9202375, -9, 1
13.39452, -13, 2, -0.9203949, -9, 1
13.56112, -13, 2, -0.9199433, -9, 1
13.72772, -13, 2, -0.9196568, -9, 1
13.89432, -13, 2, -0.919632, -9, 1
14.06092, -14, 2, -0.9196987, -9, 1
14.22752, -14, 2, -0.9205098, -9, 1
14.39412, -14, 2, -0.9208288, -9, 1
14.56072, -14, 2, -0.9212651, -9, 1
14.72732, -14, 2, -0.9215851, -9, 1
14.89392, -14, 2, -0.921711, -9, 1
15.06052, -15, 2, -0.9219971, -9, 1
15.22712, -15, 2, -0.9224067, -9, 1
15.39372, -15, 2, -0.9242177, -9, 1
15.56032, -15, 2, -0.9269934, -9, 1
15.72692, -15, 2, -0.9285202, -9, 1
15.89352, -15, 2, -0.9325414, -9, 1
16.06012, -16, 2, -0.9371638, -9, 1
16.22672, -16, 2, -0.9413719, -9, 1
16.39332, -16, 2, -0.9449058, -9, 1
16.55992, -16, 2, -0.9464149, -9, 1
16.72652, -16, 2, -0.9492002, -9, 1
16.89312, -16, 2, -0.950892, -9, 1
17.05972, -17, 2, -0.9494448, -9, 1
17.22632, -17, 2, -0.9486361, -9, 1
17.39292, -17, 2, -0.9484987, -9, 1
17.55952, -17, 2, -0.9472566, -9, 1
17.72612, -17, 2, -0.9453936, -9, 1
17.89272, -17, 2, -0.942853, -9, 1
18.05931, -18, 2, -0.9407096, -9, 1
18.22591, -18, 2, -0.9396586, -9, 1
18.39251, -18, 2, -0.937726, -9, 1
18.55911, -18, 2, -0.9365616, -9, 1
18.72571, -18, 2, -0.9356928, -9, 1
18.89231, -18, 2, -0.9343224, -9, 1
19.05891, -19, 2, -0.9337063, -9, 1
19.22551, -19, 2, -0.9323707, -9, 1
19.39211, -19, 2, -0.929934, -9, 1
19.55871, -19, 2, -0.9268274, -9, 1
19.72531, -19, 2, -0.9229069, -9, 1
19.89191, -19, 2, -0.9208765, -9, 1
20.05851, -20, 2, -0.916677, -9, 1
20.22511, -20, 2, -0.9134426, -9, 1
20.3917, -20, 2, -0.9104643, -9, 1
20.5583, -20, 2, -0.9065051, -9, 1
20.7249, -20, 2, -0.904026, -9, 1
20.8915, -20, 2, -0.8988023, -8, 1
21.0581, -21, 2, -0.8934484, -8, 1
21.2247, -21, 2, -0.8873959, -8, 1
21.3913, -21, 2, -0.8802691, -8, 1
21.5579, -21, 2, -0.8757668, -8, 1
21.7245, -21, 2, -0.8675032, -8, 1
21.8911, -21, 2, -0.858942, -8, 1
22.0577, -22, 2, -0.8493328, -8, 1
22.2243, -22, 2, -0.8442006, -8, 1
