car_pos_meter , car_pos_cell, car_speed, ped_pos_meter, ped_pos_cell, ped_speed
-41, 41, 2, 3.989598, 30, 1
-40.889, 40, 2, 3.973861, 30, 1
-40.778, 40, 2, 3.95903, 30, 1
-40.667, 40, 2, 3.94559, 30, 1
-40.556, 40, 2, 3.939323, 30, 1
-40.445, 40, 2, 3.927869, 30, 1
-36.005, 36, 2, 3.4976, 30, 1
-30.45499, 30, 2, 2.877471, 20, 1
-24.90499, 24, 2, 2.290287, 20, 1
-19.35499, 19, 2, 1.641644, 10, 1
-13.80499, 13, 2, 0.8310239, 0, 1
-8.254982, 8, 2, 0.2714696, 0, 1
-2.704979, 2, 2, -0.2834978, 0, 1
2.845023, -2, 2, -0.163146, 0, 1
