car_pos_meter , car_pos_cell, car_speed, ped_pos_meter, ped_pos_cell, ped_speed
-5.125, 5, 1, 4.199226, 5, 1
-5.122125, 5, 1, 4.19842, 5, 1
-5.11925, 5, 2, 4.196705, 5, 1
-5.098425, 5, 2, 4.194901, 5, 1
-5.0776, 5, 1, 4.193132, 5, 1
-5.074726, 5, 1, 4.191197, 5, 1
-5.071851, 5, 1, 4.18954, 5, 1
-5.068976, 5, 1, 4.188763, 5, 1
-5.066101, 5, 1, 4.187268, 5, 1
-5.063226, 5, 2, 4.185582, 5, 1
-5.042401, 5, 1, 4.183699, 5, 1
-5.039526, 5, 2, 4.182713, 5, 1
-5.018702, 5, 2, 4.180823, 5, 1
-4.997877, 4, 2, 4.178974, 5, 1
-4.977052, 4, 2, 4.176652, 5, 1
-4.956227, 4, 2, 4.174257, 5, 1
-4.935402, 4, 2, 4.172811, 5, 1
-4.914577, 4, 2, 4.169084, 5, 1
-4.893752, 4, 2, 4.165617, 5, 1
-4.872927, 4, 2, 4.161686, 5, 1
-4.852102, 4, 2, 4.157598, 5, 1
-4.831277, 4, 2, 4.155735, 5, 1
-4.810452, 4, 2, 4.151718, 5, 1
-4.789628, 4, 2, 4.147635, 5, 1
-4.768803, 4, 2, 4.143178, 5, 1
-4.747978, 4, 2, 4.139013, 5, 1
-4.727153, 4, 2, 4.136779, 5, 1
-4.706328, 4, 2, 4.132224, 5, 1
-4.685503, 4, 2, 4.12762, 5, 1
-4.664678, 4, 2, 4.122805, 5, 1
-4.643853, 4, 2, 4.117927, 5, 1
-4.623028, 4, 2, 4.115613, 5, 1
-4.602203, 4, 2, 4.111054, 5, 1
-4.581378, 4, 2, 4.106537, 5, 1
-4.560554, 4, 2, 4.102052, 5, 1
-4.539729, 4, 2, 4.097543, 5, 1
-4.518904, 4, 2, 4.093373, 5, 1
-4.498079, 4, 2, 4.091489, 5, 1
-4.477254, 4, 2, 4.087747, 5, 1
-4.456429, 4, 2, 4.083696, 5, 1
-4.435604, 4, 2, 4.079535, 5, 1
-4.414779, 4, 2, 4.075543, 5, 1
-4.393954, 4, 2, 4.07382, 5, 1
-4.373129, 4, 2, 4.069777, 5, 1
-4.352304, 4, 2, 4.06535, 5, 1
-4.33148, 4, 2, 4.060543, 5, 1
-4.310655, 4, 2, 4.058143, 5, 1
-4.28983, 4, 2, 4.053586, 5, 1
-4.269005, 4, 2, 4.048568, 5, 1
-4.24818, 4, 2, 4.042715, 5, 1
-4.227355, 4, 2, 4.037018, 5, 1
-4.20653, 4, 2, 4.030975, 5, 1
-4.185705, 4, 2, 4.027806, 5, 1
-4.16488, 4, 2, 4.021551, 5, 1
-4.144055, 4, 2, 4.015003, 5, 1
-3.18611, 3, 2, 3.830628, 4, 1
-2.144864, 2, 2, 3.803573, 4, 1
-1.103613, 1, 2, 3.77031, 4, 1
-0.06236261, 0, 2, 4.099341, 5, 1
0.978888, 0, 2, 4.189699, 5, 1
2.020139, -2, 2, 4.16768, 5, 1
3.061385, -3, 2, 3.986963, 5, 1
4.10263, -4, 2, 3.679804, 4, 1
5.143876, -5, 2, 3.421491, 4, 1
6.185121, -6, 2, 3.072373, 3, 1
7.226367, -7, 2, 3.183535, 4, 1
8.267618, -8, 2, 3.406184, 4, 1
9.308887, -9, 2, 3.39685, 4, 1
10.35016, -10, 2, 3.403355, 4, 1
11.39143, -11, 2, 3.451955, 4, 1
12.4327, -12, 2, 3.44697, 4, 1
13.47396, -13, 2, 3.423995, 4, 1
14.51523, -14, 2, 3.404894, 4, 1
15.5565, -15, 2, 3.481146, 4, 1
16.59774, -16, 2, 3.561832, 4, 1
17.63897, -17, 2, 3.789089, 4, 1
18.68019, -18, 2, 3.941272, 5, 1
19.72141, -19, 2, 4.031685, 5, 1
24.19866, -24, 2, 4.199685, 5, 1
24.21949, -24, 2, 4.198963, 5, 1
24.24031, -24, 2, 4.198682, 5, 1
24.26114, -24, 2, 4.198313, 5, 1
24.92752, -24, 2, 4.182852, 5, 1
25.96874, -25, 2, 4.117427, 5, 1
27.00996, -27, 2, 3.996257, 5, 1
28.05118, -28, 2, 4.016811, 5, 1
29.0924, -29, 2, 4.060309, 5, 1
30.13363, -30, 2, 4.047869, 5, 1
31.17485, -31, 2, 4.031827, 5, 1
32.21607, -32, 2, 4.031859, 5, 1
33.25729, -33, 2, 4.053578, 5, 1
34.29852, -34, 2, 4.052833, 5, 1
35.33974, -35, 2, 4.032044, 5, 1
36.38096, -36, 2, 3.972099, 5, 1
37.42218, -37, 2, 3.97507, 5, 1
38.4634, -38, 2, 3.976197, 5, 1
39.50462, -39, 2, 3.997737, 5, 1
40.54585, -40, 2, 3.995443, 5, 1
41.58707, -41, 2, 3.96721, 5, 1
42.62829, -42, 2, 3.967253, 5, 1
43.66951, -43, 2, 3.97215, 5, 1
44.71073, -44, 2, 3.975435, 5, 1
45.75195, -45, 2, 3.976054, 5, 1
46.79317, -46, 2, 3.990408, 5, 1
47.8344, -47, 2, 4.000509, 5, 1
48.87562, -48, 2, 3.992422, 5, 1
49.91684, -49, 2, 3.986358, 5, 1
50.95806, -50, 2, 3.981501, 5, 1
51.99928, -51, 2, 3.98077, 5, 1
53.0405, -53, 2, 3.980578, 5, 1
54.08173, -54, 2, 3.989914, 5, 1
55.12295, -55, 2, 4.0768, 5, 1
56.16417, -56, 2, 3.851579, 5, 1
57.20539, -57, 2, 3.5183, 4, 1
58.24661, -58, 2, 3.149954, 4, 1
59.28783, -59, 2, 2.871231, 3, 1
60.32906, -60, 2, 2.550642, 3, 1
61.37028, -61, 2, 2.161002, 2, 1
62.4115, -62, 2, 1.734133, 2, 1
63.45272, -63, 2, 1.579786, 2, 1
64.49403, -64, 2, 1.578281, 2, 1
65.53545, -65, 2, 1.616376, 2, 1
66.57686, -66, 2, 1.607902, 2, 1
67.61827, -67, 2, 1.603861, 2, 1
68.65968, -68, 2, 1.612176, 2, 1
69.7011, -69, 2, 1.611576, 2, 1
70.74251, -70, 2, 1.607342, 2, 1
71.78392, -71, 2, 1.603729, 2, 1
72.82533, -72, 2, 1.604846, 2, 1
73.86674, -73, 2, 1.607778, 2, 1
74.90816, -74, 2, 1.613195, 2, 1
75.94957, -75, 2, 1.612456, 2, 1
76.99098, -76, 2, 1.613317, 2, 1
78.03239, -78, 2, 1.59026, 2, 1
79.07381, -79, 2, 1.233802, 1, 1
80.11522, -80, 2, 1.132782, 1, 1
81.15663, -81, 2, 1.141921, 1, 1
82.19804, -82, 2, 1.145476, 1, 1
83.23946, -83, 2, 1.152287, 1, 1
84.28087, -84, 2, 1.159848, 1, 1
