car_pos_meter , car_pos_cell, car_speed, ped_pos_meter, ped_pos_cell, ped_speed
-5.125, 5, 2, 1.360628, 1, 1
-4.604377, 4, 2, 1.469617, 1, 1
-4.083755, 4, 2, 1.842355, 2, 1
-3.563132, 3, 2, 2.095265, 2, 1
-3.042509, 3, 2, 2.235616, 2, 1
-2.521886, 2, 2, 2.480222, 3, 1
-2.001264, 2, 2, 2.555557, 3, 1
-1.480638, 1, 2, 2.57434, 3, 1
-0.9600121, 0, 2, 2.510729, 3, 1
-0.4393865, 0, 2, 2.487554, 3, 1
0.08123851, 0, 2, 2.496062, 3, 1
0.6018636, 0, 2, 2.488334, 3, 1
1.122489, -1, 2, 2.489253, 3, 1
1.643115, -1, 2, 2.465144, 3, 1
2.16374, -2, 2, 2.483701, 3, 1
2.684363, -2, 2, 2.518966, 3, 1
3.204985, -3, 2, 2.534686, 3, 1
3.725608, -3, 2, 2.514967, 3, 1
4.246231, -4, 2, 2.51466, 3, 1
4.766854, -4, 2, 2.518028, 3, 1
5.287477, -5, 2, 2.535997, 3, 1
5.808099, -5, 2, 2.55347, 3, 1
6.328722, -6, 2, 2.574054, 3, 1
6.849345, -6, 2, 2.567682, 3, 1
7.369967, -7, 2, 2.574012, 3, 1
7.89059, -7, 2, 2.604134, 3, 1
8.411222, -8, 2, 2.607161, 3, 1
8.931856, -8, 2, 2.582661, 3, 1
9.452492, -9, 2, 2.526042, 3, 1
9.973125, -9, 2, 2.418826, 3, 1
10.49376, -10, 2, 2.375026, 3, 1
11.01439, -11, 2, 2.38496, 3, 1
11.53503, -11, 2, 2.388353, 3, 1
12.05566, -12, 2, 2.295497, 2, 1
12.5763, -12, 2, 2.31189, 3, 1
13.09693, -13, 2, 2.315876, 3, 1
13.61757, -13, 2, 2.273072, 2, 1
14.1382, -14, 2, 2.287863, 2, 1
14.65884, -14, 2, 2.303724, 2, 1
15.17947, -15, 2, 2.330459, 3, 1
15.70011, -15, 2, 2.33943, 3, 1
16.22073, -16, 2, 2.336239, 3, 1
16.74134, -16, 2, 2.327183, 3, 1
17.26195, -17, 2, 2.343826, 3, 1
17.78256, -17, 2, 2.368973, 3, 1
18.30317, -18, 2, 2.41573, 3, 1
18.82379, -18, 2, 2.43641, 3, 1
19.3444, -19, 2, 2.387555, 3, 1
19.86501, -19, 2, 2.389297, 3, 1
20.38562, -20, 2, 2.397966, 3, 1
20.90623, -20, 2, 2.413969, 3, 1
21.42684, -21, 2, 2.41976, 3, 1
21.94745, -21, 2, 2.415069, 3, 1
22.46806, -22, 2, 2.415337, 3, 1
22.98867, -22, 2, 2.419884, 3, 1
23.50928, -23, 2, 2.423111, 3, 1
24.02989, -24, 2, 2.424125, 3, 1
24.5505, -24, 2, 2.423623, 3, 1
25.07112, -25, 2, 2.42947, 3, 1
25.59173, -25, 2, 2.431572, 3, 1
26.11234, -26, 2, 2.425734, 3, 1
26.63295, -26, 2, 2.427773, 3, 1
27.15356, -27, 2, 2.434247, 3, 1
27.67417, -27, 2, 2.433625, 3, 1
28.19478, -28, 2, 2.449265, 3, 1
28.71539, -28, 2, 2.433765, 3, 1
29.236, -29, 2, 2.360705, 3, 1
29.75661, -29, 2, 2.339034, 3, 1
30.27722, -30, 2, 2.342558, 3, 1
30.79783, -30, 2, 2.317391, 3, 1
31.31845, -31, 2, 2.360479, 3, 1
31.83906, -31, 2, 2.359471, 3, 1
32.35967, -32, 2, 2.363799, 3, 1
32.88028, -32, 2, 2.371222, 3, 1
33.40089, -33, 2, 2.369375, 3, 1
33.9215, -33, 2, 2.363838, 3, 1
34.44211, -34, 2, 2.371524, 3, 1
34.96272, -34, 2, 2.381436, 3, 1
35.48333, -35, 2, 2.379203, 3, 1
36.00394, -36, 2, 2.37481, 3, 1
36.52456, -36, 2, 2.378562, 3, 1
37.04517, -37, 2, 2.405119, 3, 1
37.56578, -37, 2, 2.508437, 3, 1
38.08639, -38, 2, 2.497196, 3, 1
38.607, -38, 2, 2.461666, 3, 1
39.12761, -39, 2, 2.447407, 3, 1
39.64822, -39, 2, 2.440923, 3, 1
40.16883, -40, 2, 2.426389, 3, 1
40.68944, -40, 2, 2.386269, 3, 1
41.21005, -41, 2, 2.316959, 3, 1
41.73066, -41, 2, 2.303344, 2, 1
42.25127, -42, 2, 2.342026, 3, 1
42.77188, -42, 2, 2.35338, 3, 1
43.2925, -43, 2, 2.3625, 3, 1
43.81311, -43, 2, 2.40066, 3, 1
