pygame 2.1.2 (SDL 2.0.20, Python 3.10.6)
Hello from the pygame community. https://www.pygame.org/contribute.html
[0, [0, 0.0], 'COLLIDE']
[0, [0, 64.0], 'ESCAPE']
[1, [0, 32.0], 'ESCAPE']
[1, [0, 16.0], 'ESCAPE']
[1, [0, 8.0], 'ESCAPE']
[1, [0, 4.0], 'ESCAPE']
[1, [0, 2.0], 'COLLIDE']
[1, [0, 3.0], 'ESCAPE']
[1, [0, 2.5], 'COLLIDE']
[1, [0, 2.75], 'COLLIDE']
[1, [0, 2.875], 'ESCAPE']
[1, [0, 2.8125], 'ESCAPE']
[1, [0, 2.78125], 'ESCAPE']
[1, [0, 2.765625], 'COLLIDE']
[1, [0, 2.7734375], 'ESCAPE']
[1, [0, 2.76953125], 'COLLIDE']
[2, [10.0, 32.0], 'ESCAPE']
[2, [10.0, 16.0], 'ESCAPE']
[2, [10.0, 8.0], 'ESCAPE']
[2, [10.0, 4.0], 'ESCAPE']
[2, [10.0, 2.0], 'COLLIDE']
[2, [10.0, 3.0], 'ESCAPE']
[2, [10.0, 2.5], 'COLLIDE']
[2, [10.0, 2.75], 'ESCAPE']
[2, [10.0, 2.625], 'COLLIDE']
[2, [10.0, 2.6875], 'COLLIDE']
[2, [10.0, 2.71875], 'ESCAPE']
[2, [10.0, 2.703125], 'COLLIDE']
[2, [10.0, 2.7109375], 'ESCAPE']
[2, [10.0, 2.70703125], 'COLLIDE']
[3, [20.0, 32.0], 'ESCAPE']
[3, [20.0, 16.0], 'ESCAPE']
[3, [20.0, 8.0], 'ESCAPE']
[3, [20.0, 4.0], 'ESCAPE']
[3, [20.0, 2.0], 'COLLIDE']
[3, [20.0, 3.0], 'ESCAPE']
[3, [20.0, 2.5], 'COLLIDE']
[3, [20.0, 2.75], 'ESCAPE']
[3, [20.0, 2.625], 'COLLIDE']
[3, [20.0, 2.6875], 'COLLIDE']
[3, [20.0, 2.71875], 'COLLIDE']
[3, [20.0, 2.734375], 'COLLIDE']
[3, [20.0, 2.7421875], 'COLLIDE']
[3, [20.0, 2.74609375], 'ESCAPE']
[4, [30.0, 32.0], 'ESCAPE']
[4, [30.0, 16.0], 'ESCAPE']
[4, [30.0, 8.0], 'ESCAPE']
[4, [30.0, 4.0], 'ESCAPE']
[4, [30.0, 2.0], 'COLLIDE']
[4, [30.0, 3.0], 'ESCAPE']
[4, [30.0, 2.5], 'COLLIDE']
[4, [30.0, 2.75], 'COLLIDE']
[4, [30.0, 2.875], 'ESCAPE']
[4, [30.0, 2.8125], 'ESCAPE']
[4, [30.0, 2.78125], 'ESCAPE']
[4, [30.0, 2.765625], 'COLLIDE']
[4, [30.0, 2.7734375], 'COLLIDE']
[4, [30.0, 2.77734375], 'COLLIDE']
[5, [40, 32.0], 'ESCAPE']
[5, [40, 16.0], 'ESCAPE']
[5, [40, 8.0], 'ESCAPE']
[5, [40, 4.0], 'ESCAPE']
[5, [40, 2.0], 'COLLIDE']
[5, [40, 3.0], 'ESCAPE']
[5, [40, 2.5], 'COLLIDE']
[5, [40, 2.75], 'COLLIDE']
[5, [40, 2.875], 'ESCAPE']
[5, [40, 2.8125], 'ESCAPE']
[5, [40, 2.78125], 'ESCAPE']
[5, [40, 2.765625], 'ESCAPE']
[5, [40, 2.7578125], 'COLLIDE']
[5, [40, 2.76171875], 'ESCAPE']
[6, [45, 32.0], 'ESCAPE']
[6, [45, 16.0], 'ESCAPE']
[6, [45, 8.0], 'ESCAPE']
[6, [45, 4.0], 'ESCAPE']
[6, [45, 2.0], 'COLLIDE']
[6, [45, 3.0], 'ESCAPE']
[6, [45, 2.5], 'COLLIDE']
[6, [45, 2.75], 'COLLIDE']
[6, [45, 2.875], 'ESCAPE']
[6, [45, 2.8125], 'ESCAPE']
[6, [45, 2.78125], 'ESCAPE']
[6, [45, 2.765625], 'COLLIDE']
[6, [45, 2.7734375], 'ESCAPE']
[6, [45, 2.76953125], 'COLLIDE']
[7, [50, 32.0], 'ESCAPE']
[7, [50, 16.0], 'ESCAPE']
[7, [50, 8.0], 'ESCAPE']
[7, [50, 4.0], 'ESCAPE']
[7, [50, 2.0], 'COLLIDE']
[7, [50, 3.0], 'ESCAPE']
[7, [50, 2.5], 'COLLIDE']
[7, [50, 2.75], 'COLLIDE']
[7, [50, 2.875], 'ESCAPE']
[7, [50, 2.8125], 'ESCAPE']
[7, [50, 2.78125], 'ESCAPE']
[7, [50, 2.765625], 'ESCAPE']
[7, [50, 2.7578125], 'COLLIDE']
[7, [50, 2.76171875], 'ESCAPE']
[8, [60, 32.0], 'ESCAPE']
[8, [60, 16.0], 'ESCAPE']
[8, [60, 8.0], 'ESCAPE']
[8, [60, 4.0], 'ESCAPE']
[8, [60, 2.0], 'COLLIDE']
[8, [60, 3.0], 'ESCAPE']
[8, [60, 2.5], 'COLLIDE']
[8, [60, 2.75], 'ESCAPE']
[8, [60, 2.625], 'COLLIDE']
[8, [60, 2.6875], 'COLLIDE']
[8, [60, 2.71875], 'ESCAPE']
[8, [60, 2.703125], 'COLLIDE']
[8, [60, 2.7109375], 'COLLIDE']
[8, [60, 2.71484375], 'COLLIDE']
[9, [70, 32.0], 'ESCAPE']
[9, [70, 16.0], 'ESCAPE']
[9, [70, 8.0], 'ESCAPE']
[9, [70, 4.0], 'ESCAPE']
[9, [70, 2.0], 'COLLIDE']
[9, [70, 3.0], 'ESCAPE']
[9, [70, 2.5], 'COLLIDE']
[9, [70, 2.75], 'ESCAPE']
[9, [70, 2.625], 'COLLIDE']
[9, [70, 2.6875], 'ESCAPE']
[9, [70, 2.65625], 'COLLIDE']
[9, [70, 2.671875], 'ESCAPE']
[9, [70, 2.6640625], 'ESCAPE']
[9, [70, 2.66015625], 'ESCAPE']
[10, [80, 32.0], 'ESCAPE']
[10, [80, 16.0], 'ESCAPE']
[10, [80, 8.0], 'ESCAPE']
[10, [80, 4.0], 'ESCAPE']
[10, [80, 2.0], 'COLLIDE']
[10, [80, 3.0], 'ESCAPE']
[10, [80, 2.5], 'COLLIDE']
[10, [80, 2.75], 'ESCAPE']
[10, [80, 2.625], 'ESCAPE']
[10, [80, 2.5625], 'COLLIDE']
[10, [80, 2.59375], 'COLLIDE']
[10, [80, 2.609375], 'COLLIDE']
[10, [80, 2.6171875], 'COLLIDE']
[10, [80, 2.62109375], 'ESCAPE']
[11, [90, 32.0], 'ESCAPE']
[11, [90, 16.0], 'ESCAPE']
[11, [90, 8.0], 'ESCAPE']
[11, [90, 4.0], 'ESCAPE']
[11, [90, 2.0], 'COLLIDE']
[11, [90, 3.0], 'ESCAPE']
[11, [90, 2.5], 'COLLIDE']
[11, [90, 2.75], 'ESCAPE']
[11, [90, 2.625], 'ESCAPE']
[11, [90, 2.5625], 'COLLIDE']
[11, [90, 2.59375], 'ESCAPE']
[11, [90, 2.578125], 'COLLIDE']
[11, [90, 2.5859375], 'ESCAPE']
[11, [90, 2.58203125], 'COLLIDE']
[12, [100, 32.0], 'ESCAPE']
[12, [100, 16.0], 'ESCAPE']
[12, [100, 8.0], 'ESCAPE']
[12, [100, 4.0], 'ESCAPE']
[12, [100, 2.0], 'COLLIDE']
[12, [100, 3.0], 'ESCAPE']
[12, [100, 2.5], 'COLLIDE']
[12, [100, 2.75], 'ESCAPE']
[12, [100, 2.625], 'ESCAPE']
[12, [100, 2.5625], 'COLLIDE']
[12, [100, 2.59375], 'ESCAPE']
[12, [100, 2.578125], 'COLLIDE']
[12, [100, 2.5859375], 'COLLIDE']
[12, [100, 2.58984375], 'COLLIDE']
[13, [110, 32.0], 'ESCAPE']
[13, [110, 16.0], 'ESCAPE']
[13, [110, 8.0], 'ESCAPE']
[13, [110, 4.0], 'ESCAPE']
[13, [110, 2.0], 'COLLIDE']
[13, [110, 3.0], 'ESCAPE']
[13, [110, 2.5], 'COLLIDE']
[13, [110, 2.75], 'ESCAPE']
[13, [110, 2.625], 'ESCAPE']
[13, [110, 2.5625], 'COLLIDE']
[13, [110, 2.59375], 'COLLIDE']
[13, [110, 2.609375], 'COLLIDE']
[13, [110, 2.6171875], 'ESCAPE']
[13, [110, 2.61328125], 'COLLIDE']
[14, [120, 32.0], 'ESCAPE']
[14, [120, 16.0], 'ESCAPE']
[14, [120, 8.0], 'ESCAPE']
[14, [120, 4.0], 'ESCAPE']
[14, [120, 2.0], 'COLLIDE']
[14, [120, 3.0], 'ESCAPE']
[14, [120, 2.5], 'COLLIDE']
[14, [120, 2.75], 'ESCAPE']
[14, [120, 2.625], 'COLLIDE']
[14, [120, 2.6875], 'ESCAPE']
[14, [120, 2.65625], 'COLLIDE']
[14, [120, 2.671875], 'ESCAPE']
[14, [120, 2.6640625], 'COLLIDE']
[14, [120, 2.66796875], 'ESCAPE']
[15, [130, 32.0], 'ESCAPE']
[15, [130, 16.0], 'ESCAPE']
[15, [130, 8.0], 'ESCAPE']
[15, [130, 4.0], 'ESCAPE']
[15, [130, 2.0], 'COLLIDE']
[15, [130, 3.0], 'ESCAPE']
[15, [130, 2.5], 'COLLIDE']
[15, [130, 2.75], 'ESCAPE']
[15, [130, 2.625], 'COLLIDE']
[15, [130, 2.6875], 'COLLIDE']
[15, [130, 2.71875], 'COLLIDE']
[15, [130, 2.734375], 'COLLIDE']
[15, [130, 2.7421875], 'ESCAPE']
[15, [130, 2.73828125], 'COLLIDE']
[16, [135, 32.0], 'ESCAPE']
[16, [135, 16.0], 'ESCAPE']
[16, [135, 8.0], 'ESCAPE']
[16, [135, 4.0], 'ESCAPE']
[16, [135, 2.0], 'COLLIDE']
[16, [135, 3.0], 'ESCAPE']
[16, [135, 2.5], 'COLLIDE']
[16, [135, 2.75], 'COLLIDE']
[16, [135, 2.875], 'ESCAPE']
[16, [135, 2.8125], 'ESCAPE']
[16, [135, 2.78125], 'ESCAPE']
[16, [135, 2.765625], 'ESCAPE']
[16, [135, 2.7578125], 'COLLIDE']
[16, [135, 2.76171875], 'ESCAPE']
[17, [140, 32.0], 'ESCAPE']
[17, [140, 16.0], 'ESCAPE']
[17, [140, 8.0], 'ESCAPE']
[17, [140, 4.0], 'ESCAPE']
[17, [140, 2.0], 'COLLIDE']
[17, [140, 3.0], 'ESCAPE']
[17, [140, 2.5], 'COLLIDE']
[17, [140, 2.75], 'COLLIDE']
[17, [140, 2.875], 'ESCAPE']
[17, [140, 2.8125], 'ESCAPE']
[17, [140, 2.78125], 'ESCAPE']
[17, [140, 2.765625], 'ESCAPE']
[17, [140, 2.7578125], 'COLLIDE']
[17, [140, 2.76171875], 'COLLIDE']
[18, [150, 32.0], 'ESCAPE']
[18, [150, 16.0], 'ESCAPE']
[18, [150, 8.0], 'ESCAPE']
[18, [150, 4.0], 'ESCAPE']
[18, [150, 2.0], 'COLLIDE']
[18, [150, 3.0], 'ESCAPE']
[18, [150, 2.5], 'COLLIDE']
[18, [150, 2.75], 'COLLIDE']
[18, [150, 2.875], 'ESCAPE']
[18, [150, 2.8125], 'COLLIDE']
[18, [150, 2.84375], 'ESCAPE']
[18, [150, 2.828125], 'COLLIDE']
[18, [150, 2.8359375], 'COLLIDE']
[18, [150, 2.83984375], 'COLLIDE']
[19, [160, 32.0], 'ESCAPE']
[19, [160, 16.0], 'ESCAPE']
[19, [160, 8.0], 'ESCAPE']
[19, [160, 4.0], 'ESCAPE']
[19, [160, 2.0], 'COLLIDE']
[19, [160, 3.0], 'ESCAPE']
[19, [160, 2.5], 'COLLIDE']
[19, [160, 2.75], 'COLLIDE']
[19, [160, 2.875], 'COLLIDE']
[19, [160, 2.9375], 'ESCAPE']
[19, [160, 2.90625], 'ESCAPE']
[19, [160, 2.890625], 'COLLIDE']
[19, [160, 2.8984375], 'ESCAPE']
[19, [160, 2.89453125], 'COLLIDE']
[20, [170, 32.0], 'ESCAPE']
[20, [170, 16.0], 'ESCAPE']
[20, [170, 8.0], 'ESCAPE']
[20, [170, 4.0], 'ESCAPE']
[20, [170, 2.0], 'COLLIDE']
[20, [170, 3.0], 'ESCAPE']
[20, [170, 2.5], 'COLLIDE']
[20, [170, 2.75], 'COLLIDE']
[20, [170, 2.875], 'COLLIDE']
[20, [170, 2.9375], 'ESCAPE']
[20, [170, 2.90625], 'COLLIDE']
[20, [170, 2.921875], 'COLLIDE']
[20, [170, 2.9296875], 'COLLIDE']
[20, [170, 2.93359375], 'COLLIDE']
[21, [180, 32.0], 'ESCAPE']
[21, [180, 16.0], 'ESCAPE']
[21, [180, 8.0], 'ESCAPE']
[21, [180, 4.0], 'ESCAPE']
[21, [180, 2.0], 'COLLIDE']
[21, [180, 3.0], 'ESCAPE']
[21, [180, 2.5], 'COLLIDE']
[21, [180, 2.75], 'COLLIDE']
[21, [180, 2.875], 'COLLIDE']
[21, [180, 2.9375], 'COLLIDE']
[21, [180, 2.96875], 'COLLIDE']
[21, [180, 2.984375], 'ESCAPE']
[21, [180, 2.9765625], 'ESCAPE']
[21, [180, 2.97265625], 'COLLIDE']
[22, [180, 32.0], 'ESCAPE']
[22, [180, 16.0], 'ESCAPE']
[22, [180, 8.0], 'ESCAPE']
[22, [180, 4.0], 'ESCAPE']
[22, [180, 2.0], 'COLLIDE']
[22, [180, 3.0], 'ESCAPE']
[22, [180, 2.5], 'COLLIDE']
[22, [180, 2.75], 'COLLIDE']
[22, [180, 2.875], 'COLLIDE']
[22, [180, 2.9375], 'COLLIDE']
[22, [180, 2.96875], 'COLLIDE']
[22, [180, 2.984375], 'ESCAPE']
[22, [180, 2.9765625], 'ESCAPE']
[22, [180, 2.97265625], 'COLLIDE']
