0.000000 0.917969
0.196350 0.925781
0.392699 0.945312
0.589049 0.976562
0.837758 1.039062
0.981748 1.089844
1.178097 1.179688
1.374447 1.246094
1.570796 1.273438
1.767146 1.308594
1.963495 1.402344
2.159845 1.558594
2.356194 1.765625
2.552544 2.027344
2.748894 2.363281
2.945243 2.781250
3.141593 3.292969
