0.000000 2.523438
10.000000 2.558594
20.000000 2.582031
30.000000 2.582031
40.000000 2.539062
45.000000 2.535156
50.000000 2.511719
60.000000 2.488281
70.000000 2.468750
80.000000 2.453125
90.000000 2.437500
100.000000 2.464844
110.000000 2.515625
120.000000 2.535156
130.000000 2.585938
135.000000 2.597656
140.000000 2.609375
150.000000 2.632812
160.000000 2.660156
170.000000 2.691406
180.000000 2.691406
