pygame 2.1.2 (SDL 2.0.16, Python 3.10.9)
Hello from the pygame community. https://www.pygame.org/contribute.html
[0, [1.1, 1.1, 0, 0.0], 'COLLIDE']
[0, [1.1, 1.1, 0, 64.0], 'ESCAPE']
[1, [1.1, 1.1, 0, 32.0], 'ESCAPE']
[1, [1.1, 1.1, 0, 16.0], 'ESCAPE']
[1, [1.1, 1.1, 0, 8.0], 'ESCAPE']
[1, [1.1, 1.1, 0, 4.0], 'ESCAPE']
[1, [1.1, 1.1, 0, 2.0], 'ESCAPE']
[1, [1.1, 1.1, 0, 1.0], 'COLLIDE']
[1, [1.1, 1.1, 0, 1.5], 'ESCAPE']
[1, [1.1, 1.1, 0, 1.25], 'ESCAPE']
[1, [1.1, 1.1, 0, 1.125], 'ESCAPE']
[1, [1.1, 1.1, 0, 1.0625], 'ESCAPE']
[1, [1.1, 1.1, 0, 1.03125], 'COLLIDE']
[1, [1.1, 1.1, 0, 1.046875], 'COLLIDE']
[1, [1.1, 1.1, 0, 1.0546875], 'COLLIDE']
[1, [1.1, 1.1, 0, 1.05859375], 'COLLIDE']
[2, [1.1, 1.1, 10.0, 32.0], 'ESCAPE']
[2, [1.1, 1.1, 10.0, 16.0], 'ESCAPE']
[2, [1.1, 1.1, 10.0, 8.0], 'ESCAPE']
[2, [1.1, 1.1, 10.0, 4.0], 'ESCAPE']
[2, [1.1, 1.1, 10.0, 2.0], 'ESCAPE']
[2, [1.1, 1.1, 10.0, 1.0], 'COLLIDE']
[2, [1.1, 1.1, 10.0, 1.5], 'ESCAPE']
[2, [1.1, 1.1, 10.0, 1.25], 'ESCAPE']
[2, [1.1, 1.1, 10.0, 1.125], 'ESCAPE']
[2, [1.1, 1.1, 10.0, 1.0625], 'COLLIDE']
[2, [1.1, 1.1, 10.0, 1.09375], 'ESCAPE']
[2, [1.1, 1.1, 10.0, 1.078125], 'ESCAPE']
[2, [1.1, 1.1, 10.0, 1.0703125], 'ESCAPE']
[2, [1.1, 1.1, 10.0, 1.06640625], 'ESCAPE']
[3, [1.1, 1.1, 20.0, 32.0], 'ESCAPE']
[3, [1.1, 1.1, 20.0, 16.0], 'ESCAPE']
[3, [1.1, 1.1, 20.0, 8.0], 'ESCAPE']
[3, [1.1, 1.1, 20.0, 4.0], 'ESCAPE']
[3, [1.1, 1.1, 20.0, 2.0], 'ESCAPE']
[3, [1.1, 1.1, 20.0, 1.0], 'COLLIDE']
[3, [1.1, 1.1, 20.0, 1.5], 'ESCAPE']
[3, [1.1, 1.1, 20.0, 1.25], 'ESCAPE']
[3, [1.1, 1.1, 20.0, 1.125], 'ESCAPE']
[3, [1.1, 1.1, 20.0, 1.0625], 'ESCAPE']
[3, [1.1, 1.1, 20.0, 1.03125], 'COLLIDE']
[3, [1.1, 1.1, 20.0, 1.046875], 'COLLIDE']
[3, [1.1, 1.1, 20.0, 1.0546875], 'ESCAPE']
[3, [1.1, 1.1, 20.0, 1.05078125], 'ESCAPE']
[4, [1.1, 1.1, 30.0, 32.0], 'ESCAPE']
[4, [1.1, 1.1, 30.0, 16.0], 'ESCAPE']
[4, [1.1, 1.1, 30.0, 8.0], 'ESCAPE']
[4, [1.1, 1.1, 30.0, 4.0], 'ESCAPE']
[4, [1.1, 1.1, 30.0, 2.0], 'ESCAPE']
[4, [1.1, 1.1, 30.0, 1.0], 'COLLIDE']
[4, [1.1, 1.1, 30.0, 1.5], 'ESCAPE']
[4, [1.1, 1.1, 30.0, 1.25], 'ESCAPE']
[4, [1.1, 1.1, 30.0, 1.125], 'ESCAPE']
[4, [1.1, 1.1, 30.0, 1.0625], 'COLLIDE']
[4, [1.1, 1.1, 30.0, 1.09375], 'ESCAPE']
[4, [1.1, 1.1, 30.0, 1.078125], 'ESCAPE']
[4, [1.1, 1.1, 30.0, 1.0703125], 'ESCAPE']
[4, [1.1, 1.1, 30.0, 1.06640625], 'ESCAPE']
[5, [1.1, 1.1, 40, 32.0], 'ESCAPE']
[5, [1.1, 1.1, 40, 16.0], 'ESCAPE']
[5, [1.1, 1.1, 40, 8.0], 'ESCAPE']
[5, [1.1, 1.1, 40, 4.0], 'ESCAPE']
[5, [1.1, 1.1, 40, 2.0], 'ESCAPE']
[5, [1.1, 1.1, 40, 1.0], 'COLLIDE']
[5, [1.1, 1.1, 40, 1.5], 'ESCAPE']
[5, [1.1, 1.1, 40, 1.25], 'ESCAPE']
[5, [1.1, 1.1, 40, 1.125], 'ESCAPE']
[5, [1.1, 1.1, 40, 1.0625], 'COLLIDE']
[5, [1.1, 1.1, 40, 1.09375], 'COLLIDE']
[5, [1.1, 1.1, 40, 1.109375], 'ESCAPE']
[5, [1.1, 1.1, 40, 1.1015625], 'ESCAPE']
[5, [1.1, 1.1, 40, 1.09765625], 'COLLIDE']
[6, [1.1, 1.1, 45, 32.0], 'ESCAPE']
[6, [1.1, 1.1, 45, 16.0], 'ESCAPE']
[6, [1.1, 1.1, 45, 8.0], 'ESCAPE']
[6, [1.1, 1.1, 45, 4.0], 'ESCAPE']
[6, [1.1, 1.1, 45, 2.0], 'ESCAPE']
[6, [1.1, 1.1, 45, 1.0], 'COLLIDE']
[6, [1.1, 1.1, 45, 1.5], 'ESCAPE']
[6, [1.1, 1.1, 45, 1.25], 'ESCAPE']
[6, [1.1, 1.1, 45, 1.125], 'ESCAPE']
[6, [1.1, 1.1, 45, 1.0625], 'COLLIDE']
[6, [1.1, 1.1, 45, 1.09375], 'COLLIDE']
[6, [1.1, 1.1, 45, 1.109375], 'COLLIDE']
[6, [1.1, 1.1, 45, 1.1171875], 'COLLIDE']
[6, [1.1, 1.1, 45, 1.12109375], 'ESCAPE']
[7, [1.1, 1.1, 50, 32.0], 'ESCAPE']
[7, [1.1, 1.1, 50, 16.0], 'ESCAPE']
[7, [1.1, 1.1, 50, 8.0], 'ESCAPE']
[7, [1.1, 1.1, 50, 4.0], 'ESCAPE']
[7, [1.1, 1.1, 50, 2.0], 'ESCAPE']
[7, [1.1, 1.1, 50, 1.0], 'COLLIDE']
[7, [1.1, 1.1, 50, 1.5], 'ESCAPE']
[7, [1.1, 1.1, 50, 1.25], 'ESCAPE']
[7, [1.1, 1.1, 50, 1.125], 'COLLIDE']
[7, [1.1, 1.1, 50, 1.1875], 'ESCAPE']
[7, [1.1, 1.1, 50, 1.15625], 'ESCAPE']
[7, [1.1, 1.1, 50, 1.140625], 'COLLIDE']
[7, [1.1, 1.1, 50, 1.1484375], 'ESCAPE']
[7, [1.1, 1.1, 50, 1.14453125], 'ESCAPE']
[8, [1.1, 1.1, 60, 32.0], 'ESCAPE']
[8, [1.1, 1.1, 60, 16.0], 'ESCAPE']
[8, [1.1, 1.1, 60, 8.0], 'ESCAPE']
[8, [1.1, 1.1, 60, 4.0], 'ESCAPE']
[8, [1.1, 1.1, 60, 2.0], 'ESCAPE']
[8, [1.1, 1.1, 60, 1.0], 'COLLIDE']
[8, [1.1, 1.1, 60, 1.5], 'ESCAPE']
[8, [1.1, 1.1, 60, 1.25], 'ESCAPE']
[8, [1.1, 1.1, 60, 1.125], 'COLLIDE']
[8, [1.1, 1.1, 60, 1.1875], 'COLLIDE']
[8, [1.1, 1.1, 60, 1.21875], 'ESCAPE']
[8, [1.1, 1.1, 60, 1.203125], 'ESCAPE']
[8, [1.1, 1.1, 60, 1.1953125], 'ESCAPE']
[8, [1.1, 1.1, 60, 1.19140625], 'COLLIDE']
[9, [1.1, 1.1, 70, 32.0], 'ESCAPE']
[9, [1.1, 1.1, 70, 16.0], 'ESCAPE']
[9, [1.1, 1.1, 70, 8.0], 'ESCAPE']
[9, [1.1, 1.1, 70, 4.0], 'ESCAPE']
[9, [1.1, 1.1, 70, 2.0], 'ESCAPE']
[9, [1.1, 1.1, 70, 1.0], 'COLLIDE']
[9, [1.1, 1.1, 70, 1.5], 'ESCAPE']
[9, [1.1, 1.1, 70, 1.25], 'COLLIDE']
[9, [1.1, 1.1, 70, 1.375], 'ESCAPE']
[9, [1.1, 1.1, 70, 1.3125], 'ESCAPE']
[9, [1.1, 1.1, 70, 1.28125], 'ESCAPE']
[9, [1.1, 1.1, 70, 1.265625], 'ESCAPE']
[9, [1.1, 1.1, 70, 1.2578125], 'ESCAPE']
[9, [1.1, 1.1, 70, 1.25390625], 'COLLIDE']
[10, [1.1, 1.1, 80, 32.0], 'ESCAPE']
[10, [1.1, 1.1, 80, 16.0], 'ESCAPE']
[10, [1.1, 1.1, 80, 8.0], 'ESCAPE']
[10, [1.1, 1.1, 80, 4.0], 'ESCAPE']
[10, [1.1, 1.1, 80, 2.0], 'ESCAPE']
[10, [1.1, 1.1, 80, 1.0], 'COLLIDE']
[10, [1.1, 1.1, 80, 1.5], 'ESCAPE']
[10, [1.1, 1.1, 80, 1.25], 'COLLIDE']
[10, [1.1, 1.1, 80, 1.375], 'ESCAPE']
[10, [1.1, 1.1, 80, 1.3125], 'COLLIDE']
[10, [1.1, 1.1, 80, 1.34375], 'COLLIDE']
[10, [1.1, 1.1, 80, 1.359375], 'ESCAPE']
[10, [1.1, 1.1, 80, 1.3515625], 'COLLIDE']
[10, [1.1, 1.1, 80, 1.35546875], 'ESCAPE']
[11, [1.1, 1.1, 90, 32.0], 'ESCAPE']
[11, [1.1, 1.1, 90, 16.0], 'ESCAPE']
[11, [1.1, 1.1, 90, 8.0], 'ESCAPE']
[11, [1.1, 1.1, 90, 4.0], 'ESCAPE']
[11, [1.1, 1.1, 90, 2.0], 'ESCAPE']
[11, [1.1, 1.1, 90, 1.0], 'COLLIDE']
[11, [1.1, 1.1, 90, 1.5], 'ESCAPE']
[11, [1.1, 1.1, 90, 1.25], 'COLLIDE']
[11, [1.1, 1.1, 90, 1.375], 'COLLIDE']
[11, [1.1, 1.1, 90, 1.4375], 'ESCAPE']
[11, [1.1, 1.1, 90, 1.40625], 'ESCAPE']
[11, [1.1, 1.1, 90, 1.390625], 'ESCAPE']
[11, [1.1, 1.1, 90, 1.3828125], 'COLLIDE']
[11, [1.1, 1.1, 90, 1.38671875], 'ESCAPE']
[12, [1.1, 1.1, 100, 32.0], 'ESCAPE']
[12, [1.1, 1.1, 100, 16.0], 'ESCAPE']
[12, [1.1, 1.1, 100, 8.0], 'ESCAPE']
[12, [1.1, 1.1, 100, 4.0], 'ESCAPE']
[12, [1.1, 1.1, 100, 2.0], 'ESCAPE']
[12, [1.1, 1.1, 100, 1.0], 'COLLIDE']
[12, [1.1, 1.1, 100, 1.5], 'ESCAPE']
[12, [1.1, 1.1, 100, 1.25], 'COLLIDE']
[12, [1.1, 1.1, 100, 1.375], 'COLLIDE']
[12, [1.1, 1.1, 100, 1.4375], 'ESCAPE']
[12, [1.1, 1.1, 100, 1.40625], 'COLLIDE']
[12, [1.1, 1.1, 100, 1.421875], 'COLLIDE']
[12, [1.1, 1.1, 100, 1.4296875], 'ESCAPE']
[12, [1.1, 1.1, 100, 1.42578125], 'ESCAPE']
[13, [1.1, 1.1, 110, 32.0], 'ESCAPE']
[13, [1.1, 1.1, 110, 16.0], 'ESCAPE']
[13, [1.1, 1.1, 110, 8.0], 'ESCAPE']
[13, [1.1, 1.1, 110, 4.0], 'ESCAPE']
[13, [1.1, 1.1, 110, 2.0], 'ESCAPE']
[13, [1.1, 1.1, 110, 1.0], 'COLLIDE']
[13, [1.1, 1.1, 110, 1.5], 'COLLIDE']
[13, [1.1, 1.1, 110, 1.75], 'ESCAPE']
[13, [1.1, 1.1, 110, 1.625], 'ESCAPE']
[13, [1.1, 1.1, 110, 1.5625], 'ESCAPE']
[13, [1.1, 1.1, 110, 1.53125], 'ESCAPE']
[13, [1.1, 1.1, 110, 1.515625], 'COLLIDE']
[13, [1.1, 1.1, 110, 1.5234375], 'COLLIDE']
[13, [1.1, 1.1, 110, 1.52734375], 'COLLIDE']
[14, [1.1, 1.1, 120, 32.0], 'ESCAPE']
[14, [1.1, 1.1, 120, 16.0], 'ESCAPE']
[14, [1.1, 1.1, 120, 8.0], 'ESCAPE']
[14, [1.1, 1.1, 120, 4.0], 'ESCAPE']
[14, [1.1, 1.1, 120, 2.0], 'ESCAPE']
[14, [1.1, 1.1, 120, 1.0], 'COLLIDE']
[14, [1.1, 1.1, 120, 1.5], 'COLLIDE']
[14, [1.1, 1.1, 120, 1.75], 'ESCAPE']
[14, [1.1, 1.1, 120, 1.625], 'COLLIDE']
[14, [1.1, 1.1, 120, 1.6875], 'ESCAPE']
[14, [1.1, 1.1, 120, 1.65625], 'ESCAPE']
[14, [1.1, 1.1, 120, 1.640625], 'COLLIDE']
[14, [1.1, 1.1, 120, 1.6484375], 'ESCAPE']
[14, [1.1, 1.1, 120, 1.64453125], 'ESCAPE']
[15, [1.1, 1.1, 130, 32.0], 'ESCAPE']
[15, [1.1, 1.1, 130, 16.0], 'ESCAPE']
[15, [1.1, 1.1, 130, 8.0], 'ESCAPE']
[15, [1.1, 1.1, 130, 4.0], 'ESCAPE']
[15, [1.1, 1.1, 130, 2.0], 'ESCAPE']
[15, [1.1, 1.1, 130, 1.0], 'COLLIDE']
[15, [1.1, 1.1, 130, 1.5], 'COLLIDE']
[15, [1.1, 1.1, 130, 1.75], 'COLLIDE']
[15, [1.1, 1.1, 130, 1.875], 'ESCAPE']
[15, [1.1, 1.1, 130, 1.8125], 'ESCAPE']
[15, [1.1, 1.1, 130, 1.78125], 'ESCAPE']
[15, [1.1, 1.1, 130, 1.765625], 'ESCAPE']
[15, [1.1, 1.1, 130, 1.7578125], 'COLLIDE']
[15, [1.1, 1.1, 130, 1.76171875], 'COLLIDE']
[16, [1.1, 1.1, 135, 32.0], 'ESCAPE']
[16, [1.1, 1.1, 135, 16.0], 'ESCAPE']
[16, [1.1, 1.1, 135, 8.0], 'ESCAPE']
[16, [1.1, 1.1, 135, 4.0], 'ESCAPE']
[16, [1.1, 1.1, 135, 2.0], 'ESCAPE']
[16, [1.1, 1.1, 135, 1.0], 'COLLIDE']
[16, [1.1, 1.1, 135, 1.5], 'COLLIDE']
[16, [1.1, 1.1, 135, 1.75], 'COLLIDE']
[16, [1.1, 1.1, 135, 1.875], 'ESCAPE']
[16, [1.1, 1.1, 135, 1.8125], 'COLLIDE']
[16, [1.1, 1.1, 135, 1.84375], 'ESCAPE']
[16, [1.1, 1.1, 135, 1.828125], 'COLLIDE']
[16, [1.1, 1.1, 135, 1.8359375], 'ESCAPE']
[16, [1.1, 1.1, 135, 1.83203125], 'ESCAPE']
[17, [1.1, 1.1, 140, 32.0], 'ESCAPE']
[17, [1.1, 1.1, 140, 16.0], 'ESCAPE']
[17, [1.1, 1.1, 140, 8.0], 'ESCAPE']
[17, [1.1, 1.1, 140, 4.0], 'ESCAPE']
[17, [1.1, 1.1, 140, 2.0], 'ESCAPE']
[17, [1.1, 1.1, 140, 1.0], 'COLLIDE']
[17, [1.1, 1.1, 140, 1.5], 'COLLIDE']
[17, [1.1, 1.1, 140, 1.75], 'COLLIDE']
[17, [1.1, 1.1, 140, 1.875], 'COLLIDE']
[17, [1.1, 1.1, 140, 1.9375], 'ESCAPE']
[17, [1.1, 1.1, 140, 1.90625], 'COLLIDE']
[17, [1.1, 1.1, 140, 1.921875], 'ESCAPE']
[17, [1.1, 1.1, 140, 1.9140625], 'ESCAPE']
[17, [1.1, 1.1, 140, 1.91015625], 'ESCAPE']
[18, [1.1, 1.1, 150, 32.0], 'ESCAPE']
[18, [1.1, 1.1, 150, 16.0], 'ESCAPE']
[18, [1.1, 1.1, 150, 8.0], 'ESCAPE']
[18, [1.1, 1.1, 150, 4.0], 'ESCAPE']
[18, [1.1, 1.1, 150, 2.0], 'COLLIDE']
[18, [1.1, 1.1, 150, 3.0], 'ESCAPE']
[18, [1.1, 1.1, 150, 2.5], 'ESCAPE']
[18, [1.1, 1.1, 150, 2.25], 'ESCAPE']
[18, [1.1, 1.1, 150, 2.125], 'ESCAPE']
[18, [1.1, 1.1, 150, 2.0625], 'COLLIDE']
[18, [1.1, 1.1, 150, 2.09375], 'ESCAPE']
[18, [1.1, 1.1, 150, 2.078125], 'COLLIDE']
[18, [1.1, 1.1, 150, 2.0859375], 'ESCAPE']
[18, [1.1, 1.1, 150, 2.08203125], 'COLLIDE']
[19, [1.1, 1.1, 160, 32.0], 'ESCAPE']
[19, [1.1, 1.1, 160, 16.0], 'ESCAPE']
[19, [1.1, 1.1, 160, 8.0], 'ESCAPE']
[19, [1.1, 1.1, 160, 4.0], 'ESCAPE']
[19, [1.1, 1.1, 160, 2.0], 'COLLIDE']
[19, [1.1, 1.1, 160, 3.0], 'ESCAPE']
[19, [1.1, 1.1, 160, 2.5], 'ESCAPE']
[19, [1.1, 1.1, 160, 2.25], 'COLLIDE']
[19, [1.1, 1.1, 160, 2.375], 'ESCAPE']
[19, [1.1, 1.1, 160, 2.3125], 'ESCAPE']
[19, [1.1, 1.1, 160, 2.28125], 'COLLIDE']
[19, [1.1, 1.1, 160, 2.296875], 'COLLIDE']
[19, [1.1, 1.1, 160, 2.3046875], 'COLLIDE']
[19, [1.1, 1.1, 160, 2.30859375], 'COLLIDE']
[20, [1.1, 1.1, 170, 32.0], 'ESCAPE']
[20, [1.1, 1.1, 170, 16.0], 'ESCAPE']
[20, [1.1, 1.1, 170, 8.0], 'ESCAPE']
[20, [1.1, 1.1, 170, 4.0], 'ESCAPE']
[20, [1.1, 1.1, 170, 2.0], 'COLLIDE']
[20, [1.1, 1.1, 170, 3.0], 'ESCAPE']
[20, [1.1, 1.1, 170, 2.5], 'COLLIDE']
[20, [1.1, 1.1, 170, 2.75], 'ESCAPE']
[20, [1.1, 1.1, 170, 2.625], 'ESCAPE']
[20, [1.1, 1.1, 170, 2.5625], 'COLLIDE']
[20, [1.1, 1.1, 170, 2.59375], 'ESCAPE']
[20, [1.1, 1.1, 170, 2.578125], 'COLLIDE']
[20, [1.1, 1.1, 170, 2.5859375], 'COLLIDE']
[20, [1.1, 1.1, 170, 2.58984375], 'COLLIDE']
[21, [1.1, 1.1, 180, 32.0], 'ESCAPE']
[21, [1.1, 1.1, 180, 16.0], 'ESCAPE']
[21, [1.1, 1.1, 180, 8.0], 'ESCAPE']
[21, [1.1, 1.1, 180, 4.0], 'ESCAPE']
[21, [1.1, 1.1, 180, 2.0], 'COLLIDE']
[21, [1.1, 1.1, 180, 3.0], 'ESCAPE']
[21, [1.1, 1.1, 180, 2.5], 'COLLIDE']
[21, [1.1, 1.1, 180, 2.75], 'COLLIDE']
[21, [1.1, 1.1, 180, 2.875], 'COLLIDE']
[21, [1.1, 1.1, 180, 2.9375], 'ESCAPE']
[21, [1.1, 1.1, 180, 2.90625], 'COLLIDE']
[21, [1.1, 1.1, 180, 2.921875], 'COLLIDE']
[21, [1.1, 1.1, 180, 2.9296875], 'COLLIDE']
[21, [1.1, 1.1, 180, 2.93359375], 'ESCAPE']
[22, [1.1, 1.1, 180, 32.0], 'ESCAPE']
[22, [1.1, 1.1, 180, 16.0], 'ESCAPE']
[22, [1.1, 1.1, 180, 8.0], 'ESCAPE']
[22, [1.1, 1.1, 180, 4.0], 'ESCAPE']
[22, [1.1, 1.1, 180, 2.0], 'COLLIDE']
[22, [1.1, 1.1, 180, 3.0], 'ESCAPE']
[22, [1.1, 1.1, 180, 2.5], 'COLLIDE']
[22, [1.1, 1.1, 180, 2.75], 'COLLIDE']
[22, [1.1, 1.1, 180, 2.875], 'COLLIDE']
[22, [1.1, 1.1, 180, 2.9375], 'ESCAPE']
[22, [1.1, 1.1, 180, 2.90625], 'COLLIDE']
[22, [1.1, 1.1, 180, 2.921875], 'COLLIDE']
[22, [1.1, 1.1, 180, 2.9296875], 'COLLIDE']
[22, [1.1, 1.1, 180, 2.93359375], 'ESCAPE']
