0.000000 9.906250
10.000000 8.871094
20.000000 8.113281
30.000000 7.558594
40.000000 7.164062
45.000000 7.050781
50.000000 6.921875
60.000000 6.890625
70.000000 6.875000
80.000000 6.878906
90.000000 6.941406
100.000000 6.949219
110.000000 7.132812
120.000000 7.406250
130.000000 7.886719
135.000000 8.214844
140.000000 8.515625
150.000000 9.320312
160.000000 10.406250
170.000000 11.855469
180.000000 13.492188
