0.000000 11.332031
10.000000 10.851562
20.000000 10.460938
30.000000 10.218750
40.000000 10.125000
45.000000 10.066406
50.000000 10.062500
60.000000 10.023438
70.000000 10.089844
80.000000 10.097656
90.000000 10.125000
100.000000 10.156250
110.000000 10.277344
120.000000 10.406250
130.000000 10.730469
135.000000 10.902344
140.000000 11.136719
150.000000 11.644531
160.000000 12.328125
170.000000 13.160156
180.000000 14.074219
