0.000000 2.050781
10.000000 2.058594
20.000000 2.093750
30.000000 2.132812
40.000000 2.179688
45.000000 2.203125
50.000000 2.234375
60.000000 2.304688
70.000000 2.375000
80.000000 2.421875
90.000000 2.437500
100.000000 2.464844
110.000000 2.523438
120.000000 2.609375
130.000000 2.742188
135.000000 2.808594
140.000000 2.882812
150.000000 3.058594
160.000000 3.238281
170.000000 3.445312
180.000000 3.644531
