pygame 2.1.2 (SDL 2.0.20, Python 3.10.6)
Hello from the pygame community. https://www.pygame.org/contribute.html
[0, [0, 0.0], 'COLLIDE']
[0, [0, 64.0], 'ESCAPE']
[1, [0, 32.0], 'ESCAPE']
[1, [0, 16.0], 'ESCAPE']
[1, [0, 8.0], 'ESCAPE']
[1, [0, 4.0], 'ESCAPE']
[1, [0, 2.0], 'COLLIDE']
[1, [0, 3.0], 'ESCAPE']
[1, [0, 2.5], 'ESCAPE']
[1, [0, 2.25], 'ESCAPE']
[1, [0, 2.125], 'ESCAPE']
[1, [0, 2.0625], 'ESCAPE']
[1, [0, 2.03125], 'COLLIDE']
[1, [0, 2.046875], 'COLLIDE']
[1, [0, 2.0546875], 'ESCAPE']
[1, [0, 2.05078125], 'ESCAPE']
[2, [10.0, 32.0], 'ESCAPE']
[2, [10.0, 16.0], 'ESCAPE']
[2, [10.0, 8.0], 'ESCAPE']
[2, [10.0, 4.0], 'ESCAPE']
[2, [10.0, 2.0], 'COLLIDE']
[2, [10.0, 3.0], 'ESCAPE']
[2, [10.0, 2.5], 'ESCAPE']
[2, [10.0, 2.25], 'ESCAPE']
[2, [10.0, 2.125], 'ESCAPE']
[2, [10.0, 2.0625], 'ESCAPE']
[2, [10.0, 2.03125], 'COLLIDE']
[2, [10.0, 2.046875], 'COLLIDE']
[2, [10.0, 2.0546875], 'COLLIDE']
[2, [10.0, 2.05859375], 'ESCAPE']
[3, [20.0, 32.0], 'ESCAPE']
[3, [20.0, 16.0], 'ESCAPE']
[3, [20.0, 8.0], 'ESCAPE']
[3, [20.0, 4.0], 'ESCAPE']
[3, [20.0, 2.0], 'COLLIDE']
[3, [20.0, 3.0], 'ESCAPE']
[3, [20.0, 2.5], 'ESCAPE']
[3, [20.0, 2.25], 'ESCAPE']
[3, [20.0, 2.125], 'ESCAPE']
[3, [20.0, 2.0625], 'COLLIDE']
[3, [20.0, 2.09375], 'ESCAPE']
[3, [20.0, 2.078125], 'COLLIDE']
[3, [20.0, 2.0859375], 'COLLIDE']
[3, [20.0, 2.08984375], 'COLLIDE']
[4, [30.0, 32.0], 'ESCAPE']
[4, [30.0, 16.0], 'ESCAPE']
[4, [30.0, 8.0], 'ESCAPE']
[4, [30.0, 4.0], 'ESCAPE']
[4, [30.0, 2.0], 'COLLIDE']
[4, [30.0, 3.0], 'ESCAPE']
[4, [30.0, 2.5], 'ESCAPE']
[4, [30.0, 2.25], 'ESCAPE']
[4, [30.0, 2.125], 'COLLIDE']
[4, [30.0, 2.1875], 'ESCAPE']
[4, [30.0, 2.15625], 'ESCAPE']
[4, [30.0, 2.140625], 'ESCAPE']
[4, [30.0, 2.1328125], 'ESCAPE']
[4, [30.0, 2.12890625], 'COLLIDE']
[5, [40, 32.0], 'ESCAPE']
[5, [40, 16.0], 'ESCAPE']
[5, [40, 8.0], 'ESCAPE']
[5, [40, 4.0], 'ESCAPE']
[5, [40, 2.0], 'COLLIDE']
[5, [40, 3.0], 'ESCAPE']
[5, [40, 2.5], 'ESCAPE']
[5, [40, 2.25], 'ESCAPE']
[5, [40, 2.125], 'COLLIDE']
[5, [40, 2.1875], 'ESCAPE']
[5, [40, 2.15625], 'COLLIDE']
[5, [40, 2.171875], 'COLLIDE']
[5, [40, 2.1796875], 'ESCAPE']
[5, [40, 2.17578125], 'COLLIDE']
[6, [45, 32.0], 'ESCAPE']
[6, [45, 16.0], 'ESCAPE']
[6, [45, 8.0], 'ESCAPE']
[6, [45, 4.0], 'ESCAPE']
[6, [45, 2.0], 'COLLIDE']
[6, [45, 3.0], 'ESCAPE']
[6, [45, 2.5], 'ESCAPE']
[6, [45, 2.25], 'ESCAPE']
[6, [45, 2.125], 'COLLIDE']
[6, [45, 2.1875], 'COLLIDE']
[6, [45, 2.21875], 'ESCAPE']
[6, [45, 2.203125], 'ESCAPE']
[6, [45, 2.1953125], 'COLLIDE']
[6, [45, 2.19921875], 'COLLIDE']
[7, [50, 32.0], 'ESCAPE']
[7, [50, 16.0], 'ESCAPE']
[7, [50, 8.0], 'ESCAPE']
[7, [50, 4.0], 'ESCAPE']
[7, [50, 2.0], 'COLLIDE']
[7, [50, 3.0], 'ESCAPE']
[7, [50, 2.5], 'ESCAPE']
[7, [50, 2.25], 'ESCAPE']
[7, [50, 2.125], 'COLLIDE']
[7, [50, 2.1875], 'COLLIDE']
[7, [50, 2.21875], 'COLLIDE']
[7, [50, 2.234375], 'ESCAPE']
[7, [50, 2.2265625], 'COLLIDE']
[7, [50, 2.23046875], 'COLLIDE']
[8, [60, 32.0], 'ESCAPE']
[8, [60, 16.0], 'ESCAPE']
[8, [60, 8.0], 'ESCAPE']
[8, [60, 4.0], 'ESCAPE']
[8, [60, 2.0], 'COLLIDE']
[8, [60, 3.0], 'ESCAPE']
[8, [60, 2.5], 'ESCAPE']
[8, [60, 2.25], 'COLLIDE']
[8, [60, 2.375], 'ESCAPE']
[8, [60, 2.3125], 'ESCAPE']
[8, [60, 2.28125], 'COLLIDE']
[8, [60, 2.296875], 'COLLIDE']
[8, [60, 2.3046875], 'ESCAPE']
[8, [60, 2.30078125], 'COLLIDE']
[9, [70, 32.0], 'ESCAPE']
[9, [70, 16.0], 'ESCAPE']
[9, [70, 8.0], 'ESCAPE']
[9, [70, 4.0], 'ESCAPE']
[9, [70, 2.0], 'COLLIDE']
[9, [70, 3.0], 'ESCAPE']
[9, [70, 2.5], 'ESCAPE']
[9, [70, 2.25], 'COLLIDE']
[9, [70, 2.375], 'ESCAPE']
[9, [70, 2.3125], 'COLLIDE']
[9, [70, 2.34375], 'COLLIDE']
[9, [70, 2.359375], 'COLLIDE']
[9, [70, 2.3671875], 'COLLIDE']
[9, [70, 2.37109375], 'COLLIDE']
[10, [80, 32.0], 'ESCAPE']
[10, [80, 16.0], 'ESCAPE']
[10, [80, 8.0], 'ESCAPE']
[10, [80, 4.0], 'ESCAPE']
[10, [80, 2.0], 'COLLIDE']
[10, [80, 3.0], 'ESCAPE']
[10, [80, 2.5], 'ESCAPE']
[10, [80, 2.25], 'COLLIDE']
[10, [80, 2.375], 'COLLIDE']
[10, [80, 2.4375], 'ESCAPE']
[10, [80, 2.40625], 'COLLIDE']
[10, [80, 2.421875], 'ESCAPE']
[10, [80, 2.4140625], 'COLLIDE']
[10, [80, 2.41796875], 'COLLIDE']
[11, [90, 32.0], 'ESCAPE']
[11, [90, 16.0], 'ESCAPE']
[11, [90, 8.0], 'ESCAPE']
[11, [90, 4.0], 'ESCAPE']
[11, [90, 2.0], 'COLLIDE']
[11, [90, 3.0], 'ESCAPE']
[11, [90, 2.5], 'ESCAPE']
[11, [90, 2.25], 'COLLIDE']
[11, [90, 2.375], 'COLLIDE']
[11, [90, 2.4375], 'ESCAPE']
[11, [90, 2.40625], 'COLLIDE']
[11, [90, 2.421875], 'COLLIDE']
[11, [90, 2.4296875], 'COLLIDE']
[11, [90, 2.43359375], 'COLLIDE']
[12, [100, 32.0], 'ESCAPE']
[12, [100, 16.0], 'ESCAPE']
[12, [100, 8.0], 'ESCAPE']
[12, [100, 4.0], 'ESCAPE']
[12, [100, 2.0], 'COLLIDE']
[12, [100, 3.0], 'ESCAPE']
[12, [100, 2.5], 'ESCAPE']
[12, [100, 2.25], 'COLLIDE']
[12, [100, 2.375], 'COLLIDE']
[12, [100, 2.4375], 'COLLIDE']
[12, [100, 2.46875], 'ESCAPE']
[12, [100, 2.453125], 'COLLIDE']
[12, [100, 2.4609375], 'COLLIDE']
[12, [100, 2.46484375], 'ESCAPE']
[13, [110, 32.0], 'ESCAPE']
[13, [110, 16.0], 'ESCAPE']
[13, [110, 8.0], 'ESCAPE']
[13, [110, 4.0], 'ESCAPE']
[13, [110, 2.0], 'COLLIDE']
[13, [110, 3.0], 'ESCAPE']
[13, [110, 2.5], 'COLLIDE']
[13, [110, 2.75], 'ESCAPE']
[13, [110, 2.625], 'ESCAPE']
[13, [110, 2.5625], 'ESCAPE']
[13, [110, 2.53125], 'ESCAPE']
[13, [110, 2.515625], 'COLLIDE']
[13, [110, 2.5234375], 'ESCAPE']
[13, [110, 2.51953125], 'COLLIDE']
[14, [120, 32.0], 'ESCAPE']
[14, [120, 16.0], 'ESCAPE']
[14, [120, 8.0], 'ESCAPE']
[14, [120, 4.0], 'ESCAPE']
[14, [120, 2.0], 'COLLIDE']
[14, [120, 3.0], 'ESCAPE']
[14, [120, 2.5], 'COLLIDE']
[14, [120, 2.75], 'ESCAPE']
[14, [120, 2.625], 'ESCAPE']
[14, [120, 2.5625], 'COLLIDE']
[14, [120, 2.59375], 'COLLIDE']
[14, [120, 2.609375], 'ESCAPE']
[14, [120, 2.6015625], 'COLLIDE']
[14, [120, 2.60546875], 'COLLIDE']
[15, [130, 32.0], 'ESCAPE']
[15, [130, 16.0], 'ESCAPE']
[15, [130, 8.0], 'ESCAPE']
[15, [130, 4.0], 'ESCAPE']
[15, [130, 2.0], 'COLLIDE']
[15, [130, 3.0], 'ESCAPE']
[15, [130, 2.5], 'COLLIDE']
[15, [130, 2.75], 'ESCAPE']
[15, [130, 2.625], 'COLLIDE']
[15, [130, 2.6875], 'COLLIDE']
[15, [130, 2.71875], 'COLLIDE']
[15, [130, 2.734375], 'COLLIDE']
[15, [130, 2.7421875], 'ESCAPE']
[15, [130, 2.73828125], 'COLLIDE']
[16, [135, 32.0], 'ESCAPE']
[16, [135, 16.0], 'ESCAPE']
[16, [135, 8.0], 'ESCAPE']
[16, [135, 4.0], 'ESCAPE']
[16, [135, 2.0], 'COLLIDE']
[16, [135, 3.0], 'ESCAPE']
[16, [135, 2.5], 'COLLIDE']
[16, [135, 2.75], 'COLLIDE']
[16, [135, 2.875], 'ESCAPE']
[16, [135, 2.8125], 'ESCAPE']
[16, [135, 2.78125], 'COLLIDE']
[16, [135, 2.796875], 'COLLIDE']
[16, [135, 2.8046875], 'COLLIDE']
[16, [135, 2.80859375], 'ESCAPE']
[17, [140, 32.0], 'ESCAPE']
[17, [140, 16.0], 'ESCAPE']
[17, [140, 8.0], 'ESCAPE']
[17, [140, 4.0], 'ESCAPE']
[17, [140, 2.0], 'COLLIDE']
[17, [140, 3.0], 'ESCAPE']
[17, [140, 2.5], 'COLLIDE']
[17, [140, 2.75], 'COLLIDE']
[17, [140, 2.875], 'COLLIDE']
[17, [140, 2.9375], 'ESCAPE']
[17, [140, 2.90625], 'ESCAPE']
[17, [140, 2.890625], 'ESCAPE']
[17, [140, 2.8828125], 'ESCAPE']
[17, [140, 2.87890625], 'COLLIDE']
[18, [150, 32.0], 'ESCAPE']
[18, [150, 16.0], 'ESCAPE']
[18, [150, 8.0], 'ESCAPE']
[18, [150, 4.0], 'ESCAPE']
[18, [150, 2.0], 'COLLIDE']
[18, [150, 3.0], 'COLLIDE']
[18, [150, 3.5], 'ESCAPE']
[18, [150, 3.25], 'ESCAPE']
[18, [150, 3.125], 'ESCAPE']
[18, [150, 3.0625], 'ESCAPE']
[18, [150, 3.03125], 'COLLIDE']
[18, [150, 3.046875], 'COLLIDE']
[18, [150, 3.0546875], 'COLLIDE']
[18, [150, 3.05859375], 'ESCAPE']
[19, [160, 32.0], 'ESCAPE']
[19, [160, 16.0], 'ESCAPE']
[19, [160, 8.0], 'ESCAPE']
[19, [160, 4.0], 'ESCAPE']
[19, [160, 2.0], 'COLLIDE']
[19, [160, 3.0], 'COLLIDE']
[19, [160, 3.5], 'ESCAPE']
[19, [160, 3.25], 'ESCAPE']
[19, [160, 3.125], 'COLLIDE']
[19, [160, 3.1875], 'COLLIDE']
[19, [160, 3.21875], 'COLLIDE']
[19, [160, 3.234375], 'COLLIDE']
[19, [160, 3.2421875], 'ESCAPE']
[19, [160, 3.23828125], 'ESCAPE']
[20, [170, 32.0], 'ESCAPE']
[20, [170, 16.0], 'ESCAPE']
[20, [170, 8.0], 'ESCAPE']
[20, [170, 4.0], 'ESCAPE']
[20, [170, 2.0], 'COLLIDE']
[20, [170, 3.0], 'COLLIDE']
[20, [170, 3.5], 'ESCAPE']
[20, [170, 3.25], 'COLLIDE']
[20, [170, 3.375], 'COLLIDE']
[20, [170, 3.4375], 'COLLIDE']
[20, [170, 3.46875], 'ESCAPE']
[20, [170, 3.453125], 'ESCAPE']
[20, [170, 3.4453125], 'ESCAPE']
[20, [170, 3.44140625], 'COLLIDE']
[21, [180, 32.0], 'ESCAPE']
[21, [180, 16.0], 'ESCAPE']
[21, [180, 8.0], 'ESCAPE']
[21, [180, 4.0], 'ESCAPE']
[21, [180, 2.0], 'COLLIDE']
[21, [180, 3.0], 'COLLIDE']
[21, [180, 3.5], 'COLLIDE']
[21, [180, 3.75], 'ESCAPE']
[21, [180, 3.625], 'COLLIDE']
[21, [180, 3.6875], 'ESCAPE']
[21, [180, 3.65625], 'ESCAPE']
[21, [180, 3.640625], 'COLLIDE']
[21, [180, 3.6484375], 'ESCAPE']
[21, [180, 3.64453125], 'ESCAPE']
[22, [180, 32.0], 'ESCAPE']
[22, [180, 16.0], 'ESCAPE']
[22, [180, 8.0], 'ESCAPE']
[22, [180, 4.0], 'ESCAPE']
[22, [180, 2.0], 'COLLIDE']
[22, [180, 3.0], 'COLLIDE']
[22, [180, 3.5], 'COLLIDE']
[22, [180, 3.75], 'ESCAPE']
[22, [180, 3.625], 'COLLIDE']
[22, [180, 3.6875], 'ESCAPE']
[22, [180, 3.65625], 'ESCAPE']
[22, [180, 3.640625], 'COLLIDE']
[22, [180, 3.6484375], 'ESCAPE']
[22, [180, 3.64453125], 'ESCAPE']
