0.000000 0.937500
0.196350 0.937500
0.392699 0.937500
0.589049 0.937500
0.837758 0.937500
0.981748 0.937500
1.178097 0.937500
1.374447 0.937500
1.570796 0.937500
1.767146 0.949219
1.963495 0.984375
2.159845 1.042969
2.356194 1.128906
2.552544 1.250000
2.748894 1.414062
2.945243 1.621094
3.141593 1.875000
