0.000000 33.699219
10.000000 31.800781
20.000000 30.160156
30.000000 29.265625
40.000000 28.390625
45.000000 27.980469
50.000000 28.011719
60.000000 27.414062
70.000000 27.472656
80.000000 27.511719
90.000000 27.539062
100.000000 27.570312
110.000000 27.648438
120.000000 28.015625
130.000000 28.457031
135.000000 29.031250
140.000000 29.414062
150.000000 30.472656
160.000000 32.246094
170.000000 34.128906
180.000000 36.503906
