0.000000 39.343750
10.000000 37.363281
20.000000 35.210938
30.000000 34.753906
40.000000 33.613281
45.000000 33.179688
50.000000 32.722656
60.000000 33.019531
70.000000 32.609375
80.000000 32.417969
90.000000 32.425781
100.000000 32.203125
110.000000 32.726562
120.000000 33.070312
130.000000 33.250000
135.000000 34.054688
140.000000 34.183594
150.000000 35.414062
160.000000 36.929688
170.000000 38.734375
180.000000 41.558594
