0.000000 1.304688
10.000000 1.324219
20.000000 1.382812
30.000000 1.437500
40.000000 1.441406
45.000000 1.464844
50.000000 1.468750
60.000000 1.449219
70.000000 1.417969
80.000000 1.406250
90.000000 1.394531
100.000000 1.375000
110.000000 1.382812
120.000000 1.421875
130.000000 1.457031
135.000000 1.449219
140.000000 1.453125
150.000000 1.507812
160.000000 1.507812
170.000000 1.503906
180.000000 1.531250
