pygame 2.1.2 (SDL 2.0.20, Python 3.10.6)
Hello from the pygame community. https://www.pygame.org/contribute.html
[0, [0, 0.0], 'COLLIDE']
[0, [0, 32.0], 'ESCAPE']
[0, [0, 16.0], 'ESCAPE']
[0, [0, 8.0], 'ESCAPE']
[0, [0, 4.0], 'ESCAPE']
[0, [0, 2.0], 'ESCAPE']
[0, [0, 1.0], 'ESCAPE']
[0, [0, 0.5], 'COLLIDE']
[0, [0, 0.75], 'COLLIDE']
[0, [0, 0.875], 'COLLIDE']
[0, [0, 0.9375], 'ESCAPE']
[0, [0, 0.90625], 'ESCAPE']
[0, [0, 0.890625], 'COLLIDE']
[0, [0, 0.8984375], 'ESCAPE']
[0, [0, 0.89453125], 'COLLIDE']
[1, [0, 32.0], 'ESCAPE']
[1, [0, 16.0], 'ESCAPE']
[1, [0, 8.0], 'ESCAPE']
[1, [0, 4.0], 'ESCAPE']
[1, [0, 2.0], 'ESCAPE']
[1, [0, 1.0], 'ESCAPE']
[1, [0, 0.5], 'COLLIDE']
[1, [0, 0.75], 'COLLIDE']
[1, [0, 0.875], 'COLLIDE']
[1, [0, 0.9375], 'ESCAPE']
[1, [0, 0.90625], 'ESCAPE']
[1, [0, 0.890625], 'COLLIDE']
[1, [0, 0.8984375], 'ESCAPE']
[1, [0, 0.89453125], 'COLLIDE']
[2, [0.19634954084936207, 32.0], 'ESCAPE']
[2, [0.19634954084936207, 16.0], 'ESCAPE']
[2, [0.19634954084936207, 8.0], 'ESCAPE']
[2, [0.19634954084936207, 4.0], 'ESCAPE']
[2, [0.19634954084936207, 2.0], 'ESCAPE']
[2, [0.19634954084936207, 1.0], 'ESCAPE']
[2, [0.19634954084936207, 0.5], 'COLLIDE']
[2, [0.19634954084936207, 0.75], 'COLLIDE']
[2, [0.19634954084936207, 0.875], 'COLLIDE']
[2, [0.19634954084936207, 0.9375], 'ESCAPE']
[2, [0.19634954084936207, 0.90625], 'ESCAPE']
[2, [0.19634954084936207, 0.890625], 'COLLIDE']
[2, [0.19634954084936207, 0.8984375], 'ESCAPE']
[2, [0.19634954084936207, 0.89453125], 'COLLIDE']
[3, [0.39269908169872414, 32.0], 'ESCAPE']
[3, [0.39269908169872414, 16.0], 'ESCAPE']
[3, [0.39269908169872414, 8.0], 'ESCAPE']
[3, [0.39269908169872414, 4.0], 'ESCAPE']
[3, [0.39269908169872414, 2.0], 'ESCAPE']
[3, [0.39269908169872414, 1.0], 'ESCAPE']
[3, [0.39269908169872414, 0.5], 'COLLIDE']
[3, [0.39269908169872414, 0.75], 'COLLIDE']
[3, [0.39269908169872414, 0.875], 'COLLIDE']
[3, [0.39269908169872414, 0.9375], 'ESCAPE']
[3, [0.39269908169872414, 0.90625], 'ESCAPE']
[3, [0.39269908169872414, 0.890625], 'COLLIDE']
[3, [0.39269908169872414, 0.8984375], 'ESCAPE']
[3, [0.39269908169872414, 0.89453125], 'COLLIDE']
[4, [0.5890486225480862, 32.0], 'ESCAPE']
[4, [0.5890486225480862, 16.0], 'ESCAPE']
[4, [0.5890486225480862, 8.0], 'ESCAPE']
[4, [0.5890486225480862, 4.0], 'ESCAPE']
[4, [0.5890486225480862, 2.0], 'ESCAPE']
[4, [0.5890486225480862, 1.0], 'ESCAPE']
[4, [0.5890486225480862, 0.5], 'COLLIDE']
[4, [0.5890486225480862, 0.75], 'COLLIDE']
[4, [0.5890486225480862, 0.875], 'COLLIDE']
[4, [0.5890486225480862, 0.9375], 'ESCAPE']
[4, [0.5890486225480862, 0.90625], 'ESCAPE']
[4, [0.5890486225480862, 0.890625], 'COLLIDE']
[4, [0.5890486225480862, 0.8984375], 'COLLIDE']
[4, [0.5890486225480862, 0.90234375], 'ESCAPE']
[5, [0.8377580409572781, 32.0], 'ESCAPE']
[5, [0.8377580409572781, 16.0], 'ESCAPE']
[5, [0.8377580409572781, 8.0], 'ESCAPE']
[5, [0.8377580409572781, 4.0], 'ESCAPE']
[5, [0.8377580409572781, 2.0], 'ESCAPE']
[5, [0.8377580409572781, 1.0], 'ESCAPE']
[5, [0.8377580409572781, 0.5], 'COLLIDE']
[5, [0.8377580409572781, 0.75], 'COLLIDE']
[5, [0.8377580409572781, 0.875], 'COLLIDE']
[5, [0.8377580409572781, 0.9375], 'ESCAPE']
[5, [0.8377580409572781, 0.90625], 'ESCAPE']
[5, [0.8377580409572781, 0.890625], 'COLLIDE']
[5, [0.8377580409572781, 0.8984375], 'COLLIDE']
[5, [0.8377580409572781, 0.90234375], 'COLLIDE']
[6, [0.9817477042468103, 32.0], 'ESCAPE']
[6, [0.9817477042468103, 16.0], 'ESCAPE']
[6, [0.9817477042468103, 8.0], 'ESCAPE']
[6, [0.9817477042468103, 4.0], 'ESCAPE']
[6, [0.9817477042468103, 2.0], 'ESCAPE']
[6, [0.9817477042468103, 1.0], 'ESCAPE']
[6, [0.9817477042468103, 0.5], 'COLLIDE']
[6, [0.9817477042468103, 0.75], 'COLLIDE']
[6, [0.9817477042468103, 0.875], 'COLLIDE']
[6, [0.9817477042468103, 0.9375], 'ESCAPE']
[6, [0.9817477042468103, 0.90625], 'COLLIDE']
[6, [0.9817477042468103, 0.921875], 'ESCAPE']
[6, [0.9817477042468103, 0.9140625], 'ESCAPE']
[6, [0.9817477042468103, 0.91015625], 'COLLIDE']
[7, [1.1780972450961724, 32.0], 'ESCAPE']
[7, [1.1780972450961724, 16.0], 'ESCAPE']
[7, [1.1780972450961724, 8.0], 'ESCAPE']
[7, [1.1780972450961724, 4.0], 'ESCAPE']
[7, [1.1780972450961724, 2.0], 'ESCAPE']
[7, [1.1780972450961724, 1.0], 'ESCAPE']
[7, [1.1780972450961724, 0.5], 'COLLIDE']
[7, [1.1780972450961724, 0.75], 'COLLIDE']
[7, [1.1780972450961724, 0.875], 'COLLIDE']
[7, [1.1780972450961724, 0.9375], 'ESCAPE']
[7, [1.1780972450961724, 0.90625], 'COLLIDE']
[7, [1.1780972450961724, 0.921875], 'COLLIDE']
[7, [1.1780972450961724, 0.9296875], 'ESCAPE']
[7, [1.1780972450961724, 0.92578125], 'COLLIDE']
[8, [1.3744467859455345, 32.0], 'ESCAPE']
[8, [1.3744467859455345, 16.0], 'ESCAPE']
[8, [1.3744467859455345, 8.0], 'ESCAPE']
[8, [1.3744467859455345, 4.0], 'ESCAPE']
[8, [1.3744467859455345, 2.0], 'ESCAPE']
[8, [1.3744467859455345, 1.0], 'ESCAPE']
[8, [1.3744467859455345, 0.5], 'COLLIDE']
[8, [1.3744467859455345, 0.75], 'COLLIDE']
[8, [1.3744467859455345, 0.875], 'COLLIDE']
[8, [1.3744467859455345, 0.9375], 'COLLIDE']
[8, [1.3744467859455345, 0.96875], 'ESCAPE']
[8, [1.3744467859455345, 0.953125], 'ESCAPE']
[8, [1.3744467859455345, 0.9453125], 'COLLIDE']
[8, [1.3744467859455345, 0.94921875], 'ESCAPE']
[9, [1.5707963267948966, 32.0], 'ESCAPE']
[9, [1.5707963267948966, 16.0], 'ESCAPE']
[9, [1.5707963267948966, 8.0], 'ESCAPE']
[9, [1.5707963267948966, 4.0], 'ESCAPE']
[9, [1.5707963267948966, 2.0], 'ESCAPE']
[9, [1.5707963267948966, 1.0], 'ESCAPE']
[9, [1.5707963267948966, 0.5], 'COLLIDE']
[9, [1.5707963267948966, 0.75], 'COLLIDE']
[9, [1.5707963267948966, 0.875], 'COLLIDE']
[9, [1.5707963267948966, 0.9375], 'COLLIDE']
[9, [1.5707963267948966, 0.96875], 'COLLIDE']
[9, [1.5707963267948966, 0.984375], 'ESCAPE']
[9, [1.5707963267948966, 0.9765625], 'ESCAPE']
[9, [1.5707963267948966, 0.97265625], 'ESCAPE']
[10, [1.7671458676442586, 32.0], 'ESCAPE']
[10, [1.7671458676442586, 16.0], 'ESCAPE']
[10, [1.7671458676442586, 8.0], 'ESCAPE']
[10, [1.7671458676442586, 4.0], 'ESCAPE']
[10, [1.7671458676442586, 2.0], 'ESCAPE']
[10, [1.7671458676442586, 1.0], 'ESCAPE']
[10, [1.7671458676442586, 0.5], 'COLLIDE']
[10, [1.7671458676442586, 0.75], 'COLLIDE']
[10, [1.7671458676442586, 0.875], 'COLLIDE']
[10, [1.7671458676442586, 0.9375], 'COLLIDE']
[10, [1.7671458676442586, 0.96875], 'COLLIDE']
[10, [1.7671458676442586, 0.984375], 'COLLIDE']
[10, [1.7671458676442586, 0.9921875], 'COLLIDE']
[10, [1.7671458676442586, 0.99609375], 'ESCAPE']
[11, [1.9634954084936207, 32.0], 'ESCAPE']
[11, [1.9634954084936207, 16.0], 'ESCAPE']
[11, [1.9634954084936207, 8.0], 'ESCAPE']
[11, [1.9634954084936207, 4.0], 'ESCAPE']
[11, [1.9634954084936207, 2.0], 'ESCAPE']
[11, [1.9634954084936207, 1.0], 'COLLIDE']
[11, [1.9634954084936207, 1.5], 'ESCAPE']
[11, [1.9634954084936207, 1.25], 'ESCAPE']
[11, [1.9634954084936207, 1.125], 'ESCAPE']
[11, [1.9634954084936207, 1.0625], 'ESCAPE']
[11, [1.9634954084936207, 1.03125], 'ESCAPE']
[11, [1.9634954084936207, 1.015625], 'COLLIDE']
[11, [1.9634954084936207, 1.0234375], 'COLLIDE']
[11, [1.9634954084936207, 1.02734375], 'COLLIDE']
[12, [2.1598449493429825, 32.0], 'ESCAPE']
[12, [2.1598449493429825, 16.0], 'ESCAPE']
[12, [2.1598449493429825, 8.0], 'ESCAPE']
[12, [2.1598449493429825, 4.0], 'ESCAPE']
[12, [2.1598449493429825, 2.0], 'ESCAPE']
[12, [2.1598449493429825, 1.0], 'COLLIDE']
[12, [2.1598449493429825, 1.5], 'ESCAPE']
[12, [2.1598449493429825, 1.25], 'ESCAPE']
[12, [2.1598449493429825, 1.125], 'ESCAPE']
[12, [2.1598449493429825, 1.0625], 'COLLIDE']
[12, [2.1598449493429825, 1.09375], 'ESCAPE']
[12, [2.1598449493429825, 1.078125], 'COLLIDE']
[12, [2.1598449493429825, 1.0859375], 'COLLIDE']
[12, [2.1598449493429825, 1.08984375], 'ESCAPE']
[13, [2.356194490192345, 32.0], 'ESCAPE']
[13, [2.356194490192345, 16.0], 'ESCAPE']
[13, [2.356194490192345, 8.0], 'ESCAPE']
[13, [2.356194490192345, 4.0], 'ESCAPE']
[13, [2.356194490192345, 2.0], 'ESCAPE']
[13, [2.356194490192345, 1.0], 'COLLIDE']
[13, [2.356194490192345, 1.5], 'ESCAPE']
[13, [2.356194490192345, 1.25], 'ESCAPE']
[13, [2.356194490192345, 1.125], 'COLLIDE']
[13, [2.356194490192345, 1.1875], 'ESCAPE']
[13, [2.356194490192345, 1.15625], 'COLLIDE']
[13, [2.356194490192345, 1.171875], 'COLLIDE']
[13, [2.356194490192345, 1.1796875], 'ESCAPE']
[13, [2.356194490192345, 1.17578125], 'ESCAPE']
[14, [2.552544031041707, 32.0], 'ESCAPE']
[14, [2.552544031041707, 16.0], 'ESCAPE']
[14, [2.552544031041707, 8.0], 'ESCAPE']
[14, [2.552544031041707, 4.0], 'ESCAPE']
[14, [2.552544031041707, 2.0], 'ESCAPE']
[14, [2.552544031041707, 1.0], 'COLLIDE']
[14, [2.552544031041707, 1.5], 'ESCAPE']
[14, [2.552544031041707, 1.25], 'COLLIDE']
[14, [2.552544031041707, 1.375], 'ESCAPE']
[14, [2.552544031041707, 1.3125], 'ESCAPE']
[14, [2.552544031041707, 1.28125], 'COLLIDE']
[14, [2.552544031041707, 1.296875], 'COLLIDE']
[14, [2.552544031041707, 1.3046875], 'ESCAPE']
[14, [2.552544031041707, 1.30078125], 'ESCAPE']
[15, [2.748893571891069, 32.0], 'ESCAPE']
[15, [2.748893571891069, 16.0], 'ESCAPE']
[15, [2.748893571891069, 8.0], 'ESCAPE']
[15, [2.748893571891069, 4.0], 'ESCAPE']
[15, [2.748893571891069, 2.0], 'ESCAPE']
[15, [2.748893571891069, 1.0], 'COLLIDE']
[15, [2.748893571891069, 1.5], 'ESCAPE']
[15, [2.748893571891069, 1.25], 'COLLIDE']
[15, [2.748893571891069, 1.375], 'COLLIDE']
[15, [2.748893571891069, 1.4375], 'COLLIDE']
[15, [2.748893571891069, 1.46875], 'ESCAPE']
[15, [2.748893571891069, 1.453125], 'COLLIDE']
[15, [2.748893571891069, 1.4609375], 'ESCAPE']
[15, [2.748893571891069, 1.45703125], 'COLLIDE']
[16, [2.945243112740431, 32.0], 'ESCAPE']
[16, [2.945243112740431, 16.0], 'ESCAPE']
[16, [2.945243112740431, 8.0], 'ESCAPE']
[16, [2.945243112740431, 4.0], 'ESCAPE']
[16, [2.945243112740431, 2.0], 'ESCAPE']
[16, [2.945243112740431, 1.0], 'COLLIDE']
[16, [2.945243112740431, 1.5], 'COLLIDE']
[16, [2.945243112740431, 1.75], 'ESCAPE']
[16, [2.945243112740431, 1.625], 'COLLIDE']
[16, [2.945243112740431, 1.6875], 'ESCAPE']
[16, [2.945243112740431, 1.65625], 'COLLIDE']
[16, [2.945243112740431, 1.671875], 'ESCAPE']
[16, [2.945243112740431, 1.6640625], 'COLLIDE']
[16, [2.945243112740431, 1.66796875], 'ESCAPE']
[17, [3.141592653589793, 32.0], 'ESCAPE']
[17, [3.141592653589793, 16.0], 'ESCAPE']
[17, [3.141592653589793, 8.0], 'ESCAPE']
[17, [3.141592653589793, 4.0], 'ESCAPE']
[17, [3.141592653589793, 2.0], 'ESCAPE']
[17, [3.141592653589793, 1.0], 'COLLIDE']
[17, [3.141592653589793, 1.5], 'COLLIDE']
[17, [3.141592653589793, 1.75], 'COLLIDE']
[17, [3.141592653589793, 1.875], 'COLLIDE']
[17, [3.141592653589793, 1.9375], 'ESCAPE']
[17, [3.141592653589793, 1.90625], 'COLLIDE']
[17, [3.141592653589793, 1.921875], 'COLLIDE']
[17, [3.141592653589793, 1.9296875], 'ESCAPE']
[17, [3.141592653589793, 1.92578125], 'ESCAPE']
[18, [3.141592653589793, 32.0], 'ESCAPE']
[18, [3.141592653589793, 16.0], 'ESCAPE']
[18, [3.141592653589793, 8.0], 'ESCAPE']
[18, [3.141592653589793, 4.0], 'ESCAPE']
[18, [3.141592653589793, 2.0], 'ESCAPE']
[18, [3.141592653589793, 1.0], 'COLLIDE']
[18, [3.141592653589793, 1.5], 'COLLIDE']
[18, [3.141592653589793, 1.75], 'COLLIDE']
[18, [3.141592653589793, 1.875], 'COLLIDE']
[18, [3.141592653589793, 1.9375], 'ESCAPE']
[18, [3.141592653589793, 1.90625], 'COLLIDE']
[18, [3.141592653589793, 1.921875], 'COLLIDE']
[18, [3.141592653589793, 1.9296875], 'ESCAPE']
[18, [3.141592653589793, 1.92578125], 'ESCAPE']
