0.000000 1.062500
10.000000 1.066406
20.000000 1.050781
30.000000 1.066406
40.000000 1.101562
45.000000 1.121094
50.000000 1.144531
60.000000 1.195312
70.000000 1.257812
80.000000 1.355469
90.000000 1.386719
100.000000 1.425781
110.000000 1.531250
120.000000 1.644531
130.000000 1.765625
135.000000 1.832031
140.000000 1.910156
150.000000 2.085938
160.000000 2.312500
170.000000 2.593750
180.000000 2.933594
