pygame 2.1.2 (SDL 2.0.20, Python 3.10.6)
Hello from the pygame community. https://www.pygame.org/contribute.html
[0, [0, 0.0], 'COLLIDE']
[0, [0, 64.0], 'ESCAPE']
[1, [0, 32.0], 'ESCAPE']
[1, [0, 16.0], 'ESCAPE']
[1, [0, 8.0], 'ESCAPE']
[1, [0, 4.0], 'ESCAPE']
[1, [0, 2.0], 'COLLIDE']
[1, [0, 3.0], 'ESCAPE']
[1, [0, 2.5], 'ESCAPE']
[1, [0, 2.25], 'ESCAPE']
[1, [0, 2.125], 'COLLIDE']
[1, [0, 2.1875], 'COLLIDE']
[1, [0, 2.21875], 'COLLIDE']
[1, [0, 2.234375], 'ESCAPE']
[1, [0, 2.2265625], 'COLLIDE']
[1, [0, 2.23046875], 'COLLIDE']
[2, [10.0, 32.0], 'ESCAPE']
[2, [10.0, 16.0], 'ESCAPE']
[2, [10.0, 8.0], 'ESCAPE']
[2, [10.0, 4.0], 'ESCAPE']
[2, [10.0, 2.0], 'COLLIDE']
[2, [10.0, 3.0], 'ESCAPE']
[2, [10.0, 2.5], 'ESCAPE']
[2, [10.0, 2.25], 'ESCAPE']
[2, [10.0, 2.125], 'COLLIDE']
[2, [10.0, 2.1875], 'COLLIDE']
[2, [10.0, 2.21875], 'COLLIDE']
[2, [10.0, 2.234375], 'ESCAPE']
[2, [10.0, 2.2265625], 'COLLIDE']
[2, [10.0, 2.23046875], 'COLLIDE']
[3, [20.0, 32.0], 'ESCAPE']
[3, [20.0, 16.0], 'ESCAPE']
[3, [20.0, 8.0], 'ESCAPE']
[3, [20.0, 4.0], 'ESCAPE']
[3, [20.0, 2.0], 'COLLIDE']
[3, [20.0, 3.0], 'ESCAPE']
[3, [20.0, 2.5], 'ESCAPE']
[3, [20.0, 2.25], 'ESCAPE']
[3, [20.0, 2.125], 'COLLIDE']
[3, [20.0, 2.1875], 'COLLIDE']
[3, [20.0, 2.21875], 'COLLIDE']
[3, [20.0, 2.234375], 'ESCAPE']
[3, [20.0, 2.2265625], 'ESCAPE']
[3, [20.0, 2.22265625], 'ESCAPE']
[4, [30.0, 32.0], 'ESCAPE']
[4, [30.0, 16.0], 'ESCAPE']
[4, [30.0, 8.0], 'ESCAPE']
[4, [30.0, 4.0], 'ESCAPE']
[4, [30.0, 2.0], 'COLLIDE']
[4, [30.0, 3.0], 'ESCAPE']
[4, [30.0, 2.5], 'ESCAPE']
[4, [30.0, 2.25], 'ESCAPE']
[4, [30.0, 2.125], 'COLLIDE']
[4, [30.0, 2.1875], 'COLLIDE']
[4, [30.0, 2.21875], 'COLLIDE']
[4, [30.0, 2.234375], 'COLLIDE']
[4, [30.0, 2.2421875], 'COLLIDE']
[4, [30.0, 2.24609375], 'COLLIDE']
[5, [40, 32.0], 'ESCAPE']
[5, [40, 16.0], 'ESCAPE']
[5, [40, 8.0], 'ESCAPE']
[5, [40, 4.0], 'ESCAPE']
[5, [40, 2.0], 'COLLIDE']
[5, [40, 3.0], 'ESCAPE']
[5, [40, 2.5], 'ESCAPE']
[5, [40, 2.25], 'COLLIDE']
[5, [40, 2.375], 'ESCAPE']
[5, [40, 2.3125], 'ESCAPE']
[5, [40, 2.28125], 'ESCAPE']
[5, [40, 2.265625], 'COLLIDE']
[5, [40, 2.2734375], 'COLLIDE']
[5, [40, 2.27734375], 'ESCAPE']
[6, [45, 32.0], 'ESCAPE']
[6, [45, 16.0], 'ESCAPE']
[6, [45, 8.0], 'ESCAPE']
[6, [45, 4.0], 'ESCAPE']
[6, [45, 2.0], 'COLLIDE']
[6, [45, 3.0], 'ESCAPE']
[6, [45, 2.5], 'ESCAPE']
[6, [45, 2.25], 'COLLIDE']
[6, [45, 2.375], 'ESCAPE']
[6, [45, 2.3125], 'ESCAPE']
[6, [45, 2.28125], 'COLLIDE']
[6, [45, 2.296875], 'ESCAPE']
[6, [45, 2.2890625], 'COLLIDE']
[6, [45, 2.29296875], 'COLLIDE']
[7, [50, 32.0], 'ESCAPE']
[7, [50, 16.0], 'ESCAPE']
[7, [50, 8.0], 'ESCAPE']
[7, [50, 4.0], 'ESCAPE']
[7, [50, 2.0], 'COLLIDE']
[7, [50, 3.0], 'ESCAPE']
[7, [50, 2.5], 'ESCAPE']
[7, [50, 2.25], 'COLLIDE']
[7, [50, 2.375], 'ESCAPE']
[7, [50, 2.3125], 'ESCAPE']
[7, [50, 2.28125], 'COLLIDE']
[7, [50, 2.296875], 'COLLIDE']
[7, [50, 2.3046875], 'COLLIDE']
[7, [50, 2.30859375], 'COLLIDE']
[8, [60, 32.0], 'ESCAPE']
[8, [60, 16.0], 'ESCAPE']
[8, [60, 8.0], 'ESCAPE']
[8, [60, 4.0], 'ESCAPE']
[8, [60, 2.0], 'COLLIDE']
[8, [60, 3.0], 'ESCAPE']
[8, [60, 2.5], 'ESCAPE']
[8, [60, 2.25], 'COLLIDE']
[8, [60, 2.375], 'ESCAPE']
[8, [60, 2.3125], 'COLLIDE']
[8, [60, 2.34375], 'COLLIDE']
[8, [60, 2.359375], 'ESCAPE']
[8, [60, 2.3515625], 'COLLIDE']
[8, [60, 2.35546875], 'ESCAPE']
[9, [70, 32.0], 'ESCAPE']
[9, [70, 16.0], 'ESCAPE']
[9, [70, 8.0], 'ESCAPE']
[9, [70, 4.0], 'ESCAPE']
[9, [70, 2.0], 'COLLIDE']
[9, [70, 3.0], 'ESCAPE']
[9, [70, 2.5], 'ESCAPE']
[9, [70, 2.25], 'COLLIDE']
[9, [70, 2.375], 'COLLIDE']
[9, [70, 2.4375], 'ESCAPE']
[9, [70, 2.40625], 'COLLIDE']
[9, [70, 2.421875], 'ESCAPE']
[9, [70, 2.4140625], 'ESCAPE']
[9, [70, 2.41015625], 'ESCAPE']
[10, [80, 32.0], 'ESCAPE']
[10, [80, 16.0], 'ESCAPE']
[10, [80, 8.0], 'ESCAPE']
[10, [80, 4.0], 'ESCAPE']
[10, [80, 2.0], 'COLLIDE']
[10, [80, 3.0], 'ESCAPE']
[10, [80, 2.5], 'ESCAPE']
[10, [80, 2.25], 'COLLIDE']
[10, [80, 2.375], 'COLLIDE']
[10, [80, 2.4375], 'COLLIDE']
[10, [80, 2.46875], 'COLLIDE']
[10, [80, 2.484375], 'ESCAPE']
[10, [80, 2.4765625], 'COLLIDE']
[10, [80, 2.48046875], 'ESCAPE']
[11, [90, 32.0], 'ESCAPE']
[11, [90, 16.0], 'ESCAPE']
[11, [90, 8.0], 'ESCAPE']
[11, [90, 4.0], 'ESCAPE']
[11, [90, 2.0], 'COLLIDE']
[11, [90, 3.0], 'ESCAPE']
[11, [90, 2.5], 'COLLIDE']
[11, [90, 2.75], 'ESCAPE']
[11, [90, 2.625], 'ESCAPE']
[11, [90, 2.5625], 'ESCAPE']
[11, [90, 2.53125], 'ESCAPE']
[11, [90, 2.515625], 'ESCAPE']
[11, [90, 2.5078125], 'COLLIDE']
[11, [90, 2.51171875], 'ESCAPE']
[12, [100, 32.0], 'ESCAPE']
[12, [100, 16.0], 'ESCAPE']
[12, [100, 8.0], 'ESCAPE']
[12, [100, 4.0], 'ESCAPE']
[12, [100, 2.0], 'COLLIDE']
[12, [100, 3.0], 'ESCAPE']
[12, [100, 2.5], 'COLLIDE']
[12, [100, 2.75], 'ESCAPE']
[12, [100, 2.625], 'ESCAPE']
[12, [100, 2.5625], 'ESCAPE']
[12, [100, 2.53125], 'COLLIDE']
[12, [100, 2.546875], 'ESCAPE']
[12, [100, 2.5390625], 'COLLIDE']
[12, [100, 2.54296875], 'ESCAPE']
[13, [110, 32.0], 'ESCAPE']
[13, [110, 16.0], 'ESCAPE']
[13, [110, 8.0], 'ESCAPE']
[13, [110, 4.0], 'ESCAPE']
[13, [110, 2.0], 'COLLIDE']
[13, [110, 3.0], 'ESCAPE']
[13, [110, 2.5], 'COLLIDE']
[13, [110, 2.75], 'ESCAPE']
[13, [110, 2.625], 'ESCAPE']
[13, [110, 2.5625], 'COLLIDE']
[13, [110, 2.59375], 'COLLIDE']
[13, [110, 2.609375], 'ESCAPE']
[13, [110, 2.6015625], 'COLLIDE']
[13, [110, 2.60546875], 'ESCAPE']
[14, [120, 32.0], 'ESCAPE']
[14, [120, 16.0], 'ESCAPE']
[14, [120, 8.0], 'ESCAPE']
[14, [120, 4.0], 'ESCAPE']
[14, [120, 2.0], 'COLLIDE']
[14, [120, 3.0], 'ESCAPE']
[14, [120, 2.5], 'COLLIDE']
[14, [120, 2.75], 'ESCAPE']
[14, [120, 2.625], 'COLLIDE']
[14, [120, 2.6875], 'ESCAPE']
[14, [120, 2.65625], 'COLLIDE']
[14, [120, 2.671875], 'COLLIDE']
[14, [120, 2.6796875], 'COLLIDE']
[14, [120, 2.68359375], 'ESCAPE']
[15, [130, 32.0], 'ESCAPE']
[15, [130, 16.0], 'ESCAPE']
[15, [130, 8.0], 'ESCAPE']
[15, [130, 4.0], 'ESCAPE']
[15, [130, 2.0], 'COLLIDE']
[15, [130, 3.0], 'ESCAPE']
[15, [130, 2.5], 'COLLIDE']
[15, [130, 2.75], 'COLLIDE']
[15, [130, 2.875], 'ESCAPE']
[15, [130, 2.8125], 'ESCAPE']
[15, [130, 2.78125], 'ESCAPE']
[15, [130, 2.765625], 'COLLIDE']
[15, [130, 2.7734375], 'ESCAPE']
[15, [130, 2.76953125], 'COLLIDE']
[16, [135, 32.0], 'ESCAPE']
[16, [135, 16.0], 'ESCAPE']
[16, [135, 8.0], 'ESCAPE']
[16, [135, 4.0], 'ESCAPE']
[16, [135, 2.0], 'COLLIDE']
[16, [135, 3.0], 'ESCAPE']
[16, [135, 2.5], 'COLLIDE']
[16, [135, 2.75], 'COLLIDE']
[16, [135, 2.875], 'ESCAPE']
[16, [135, 2.8125], 'COLLIDE']
[16, [135, 2.84375], 'ESCAPE']
[16, [135, 2.828125], 'ESCAPE']
[16, [135, 2.8203125], 'ESCAPE']
[16, [135, 2.81640625], 'ESCAPE']
[17, [140, 32.0], 'ESCAPE']
[17, [140, 16.0], 'ESCAPE']
[17, [140, 8.0], 'ESCAPE']
[17, [140, 4.0], 'ESCAPE']
[17, [140, 2.0], 'COLLIDE']
[17, [140, 3.0], 'ESCAPE']
[17, [140, 2.5], 'COLLIDE']
[17, [140, 2.75], 'COLLIDE']
[17, [140, 2.875], 'ESCAPE']
[17, [140, 2.8125], 'COLLIDE']
[17, [140, 2.84375], 'COLLIDE']
[17, [140, 2.859375], 'COLLIDE']
[17, [140, 2.8671875], 'COLLIDE']
[17, [140, 2.87109375], 'ESCAPE']
[18, [150, 32.0], 'ESCAPE']
[18, [150, 16.0], 'ESCAPE']
[18, [150, 8.0], 'ESCAPE']
[18, [150, 4.0], 'ESCAPE']
[18, [150, 2.0], 'COLLIDE']
[18, [150, 3.0], 'COLLIDE']
[18, [150, 3.5], 'ESCAPE']
[18, [150, 3.25], 'ESCAPE']
[18, [150, 3.125], 'ESCAPE']
[18, [150, 3.0625], 'ESCAPE']
[18, [150, 3.03125], 'ESCAPE']
[18, [150, 3.015625], 'ESCAPE']
[18, [150, 3.0078125], 'ESCAPE']
[18, [150, 3.00390625], 'COLLIDE']
[19, [160, 32.0], 'ESCAPE']
[19, [160, 16.0], 'ESCAPE']
[19, [160, 8.0], 'ESCAPE']
[19, [160, 4.0], 'ESCAPE']
[19, [160, 2.0], 'COLLIDE']
[19, [160, 3.0], 'COLLIDE']
[19, [160, 3.5], 'ESCAPE']
[19, [160, 3.25], 'ESCAPE']
[19, [160, 3.125], 'COLLIDE']
[19, [160, 3.1875], 'ESCAPE']
[19, [160, 3.15625], 'COLLIDE']
[19, [160, 3.171875], 'COLLIDE']
[19, [160, 3.1796875], 'ESCAPE']
[19, [160, 3.17578125], 'COLLIDE']
[20, [170, 32.0], 'ESCAPE']
[20, [170, 16.0], 'ESCAPE']
[20, [170, 8.0], 'ESCAPE']
[20, [170, 4.0], 'ESCAPE']
[20, [170, 2.0], 'COLLIDE']
[20, [170, 3.0], 'COLLIDE']
[20, [170, 3.5], 'ESCAPE']
[20, [170, 3.25], 'COLLIDE']
[20, [170, 3.375], 'ESCAPE']
[20, [170, 3.3125], 'COLLIDE']
[20, [170, 3.34375], 'COLLIDE']
[20, [170, 3.359375], 'COLLIDE']
[20, [170, 3.3671875], 'ESCAPE']
[20, [170, 3.36328125], 'COLLIDE']
[21, [180, 32.0], 'ESCAPE']
[21, [180, 16.0], 'ESCAPE']
[21, [180, 8.0], 'ESCAPE']
[21, [180, 4.0], 'ESCAPE']
[21, [180, 2.0], 'COLLIDE']
[21, [180, 3.0], 'COLLIDE']
[21, [180, 3.5], 'COLLIDE']
[21, [180, 3.75], 'ESCAPE']
[21, [180, 3.625], 'ESCAPE']
[21, [180, 3.5625], 'COLLIDE']
[21, [180, 3.59375], 'COLLIDE']
[21, [180, 3.609375], 'ESCAPE']
[21, [180, 3.6015625], 'COLLIDE']
[21, [180, 3.60546875], 'ESCAPE']
[22, [180, 32.0], 'ESCAPE']
[22, [180, 16.0], 'ESCAPE']
[22, [180, 8.0], 'ESCAPE']
[22, [180, 4.0], 'ESCAPE']
[22, [180, 2.0], 'COLLIDE']
[22, [180, 3.0], 'COLLIDE']
[22, [180, 3.5], 'COLLIDE']
[22, [180, 3.75], 'ESCAPE']
[22, [180, 3.625], 'ESCAPE']
[22, [180, 3.5625], 'COLLIDE']
[22, [180, 3.59375], 'COLLIDE']
[22, [180, 3.609375], 'ESCAPE']
[22, [180, 3.6015625], 'COLLIDE']
[22, [180, 3.60546875], 'ESCAPE']
