0.000000 2.761719
10.000000 2.765625
20.000000 2.769531
30.000000 2.769531
40.000000 2.761719
45.000000 2.765625
50.000000 2.753906
60.000000 2.703125
70.000000 2.621094
80.000000 2.531250
90.000000 2.437500
100.000000 2.542969
110.000000 2.625000
120.000000 2.703125
130.000000 2.750000
135.000000 2.765625
140.000000 2.777344
150.000000 2.773438
160.000000 2.777344
170.000000 2.785156
180.000000 2.816406
