pygame 2.1.2 (SDL 2.0.20, Python 3.10.6)
Hello from the pygame community. https://www.pygame.org/contribute.html
[0, [0, 0.0], 'COLLIDE']
[0, [0, 32.0], 'ESCAPE']
[0, [0, 16.0], 'ESCAPE']
[0, [0, 8.0], 'ESCAPE']
[0, [0, 4.0], 'ESCAPE']
[0, [0, 2.0], 'ESCAPE']
[0, [0, 1.0], 'ESCAPE']
[0, [0, 0.5], 'COLLIDE']
[0, [0, 0.75], 'COLLIDE']
[0, [0, 0.875], 'COLLIDE']
[0, [0, 0.9375], 'ESCAPE']
[0, [0, 0.90625], 'COLLIDE']
[0, [0, 0.921875], 'ESCAPE']
[0, [0, 0.9140625], 'COLLIDE']
[0, [0, 0.91796875], 'ESCAPE']
[1, [0, 32.0], 'ESCAPE']
[1, [0, 16.0], 'ESCAPE']
[1, [0, 8.0], 'ESCAPE']
[1, [0, 4.0], 'ESCAPE']
[1, [0, 2.0], 'ESCAPE']
[1, [0, 1.0], 'ESCAPE']
[1, [0, 0.5], 'COLLIDE']
[1, [0, 0.75], 'COLLIDE']
[1, [0, 0.875], 'COLLIDE']
[1, [0, 0.9375], 'ESCAPE']
[1, [0, 0.90625], 'COLLIDE']
[1, [0, 0.921875], 'ESCAPE']
[1, [0, 0.9140625], 'COLLIDE']
[1, [0, 0.91796875], 'ESCAPE']
[2, [0.19634954084936207, 32.0], 'ESCAPE']
[2, [0.19634954084936207, 16.0], 'ESCAPE']
[2, [0.19634954084936207, 8.0], 'ESCAPE']
[2, [0.19634954084936207, 4.0], 'ESCAPE']
[2, [0.19634954084936207, 2.0], 'ESCAPE']
[2, [0.19634954084936207, 1.0], 'ESCAPE']
[2, [0.19634954084936207, 0.5], 'COLLIDE']
[2, [0.19634954084936207, 0.75], 'COLLIDE']
[2, [0.19634954084936207, 0.875], 'COLLIDE']
[2, [0.19634954084936207, 0.9375], 'ESCAPE']
[2, [0.19634954084936207, 0.90625], 'COLLIDE']
[2, [0.19634954084936207, 0.921875], 'COLLIDE']
[2, [0.19634954084936207, 0.9296875], 'ESCAPE']
[2, [0.19634954084936207, 0.92578125], 'ESCAPE']
[3, [0.39269908169872414, 32.0], 'ESCAPE']
[3, [0.39269908169872414, 16.0], 'ESCAPE']
[3, [0.39269908169872414, 8.0], 'ESCAPE']
[3, [0.39269908169872414, 4.0], 'ESCAPE']
[3, [0.39269908169872414, 2.0], 'ESCAPE']
[3, [0.39269908169872414, 1.0], 'ESCAPE']
[3, [0.39269908169872414, 0.5], 'COLLIDE']
[3, [0.39269908169872414, 0.75], 'COLLIDE']
[3, [0.39269908169872414, 0.875], 'COLLIDE']
[3, [0.39269908169872414, 0.9375], 'COLLIDE']
[3, [0.39269908169872414, 0.96875], 'ESCAPE']
[3, [0.39269908169872414, 0.953125], 'ESCAPE']
[3, [0.39269908169872414, 0.9453125], 'ESCAPE']
[3, [0.39269908169872414, 0.94140625], 'COLLIDE']
[4, [0.5890486225480862, 32.0], 'ESCAPE']
[4, [0.5890486225480862, 16.0], 'ESCAPE']
[4, [0.5890486225480862, 8.0], 'ESCAPE']
[4, [0.5890486225480862, 4.0], 'ESCAPE']
[4, [0.5890486225480862, 2.0], 'ESCAPE']
[4, [0.5890486225480862, 1.0], 'ESCAPE']
[4, [0.5890486225480862, 0.5], 'COLLIDE']
[4, [0.5890486225480862, 0.75], 'COLLIDE']
[4, [0.5890486225480862, 0.875], 'COLLIDE']
[4, [0.5890486225480862, 0.9375], 'COLLIDE']
[4, [0.5890486225480862, 0.96875], 'COLLIDE']
[4, [0.5890486225480862, 0.984375], 'ESCAPE']
[4, [0.5890486225480862, 0.9765625], 'ESCAPE']
[4, [0.5890486225480862, 0.97265625], 'COLLIDE']
[5, [0.8377580409572781, 32.0], 'ESCAPE']
[5, [0.8377580409572781, 16.0], 'ESCAPE']
[5, [0.8377580409572781, 8.0], 'ESCAPE']
[5, [0.8377580409572781, 4.0], 'ESCAPE']
[5, [0.8377580409572781, 2.0], 'ESCAPE']
[5, [0.8377580409572781, 1.0], 'COLLIDE']
[5, [0.8377580409572781, 1.5], 'ESCAPE']
[5, [0.8377580409572781, 1.25], 'ESCAPE']
[5, [0.8377580409572781, 1.125], 'ESCAPE']
[5, [0.8377580409572781, 1.0625], 'ESCAPE']
[5, [0.8377580409572781, 1.03125], 'COLLIDE']
[5, [0.8377580409572781, 1.046875], 'ESCAPE']
[5, [0.8377580409572781, 1.0390625], 'ESCAPE']
[5, [0.8377580409572781, 1.03515625], 'COLLIDE']
[6, [0.9817477042468103, 32.0], 'ESCAPE']
[6, [0.9817477042468103, 16.0], 'ESCAPE']
[6, [0.9817477042468103, 8.0], 'ESCAPE']
[6, [0.9817477042468103, 4.0], 'ESCAPE']
[6, [0.9817477042468103, 2.0], 'ESCAPE']
[6, [0.9817477042468103, 1.0], 'COLLIDE']
[6, [0.9817477042468103, 1.5], 'ESCAPE']
[6, [0.9817477042468103, 1.25], 'ESCAPE']
[6, [0.9817477042468103, 1.125], 'ESCAPE']
[6, [0.9817477042468103, 1.0625], 'COLLIDE']
[6, [0.9817477042468103, 1.09375], 'ESCAPE']
[6, [0.9817477042468103, 1.078125], 'COLLIDE']
[6, [0.9817477042468103, 1.0859375], 'COLLIDE']
[6, [0.9817477042468103, 1.08984375], 'ESCAPE']
[7, [1.1780972450961724, 32.0], 'ESCAPE']
[7, [1.1780972450961724, 16.0], 'ESCAPE']
[7, [1.1780972450961724, 8.0], 'ESCAPE']
[7, [1.1780972450961724, 4.0], 'ESCAPE']
[7, [1.1780972450961724, 2.0], 'ESCAPE']
[7, [1.1780972450961724, 1.0], 'COLLIDE']
[7, [1.1780972450961724, 1.5], 'ESCAPE']
[7, [1.1780972450961724, 1.25], 'ESCAPE']
[7, [1.1780972450961724, 1.125], 'COLLIDE']
[7, [1.1780972450961724, 1.1875], 'ESCAPE']
[7, [1.1780972450961724, 1.15625], 'COLLIDE']
[7, [1.1780972450961724, 1.171875], 'COLLIDE']
[7, [1.1780972450961724, 1.1796875], 'ESCAPE']
[7, [1.1780972450961724, 1.17578125], 'COLLIDE']
[8, [1.3744467859455345, 32.0], 'ESCAPE']
[8, [1.3744467859455345, 16.0], 'ESCAPE']
[8, [1.3744467859455345, 8.0], 'ESCAPE']
[8, [1.3744467859455345, 4.0], 'ESCAPE']
[8, [1.3744467859455345, 2.0], 'ESCAPE']
[8, [1.3744467859455345, 1.0], 'COLLIDE']
[8, [1.3744467859455345, 1.5], 'ESCAPE']
[8, [1.3744467859455345, 1.25], 'ESCAPE']
[8, [1.3744467859455345, 1.125], 'COLLIDE']
[8, [1.3744467859455345, 1.1875], 'COLLIDE']
[8, [1.3744467859455345, 1.21875], 'COLLIDE']
[8, [1.3744467859455345, 1.234375], 'COLLIDE']
[8, [1.3744467859455345, 1.2421875], 'COLLIDE']
[8, [1.3744467859455345, 1.24609375], 'ESCAPE']
[9, [1.5707963267948966, 32.0], 'ESCAPE']
[9, [1.5707963267948966, 16.0], 'ESCAPE']
[9, [1.5707963267948966, 8.0], 'ESCAPE']
[9, [1.5707963267948966, 4.0], 'ESCAPE']
[9, [1.5707963267948966, 2.0], 'ESCAPE']
[9, [1.5707963267948966, 1.0], 'COLLIDE']
[9, [1.5707963267948966, 1.5], 'ESCAPE']
[9, [1.5707963267948966, 1.25], 'COLLIDE']
[9, [1.5707963267948966, 1.375], 'ESCAPE']
[9, [1.5707963267948966, 1.3125], 'ESCAPE']
[9, [1.5707963267948966, 1.28125], 'ESCAPE']
[9, [1.5707963267948966, 1.265625], 'COLLIDE']
[9, [1.5707963267948966, 1.2734375], 'ESCAPE']
[9, [1.5707963267948966, 1.26953125], 'COLLIDE']
[10, [1.7671458676442586, 32.0], 'ESCAPE']
[10, [1.7671458676442586, 16.0], 'ESCAPE']
[10, [1.7671458676442586, 8.0], 'ESCAPE']
[10, [1.7671458676442586, 4.0], 'ESCAPE']
[10, [1.7671458676442586, 2.0], 'ESCAPE']
[10, [1.7671458676442586, 1.0], 'COLLIDE']
[10, [1.7671458676442586, 1.5], 'ESCAPE']
[10, [1.7671458676442586, 1.25], 'COLLIDE']
[10, [1.7671458676442586, 1.375], 'ESCAPE']
[10, [1.7671458676442586, 1.3125], 'ESCAPE']
[10, [1.7671458676442586, 1.28125], 'COLLIDE']
[10, [1.7671458676442586, 1.296875], 'COLLIDE']
[10, [1.7671458676442586, 1.3046875], 'COLLIDE']
[10, [1.7671458676442586, 1.30859375], 'ESCAPE']
[11, [1.9634954084936207, 32.0], 'ESCAPE']
[11, [1.9634954084936207, 16.0], 'ESCAPE']
[11, [1.9634954084936207, 8.0], 'ESCAPE']
[11, [1.9634954084936207, 4.0], 'ESCAPE']
[11, [1.9634954084936207, 2.0], 'ESCAPE']
[11, [1.9634954084936207, 1.0], 'COLLIDE']
[11, [1.9634954084936207, 1.5], 'ESCAPE']
[11, [1.9634954084936207, 1.25], 'COLLIDE']
[11, [1.9634954084936207, 1.375], 'COLLIDE']
[11, [1.9634954084936207, 1.4375], 'ESCAPE']
[11, [1.9634954084936207, 1.40625], 'ESCAPE']
[11, [1.9634954084936207, 1.390625], 'COLLIDE']
[11, [1.9634954084936207, 1.3984375], 'COLLIDE']
[11, [1.9634954084936207, 1.40234375], 'ESCAPE']
[12, [2.1598449493429825, 32.0], 'ESCAPE']
[12, [2.1598449493429825, 16.0], 'ESCAPE']
[12, [2.1598449493429825, 8.0], 'ESCAPE']
[12, [2.1598449493429825, 4.0], 'ESCAPE']
[12, [2.1598449493429825, 2.0], 'ESCAPE']
[12, [2.1598449493429825, 1.0], 'COLLIDE']
[12, [2.1598449493429825, 1.5], 'COLLIDE']
[12, [2.1598449493429825, 1.75], 'ESCAPE']
[12, [2.1598449493429825, 1.625], 'ESCAPE']
[12, [2.1598449493429825, 1.5625], 'ESCAPE']
[12, [2.1598449493429825, 1.53125], 'COLLIDE']
[12, [2.1598449493429825, 1.546875], 'COLLIDE']
[12, [2.1598449493429825, 1.5546875], 'COLLIDE']
[12, [2.1598449493429825, 1.55859375], 'ESCAPE']
[13, [2.356194490192345, 32.0], 'ESCAPE']
[13, [2.356194490192345, 16.0], 'ESCAPE']
[13, [2.356194490192345, 8.0], 'ESCAPE']
[13, [2.356194490192345, 4.0], 'ESCAPE']
[13, [2.356194490192345, 2.0], 'ESCAPE']
[13, [2.356194490192345, 1.0], 'COLLIDE']
[13, [2.356194490192345, 1.5], 'COLLIDE']
[13, [2.356194490192345, 1.75], 'COLLIDE']
[13, [2.356194490192345, 1.875], 'ESCAPE']
[13, [2.356194490192345, 1.8125], 'ESCAPE']
[13, [2.356194490192345, 1.78125], 'ESCAPE']
[13, [2.356194490192345, 1.765625], 'ESCAPE']
[13, [2.356194490192345, 1.7578125], 'COLLIDE']
[13, [2.356194490192345, 1.76171875], 'COLLIDE']
[14, [2.552544031041707, 32.0], 'ESCAPE']
[14, [2.552544031041707, 16.0], 'ESCAPE']
[14, [2.552544031041707, 8.0], 'ESCAPE']
[14, [2.552544031041707, 4.0], 'ESCAPE']
[14, [2.552544031041707, 2.0], 'COLLIDE']
[14, [2.552544031041707, 3.0], 'ESCAPE']
[14, [2.552544031041707, 2.5], 'ESCAPE']
[14, [2.552544031041707, 2.25], 'ESCAPE']
[14, [2.552544031041707, 2.125], 'ESCAPE']
[14, [2.552544031041707, 2.0625], 'ESCAPE']
[14, [2.552544031041707, 2.03125], 'ESCAPE']
[14, [2.552544031041707, 2.015625], 'COLLIDE']
[14, [2.552544031041707, 2.0234375], 'COLLIDE']
[14, [2.552544031041707, 2.02734375], 'ESCAPE']
[15, [2.748893571891069, 32.0], 'ESCAPE']
[15, [2.748893571891069, 16.0], 'ESCAPE']
[15, [2.748893571891069, 8.0], 'ESCAPE']
[15, [2.748893571891069, 4.0], 'ESCAPE']
[15, [2.748893571891069, 2.0], 'COLLIDE']
[15, [2.748893571891069, 3.0], 'ESCAPE']
[15, [2.748893571891069, 2.5], 'ESCAPE']
[15, [2.748893571891069, 2.25], 'COLLIDE']
[15, [2.748893571891069, 2.375], 'ESCAPE']
[15, [2.748893571891069, 2.3125], 'COLLIDE']
[15, [2.748893571891069, 2.34375], 'COLLIDE']
[15, [2.748893571891069, 2.359375], 'COLLIDE']
[15, [2.748893571891069, 2.3671875], 'ESCAPE']
[15, [2.748893571891069, 2.36328125], 'ESCAPE']
[16, [2.945243112740431, 32.0], 'ESCAPE']
[16, [2.945243112740431, 16.0], 'ESCAPE']
[16, [2.945243112740431, 8.0], 'ESCAPE']
[16, [2.945243112740431, 4.0], 'ESCAPE']
[16, [2.945243112740431, 2.0], 'COLLIDE']
[16, [2.945243112740431, 3.0], 'ESCAPE']
[16, [2.945243112740431, 2.5], 'COLLIDE']
[16, [2.945243112740431, 2.75], 'COLLIDE']
[16, [2.945243112740431, 2.875], 'ESCAPE']
[16, [2.945243112740431, 2.8125], 'ESCAPE']
[16, [2.945243112740431, 2.78125], 'ESCAPE']
[16, [2.945243112740431, 2.765625], 'COLLIDE']
[16, [2.945243112740431, 2.7734375], 'COLLIDE']
[16, [2.945243112740431, 2.77734375], 'COLLIDE']
[17, [3.141592653589793, 32.0], 'ESCAPE']
[17, [3.141592653589793, 16.0], 'ESCAPE']
[17, [3.141592653589793, 8.0], 'ESCAPE']
[17, [3.141592653589793, 4.0], 'ESCAPE']
[17, [3.141592653589793, 2.0], 'COLLIDE']
[17, [3.141592653589793, 3.0], 'COLLIDE']
[17, [3.141592653589793, 3.5], 'ESCAPE']
[17, [3.141592653589793, 3.25], 'COLLIDE']
[17, [3.141592653589793, 3.375], 'ESCAPE']
[17, [3.141592653589793, 3.3125], 'ESCAPE']
[17, [3.141592653589793, 3.28125], 'COLLIDE']
[17, [3.141592653589793, 3.296875], 'ESCAPE']
[17, [3.141592653589793, 3.2890625], 'COLLIDE']
[17, [3.141592653589793, 3.29296875], 'ESCAPE']
[18, [3.141592653589793, 32.0], 'ESCAPE']
[18, [3.141592653589793, 16.0], 'ESCAPE']
[18, [3.141592653589793, 8.0], 'ESCAPE']
[18, [3.141592653589793, 4.0], 'ESCAPE']
[18, [3.141592653589793, 2.0], 'COLLIDE']
[18, [3.141592653589793, 3.0], 'COLLIDE']
[18, [3.141592653589793, 3.5], 'ESCAPE']
[18, [3.141592653589793, 3.25], 'COLLIDE']
[18, [3.141592653589793, 3.375], 'ESCAPE']
[18, [3.141592653589793, 3.3125], 'ESCAPE']
[18, [3.141592653589793, 3.28125], 'COLLIDE']
[18, [3.141592653589793, 3.296875], 'ESCAPE']
[18, [3.141592653589793, 3.2890625], 'COLLIDE']
[18, [3.141592653589793, 3.29296875], 'ESCAPE']
