pygame 2.1.2 (SDL 2.0.20, Python 3.10.6)
Hello from the pygame community. https://www.pygame.org/contribute.html
[0, [0, 0.0], 'COLLIDE']
[0, [0, 64.0], 'ESCAPE']
[1, [0, 32.0], 'ESCAPE']
[1, [0, 16.0], 'ESCAPE']
[1, [0, 8.0], 'ESCAPE']
[1, [0, 4.0], 'ESCAPE']
[1, [0, 2.0], 'COLLIDE']
[1, [0, 3.0], 'ESCAPE']
[1, [0, 2.5], 'ESCAPE']
[1, [0, 2.25], 'COLLIDE']
[1, [0, 2.375], 'COLLIDE']
[1, [0, 2.4375], 'ESCAPE']
[1, [0, 2.40625], 'COLLIDE']
[1, [0, 2.421875], 'ESCAPE']
[1, [0, 2.4140625], 'ESCAPE']
[1, [0, 2.41015625], 'ESCAPE']
[2, [10.0, 32.0], 'ESCAPE']
[2, [10.0, 16.0], 'ESCAPE']
[2, [10.0, 8.0], 'ESCAPE']
[2, [10.0, 4.0], 'ESCAPE']
[2, [10.0, 2.0], 'COLLIDE']
[2, [10.0, 3.0], 'ESCAPE']
[2, [10.0, 2.5], 'ESCAPE']
[2, [10.0, 2.25], 'COLLIDE']
[2, [10.0, 2.375], 'COLLIDE']
[2, [10.0, 2.4375], 'ESCAPE']
[2, [10.0, 2.40625], 'COLLIDE']
[2, [10.0, 2.421875], 'ESCAPE']
[2, [10.0, 2.4140625], 'COLLIDE']
[2, [10.0, 2.41796875], 'ESCAPE']
[3, [20.0, 32.0], 'ESCAPE']
[3, [20.0, 16.0], 'ESCAPE']
[3, [20.0, 8.0], 'ESCAPE']
[3, [20.0, 4.0], 'ESCAPE']
[3, [20.0, 2.0], 'COLLIDE']
[3, [20.0, 3.0], 'ESCAPE']
[3, [20.0, 2.5], 'ESCAPE']
[3, [20.0, 2.25], 'COLLIDE']
[3, [20.0, 2.375], 'COLLIDE']
[3, [20.0, 2.4375], 'ESCAPE']
[3, [20.0, 2.40625], 'COLLIDE']
[3, [20.0, 2.421875], 'COLLIDE']
[3, [20.0, 2.4296875], 'COLLIDE']
[3, [20.0, 2.43359375], 'ESCAPE']
[4, [30.0, 32.0], 'ESCAPE']
[4, [30.0, 16.0], 'ESCAPE']
[4, [30.0, 8.0], 'ESCAPE']
[4, [30.0, 4.0], 'ESCAPE']
[4, [30.0, 2.0], 'COLLIDE']
[4, [30.0, 3.0], 'ESCAPE']
[4, [30.0, 2.5], 'ESCAPE']
[4, [30.0, 2.25], 'COLLIDE']
[4, [30.0, 2.375], 'COLLIDE']
[4, [30.0, 2.4375], 'COLLIDE']
[4, [30.0, 2.46875], 'COLLIDE']
[4, [30.0, 2.484375], 'ESCAPE']
[4, [30.0, 2.4765625], 'ESCAPE']
[4, [30.0, 2.47265625], 'ESCAPE']
[5, [40, 32.0], 'ESCAPE']
[5, [40, 16.0], 'ESCAPE']
[5, [40, 8.0], 'ESCAPE']
[5, [40, 4.0], 'ESCAPE']
[5, [40, 2.0], 'COLLIDE']
[5, [40, 3.0], 'ESCAPE']
[5, [40, 2.5], 'COLLIDE']
[5, [40, 2.75], 'ESCAPE']
[5, [40, 2.625], 'ESCAPE']
[5, [40, 2.5625], 'ESCAPE']
[5, [40, 2.53125], 'ESCAPE']
[5, [40, 2.515625], 'ESCAPE']
[5, [40, 2.5078125], 'ESCAPE']
[5, [40, 2.50390625], 'COLLIDE']
[6, [45, 32.0], 'ESCAPE']
[6, [45, 16.0], 'ESCAPE']
[6, [45, 8.0], 'ESCAPE']
[6, [45, 4.0], 'ESCAPE']
[6, [45, 2.0], 'COLLIDE']
[6, [45, 3.0], 'ESCAPE']
[6, [45, 2.5], 'COLLIDE']
[6, [45, 2.75], 'ESCAPE']
[6, [45, 2.625], 'ESCAPE']
[6, [45, 2.5625], 'ESCAPE']
[6, [45, 2.53125], 'ESCAPE']
[6, [45, 2.515625], 'COLLIDE']
[6, [45, 2.5234375], 'COLLIDE']
[6, [45, 2.52734375], 'ESCAPE']
[7, [50, 32.0], 'ESCAPE']
[7, [50, 16.0], 'ESCAPE']
[7, [50, 8.0], 'ESCAPE']
[7, [50, 4.0], 'ESCAPE']
[7, [50, 2.0], 'COLLIDE']
[7, [50, 3.0], 'ESCAPE']
[7, [50, 2.5], 'COLLIDE']
[7, [50, 2.75], 'ESCAPE']
[7, [50, 2.625], 'ESCAPE']
[7, [50, 2.5625], 'ESCAPE']
[7, [50, 2.53125], 'COLLIDE']
[7, [50, 2.546875], 'COLLIDE']
[7, [50, 2.5546875], 'COLLIDE']
[7, [50, 2.55859375], 'COLLIDE']
[8, [60, 32.0], 'ESCAPE']
[8, [60, 16.0], 'ESCAPE']
[8, [60, 8.0], 'ESCAPE']
[8, [60, 4.0], 'ESCAPE']
[8, [60, 2.0], 'COLLIDE']
[8, [60, 3.0], 'ESCAPE']
[8, [60, 2.5], 'COLLIDE']
[8, [60, 2.75], 'ESCAPE']
[8, [60, 2.625], 'ESCAPE']
[8, [60, 2.5625], 'COLLIDE']
[8, [60, 2.59375], 'COLLIDE']
[8, [60, 2.609375], 'COLLIDE']
[8, [60, 2.6171875], 'ESCAPE']
[8, [60, 2.61328125], 'ESCAPE']
[9, [70, 32.0], 'ESCAPE']
[9, [70, 16.0], 'ESCAPE']
[9, [70, 8.0], 'ESCAPE']
[9, [70, 4.0], 'ESCAPE']
[9, [70, 2.0], 'COLLIDE']
[9, [70, 3.0], 'ESCAPE']
[9, [70, 2.5], 'COLLIDE']
[9, [70, 2.75], 'ESCAPE']
[9, [70, 2.625], 'COLLIDE']
[9, [70, 2.6875], 'ESCAPE']
[9, [70, 2.65625], 'COLLIDE']
[9, [70, 2.671875], 'COLLIDE']
[9, [70, 2.6796875], 'COLLIDE']
[9, [70, 2.68359375], 'COLLIDE']
[10, [80, 32.0], 'ESCAPE']
[10, [80, 16.0], 'ESCAPE']
[10, [80, 8.0], 'ESCAPE']
[10, [80, 4.0], 'ESCAPE']
[10, [80, 2.0], 'COLLIDE']
[10, [80, 3.0], 'ESCAPE']
[10, [80, 2.5], 'COLLIDE']
[10, [80, 2.75], 'ESCAPE']
[10, [80, 2.625], 'COLLIDE']
[10, [80, 2.6875], 'COLLIDE']
[10, [80, 2.71875], 'COLLIDE']
[10, [80, 2.734375], 'COLLIDE']
[10, [80, 2.7421875], 'COLLIDE']
[10, [80, 2.74609375], 'ESCAPE']
[11, [90, 32.0], 'ESCAPE']
[11, [90, 16.0], 'ESCAPE']
[11, [90, 8.0], 'ESCAPE']
[11, [90, 4.0], 'ESCAPE']
[11, [90, 2.0], 'COLLIDE']
[11, [90, 3.0], 'ESCAPE']
[11, [90, 2.5], 'COLLIDE']
[11, [90, 2.75], 'COLLIDE']
[11, [90, 2.875], 'ESCAPE']
[11, [90, 2.8125], 'ESCAPE']
[11, [90, 2.78125], 'ESCAPE']
[11, [90, 2.765625], 'COLLIDE']
[11, [90, 2.7734375], 'ESCAPE']
[11, [90, 2.76953125], 'COLLIDE']
[12, [100, 32.0], 'ESCAPE']
[12, [100, 16.0], 'ESCAPE']
[12, [100, 8.0], 'ESCAPE']
[12, [100, 4.0], 'ESCAPE']
[12, [100, 2.0], 'COLLIDE']
[12, [100, 3.0], 'ESCAPE']
[12, [100, 2.5], 'COLLIDE']
[12, [100, 2.75], 'COLLIDE']
[12, [100, 2.875], 'ESCAPE']
[12, [100, 2.8125], 'ESCAPE']
[12, [100, 2.78125], 'COLLIDE']
[12, [100, 2.796875], 'ESCAPE']
[12, [100, 2.7890625], 'ESCAPE']
[12, [100, 2.78515625], 'COLLIDE']
[13, [110, 32.0], 'ESCAPE']
[13, [110, 16.0], 'ESCAPE']
[13, [110, 8.0], 'ESCAPE']
[13, [110, 4.0], 'ESCAPE']
[13, [110, 2.0], 'COLLIDE']
[13, [110, 3.0], 'ESCAPE']
[13, [110, 2.5], 'COLLIDE']
[13, [110, 2.75], 'COLLIDE']
[13, [110, 2.875], 'ESCAPE']
[13, [110, 2.8125], 'COLLIDE']
[13, [110, 2.84375], 'COLLIDE']
[13, [110, 2.859375], 'COLLIDE']
[13, [110, 2.8671875], 'COLLIDE']
[13, [110, 2.87109375], 'COLLIDE']
[14, [120, 32.0], 'ESCAPE']
[14, [120, 16.0], 'ESCAPE']
[14, [120, 8.0], 'ESCAPE']
[14, [120, 4.0], 'ESCAPE']
[14, [120, 2.0], 'COLLIDE']
[14, [120, 3.0], 'ESCAPE']
[14, [120, 2.5], 'COLLIDE']
[14, [120, 2.75], 'COLLIDE']
[14, [120, 2.875], 'COLLIDE']
[14, [120, 2.9375], 'COLLIDE']
[14, [120, 2.96875], 'COLLIDE']
[14, [120, 2.984375], 'COLLIDE']
[14, [120, 2.9921875], 'COLLIDE']
[14, [120, 2.99609375], 'ESCAPE']
[15, [130, 32.0], 'ESCAPE']
[15, [130, 16.0], 'ESCAPE']
[15, [130, 8.0], 'ESCAPE']
[15, [130, 4.0], 'ESCAPE']
[15, [130, 2.0], 'COLLIDE']
[15, [130, 3.0], 'COLLIDE']
[15, [130, 3.5], 'ESCAPE']
[15, [130, 3.25], 'ESCAPE']
[15, [130, 3.125], 'COLLIDE']
[15, [130, 3.1875], 'ESCAPE']
[15, [130, 3.15625], 'ESCAPE']
[15, [130, 3.140625], 'COLLIDE']
[15, [130, 3.1484375], 'ESCAPE']
[15, [130, 3.14453125], 'COLLIDE']
[16, [135, 32.0], 'ESCAPE']
[16, [135, 16.0], 'ESCAPE']
[16, [135, 8.0], 'ESCAPE']
[16, [135, 4.0], 'ESCAPE']
[16, [135, 2.0], 'COLLIDE']
[16, [135, 3.0], 'COLLIDE']
[16, [135, 3.5], 'ESCAPE']
[16, [135, 3.25], 'ESCAPE']
[16, [135, 3.125], 'COLLIDE']
[16, [135, 3.1875], 'COLLIDE']
[16, [135, 3.21875], 'COLLIDE']
[16, [135, 3.234375], 'COLLIDE']
[16, [135, 3.2421875], 'COLLIDE']
[16, [135, 3.24609375], 'ESCAPE']
[17, [140, 32.0], 'ESCAPE']
[17, [140, 16.0], 'ESCAPE']
[17, [140, 8.0], 'ESCAPE']
[17, [140, 4.0], 'ESCAPE']
[17, [140, 2.0], 'COLLIDE']
[17, [140, 3.0], 'COLLIDE']
[17, [140, 3.5], 'ESCAPE']
[17, [140, 3.25], 'COLLIDE']
[17, [140, 3.375], 'ESCAPE']
[17, [140, 3.3125], 'COLLIDE']
[17, [140, 3.34375], 'COLLIDE']
[17, [140, 3.359375], 'ESCAPE']
[17, [140, 3.3515625], 'ESCAPE']
[17, [140, 3.34765625], 'ESCAPE']
[18, [150, 32.0], 'ESCAPE']
[18, [150, 16.0], 'ESCAPE']
[18, [150, 8.0], 'ESCAPE']
[18, [150, 4.0], 'ESCAPE']
[18, [150, 2.0], 'COLLIDE']
[18, [150, 3.0], 'COLLIDE']
[18, [150, 3.5], 'COLLIDE']
[18, [150, 3.75], 'ESCAPE']
[18, [150, 3.625], 'ESCAPE']
[18, [150, 3.5625], 'COLLIDE']
[18, [150, 3.59375], 'ESCAPE']
[18, [150, 3.578125], 'COLLIDE']
[18, [150, 3.5859375], 'COLLIDE']
[18, [150, 3.58984375], 'COLLIDE']
[19, [160, 32.0], 'ESCAPE']
[19, [160, 16.0], 'ESCAPE']
[19, [160, 8.0], 'ESCAPE']
[19, [160, 4.0], 'ESCAPE']
[19, [160, 2.0], 'COLLIDE']
[19, [160, 3.0], 'COLLIDE']
[19, [160, 3.5], 'COLLIDE']
[19, [160, 3.75], 'COLLIDE']
[19, [160, 3.875], 'COLLIDE']
[19, [160, 3.9375], 'ESCAPE']
[19, [160, 3.90625], 'COLLIDE']
[19, [160, 3.921875], 'ESCAPE']
[19, [160, 3.9140625], 'ESCAPE']
[19, [160, 3.91015625], 'ESCAPE']
[20, [170, 32.0], 'ESCAPE']
[20, [170, 16.0], 'ESCAPE']
[20, [170, 8.0], 'ESCAPE']
[20, [170, 4.0], 'COLLIDE']
[20, [170, 6.0], 'ESCAPE']
[20, [170, 5.0], 'ESCAPE']
[20, [170, 4.5], 'ESCAPE']
[20, [170, 4.25], 'COLLIDE']
[20, [170, 4.375], 'ESCAPE']
[20, [170, 4.3125], 'ESCAPE']
[20, [170, 4.28125], 'COLLIDE']
[20, [170, 4.296875], 'ESCAPE']
[20, [170, 4.2890625], 'ESCAPE']
[20, [170, 4.28515625], 'COLLIDE']
[21, [180, 32.0], 'ESCAPE']
[21, [180, 16.0], 'ESCAPE']
[21, [180, 8.0], 'ESCAPE']
[21, [180, 4.0], 'COLLIDE']
[21, [180, 6.0], 'ESCAPE']
[21, [180, 5.0], 'ESCAPE']
[21, [180, 4.5], 'COLLIDE']
[21, [180, 4.75], 'ESCAPE']
[21, [180, 4.625], 'COLLIDE']
[21, [180, 4.6875], 'COLLIDE']
[21, [180, 4.71875], 'COLLIDE']
[21, [180, 4.734375], 'COLLIDE']
[21, [180, 4.7421875], 'COLLIDE']
[21, [180, 4.74609375], 'COLLIDE']
[22, [180, 32.0], 'ESCAPE']
[22, [180, 16.0], 'ESCAPE']
[22, [180, 8.0], 'ESCAPE']
[22, [180, 4.0], 'COLLIDE']
[22, [180, 6.0], 'ESCAPE']
[22, [180, 5.0], 'ESCAPE']
[22, [180, 4.5], 'COLLIDE']
[22, [180, 4.75], 'ESCAPE']
[22, [180, 4.625], 'COLLIDE']
[22, [180, 4.6875], 'COLLIDE']
[22, [180, 4.71875], 'COLLIDE']
[22, [180, 4.734375], 'COLLIDE']
[22, [180, 4.7421875], 'COLLIDE']
[22, [180, 4.74609375], 'COLLIDE']
