pygame 2.1.2 (SDL 2.0.20, Python 3.10.6)
Hello from the pygame community. https://www.pygame.org/contribute.html
[0, [0, 0.0], 'COLLIDE']
[0, [0, 32.0], 'ESCAPE']
[0, [0, 16.0], 'ESCAPE']
[0, [0, 8.0], 'ESCAPE']
[0, [0, 4.0], 'ESCAPE']
[0, [0, 2.0], 'ESCAPE']
[0, [0, 1.0], 'COLLIDE']
[0, [0, 1.5], 'COLLIDE']
[0, [0, 1.75], 'ESCAPE']
[0, [0, 1.625], 'ESCAPE']
[0, [0, 1.5625], 'COLLIDE']
[0, [0, 1.59375], 'ESCAPE']
[0, [0, 1.578125], 'COLLIDE']
[0, [0, 1.5859375], 'COLLIDE']
[0, [0, 1.58984375], 'ESCAPE']
[1, [0, 32.0], 'ESCAPE']
[1, [0, 16.0], 'ESCAPE']
[1, [0, 8.0], 'ESCAPE']
[1, [0, 4.0], 'ESCAPE']
[1, [0, 2.0], 'ESCAPE']
[1, [0, 1.0], 'COLLIDE']
[1, [0, 1.5], 'COLLIDE']
[1, [0, 1.75], 'ESCAPE']
[1, [0, 1.625], 'ESCAPE']
[1, [0, 1.5625], 'COLLIDE']
[1, [0, 1.59375], 'ESCAPE']
[1, [0, 1.578125], 'COLLIDE']
[1, [0, 1.5859375], 'COLLIDE']
[1, [0, 1.58984375], 'ESCAPE']
[2, [0.19634954084936207, 32.0], 'ESCAPE']
[2, [0.19634954084936207, 16.0], 'ESCAPE']
[2, [0.19634954084936207, 8.0], 'ESCAPE']
[2, [0.19634954084936207, 4.0], 'ESCAPE']
[2, [0.19634954084936207, 2.0], 'ESCAPE']
[2, [0.19634954084936207, 1.0], 'COLLIDE']
[2, [0.19634954084936207, 1.5], 'COLLIDE']
[2, [0.19634954084936207, 1.75], 'ESCAPE']
[2, [0.19634954084936207, 1.625], 'ESCAPE']
[2, [0.19634954084936207, 1.5625], 'COLLIDE']
[2, [0.19634954084936207, 1.59375], 'COLLIDE']
[2, [0.19634954084936207, 1.609375], 'ESCAPE']
[2, [0.19634954084936207, 1.6015625], 'ESCAPE']
[2, [0.19634954084936207, 1.59765625], 'ESCAPE']
[3, [0.39269908169872414, 32.0], 'ESCAPE']
[3, [0.39269908169872414, 16.0], 'ESCAPE']
[3, [0.39269908169872414, 8.0], 'ESCAPE']
[3, [0.39269908169872414, 4.0], 'ESCAPE']
[3, [0.39269908169872414, 2.0], 'ESCAPE']
[3, [0.39269908169872414, 1.0], 'COLLIDE']
[3, [0.39269908169872414, 1.5], 'COLLIDE']
[3, [0.39269908169872414, 1.75], 'ESCAPE']
[3, [0.39269908169872414, 1.625], 'ESCAPE']
[3, [0.39269908169872414, 1.5625], 'COLLIDE']
[3, [0.39269908169872414, 1.59375], 'COLLIDE']
[3, [0.39269908169872414, 1.609375], 'COLLIDE']
[3, [0.39269908169872414, 1.6171875], 'ESCAPE']
[3, [0.39269908169872414, 1.61328125], 'COLLIDE']
[4, [0.5890486225480862, 32.0], 'ESCAPE']
[4, [0.5890486225480862, 16.0], 'ESCAPE']
[4, [0.5890486225480862, 8.0], 'ESCAPE']
[4, [0.5890486225480862, 4.0], 'ESCAPE']
[4, [0.5890486225480862, 2.0], 'ESCAPE']
[4, [0.5890486225480862, 1.0], 'COLLIDE']
[4, [0.5890486225480862, 1.5], 'COLLIDE']
[4, [0.5890486225480862, 1.75], 'ESCAPE']
[4, [0.5890486225480862, 1.625], 'COLLIDE']
[4, [0.5890486225480862, 1.6875], 'ESCAPE']
[4, [0.5890486225480862, 1.65625], 'ESCAPE']
[4, [0.5890486225480862, 1.640625], 'COLLIDE']
[4, [0.5890486225480862, 1.6484375], 'ESCAPE']
[4, [0.5890486225480862, 1.64453125], 'COLLIDE']
[5, [0.8377580409572781, 32.0], 'ESCAPE']
[5, [0.8377580409572781, 16.0], 'ESCAPE']
[5, [0.8377580409572781, 8.0], 'ESCAPE']
[5, [0.8377580409572781, 4.0], 'ESCAPE']
[5, [0.8377580409572781, 2.0], 'ESCAPE']
[5, [0.8377580409572781, 1.0], 'COLLIDE']
[5, [0.8377580409572781, 1.5], 'COLLIDE']
[5, [0.8377580409572781, 1.75], 'ESCAPE']
[5, [0.8377580409572781, 1.625], 'COLLIDE']
[5, [0.8377580409572781, 1.6875], 'COLLIDE']
[5, [0.8377580409572781, 1.71875], 'ESCAPE']
[5, [0.8377580409572781, 1.703125], 'COLLIDE']
[5, [0.8377580409572781, 1.7109375], 'ESCAPE']
[5, [0.8377580409572781, 1.70703125], 'COLLIDE']
[6, [0.9817477042468103, 32.0], 'ESCAPE']
[6, [0.9817477042468103, 16.0], 'ESCAPE']
[6, [0.9817477042468103, 8.0], 'ESCAPE']
[6, [0.9817477042468103, 4.0], 'ESCAPE']
[6, [0.9817477042468103, 2.0], 'ESCAPE']
[6, [0.9817477042468103, 1.0], 'COLLIDE']
[6, [0.9817477042468103, 1.5], 'COLLIDE']
[6, [0.9817477042468103, 1.75], 'COLLIDE']
[6, [0.9817477042468103, 1.875], 'ESCAPE']
[6, [0.9817477042468103, 1.8125], 'ESCAPE']
[6, [0.9817477042468103, 1.78125], 'ESCAPE']
[6, [0.9817477042468103, 1.765625], 'ESCAPE']
[6, [0.9817477042468103, 1.7578125], 'COLLIDE']
[6, [0.9817477042468103, 1.76171875], 'ESCAPE']
[7, [1.1780972450961724, 32.0], 'ESCAPE']
[7, [1.1780972450961724, 16.0], 'ESCAPE']
[7, [1.1780972450961724, 8.0], 'ESCAPE']
[7, [1.1780972450961724, 4.0], 'ESCAPE']
[7, [1.1780972450961724, 2.0], 'ESCAPE']
[7, [1.1780972450961724, 1.0], 'COLLIDE']
[7, [1.1780972450961724, 1.5], 'COLLIDE']
[7, [1.1780972450961724, 1.75], 'COLLIDE']
[7, [1.1780972450961724, 1.875], 'ESCAPE']
[7, [1.1780972450961724, 1.8125], 'COLLIDE']
[7, [1.1780972450961724, 1.84375], 'COLLIDE']
[7, [1.1780972450961724, 1.859375], 'ESCAPE']
[7, [1.1780972450961724, 1.8515625], 'ESCAPE']
[7, [1.1780972450961724, 1.84765625], 'COLLIDE']
[8, [1.3744467859455345, 32.0], 'ESCAPE']
[8, [1.3744467859455345, 16.0], 'ESCAPE']
[8, [1.3744467859455345, 8.0], 'ESCAPE']
[8, [1.3744467859455345, 4.0], 'ESCAPE']
[8, [1.3744467859455345, 2.0], 'ESCAPE']
[8, [1.3744467859455345, 1.0], 'COLLIDE']
[8, [1.3744467859455345, 1.5], 'COLLIDE']
[8, [1.3744467859455345, 1.75], 'COLLIDE']
[8, [1.3744467859455345, 1.875], 'COLLIDE']
[8, [1.3744467859455345, 1.9375], 'ESCAPE']
[8, [1.3744467859455345, 1.90625], 'COLLIDE']
[8, [1.3744467859455345, 1.921875], 'ESCAPE']
[8, [1.3744467859455345, 1.9140625], 'COLLIDE']
[8, [1.3744467859455345, 1.91796875], 'ESCAPE']
[9, [1.5707963267948966, 32.0], 'ESCAPE']
[9, [1.5707963267948966, 16.0], 'ESCAPE']
[9, [1.5707963267948966, 8.0], 'ESCAPE']
[9, [1.5707963267948966, 4.0], 'ESCAPE']
[9, [1.5707963267948966, 2.0], 'ESCAPE']
[9, [1.5707963267948966, 1.0], 'COLLIDE']
[9, [1.5707963267948966, 1.5], 'COLLIDE']
[9, [1.5707963267948966, 1.75], 'COLLIDE']
[9, [1.5707963267948966, 1.875], 'COLLIDE']
[9, [1.5707963267948966, 1.9375], 'COLLIDE']
[9, [1.5707963267948966, 1.96875], 'ESCAPE']
[9, [1.5707963267948966, 1.953125], 'ESCAPE']
[9, [1.5707963267948966, 1.9453125], 'ESCAPE']
[9, [1.5707963267948966, 1.94140625], 'COLLIDE']
[10, [1.7671458676442586, 32.0], 'ESCAPE']
[10, [1.7671458676442586, 16.0], 'ESCAPE']
[10, [1.7671458676442586, 8.0], 'ESCAPE']
[10, [1.7671458676442586, 4.0], 'ESCAPE']
[10, [1.7671458676442586, 2.0], 'ESCAPE']
[10, [1.7671458676442586, 1.0], 'COLLIDE']
[10, [1.7671458676442586, 1.5], 'COLLIDE']
[10, [1.7671458676442586, 1.75], 'COLLIDE']
[10, [1.7671458676442586, 1.875], 'COLLIDE']
[10, [1.7671458676442586, 1.9375], 'COLLIDE']
[10, [1.7671458676442586, 1.96875], 'COLLIDE']
[10, [1.7671458676442586, 1.984375], 'ESCAPE']
[10, [1.7671458676442586, 1.9765625], 'COLLIDE']
[10, [1.7671458676442586, 1.98046875], 'ESCAPE']
[11, [1.9634954084936207, 32.0], 'ESCAPE']
[11, [1.9634954084936207, 16.0], 'ESCAPE']
[11, [1.9634954084936207, 8.0], 'ESCAPE']
[11, [1.9634954084936207, 4.0], 'ESCAPE']
[11, [1.9634954084936207, 2.0], 'COLLIDE']
[11, [1.9634954084936207, 3.0], 'ESCAPE']
[11, [1.9634954084936207, 2.5], 'ESCAPE']
[11, [1.9634954084936207, 2.25], 'ESCAPE']
[11, [1.9634954084936207, 2.125], 'ESCAPE']
[11, [1.9634954084936207, 2.0625], 'COLLIDE']
[11, [1.9634954084936207, 2.09375], 'ESCAPE']
[11, [1.9634954084936207, 2.078125], 'ESCAPE']
[11, [1.9634954084936207, 2.0703125], 'COLLIDE']
[11, [1.9634954084936207, 2.07421875], 'ESCAPE']
[12, [2.1598449493429825, 32.0], 'ESCAPE']
[12, [2.1598449493429825, 16.0], 'ESCAPE']
[12, [2.1598449493429825, 8.0], 'ESCAPE']
[12, [2.1598449493429825, 4.0], 'ESCAPE']
[12, [2.1598449493429825, 2.0], 'COLLIDE']
[12, [2.1598449493429825, 3.0], 'ESCAPE']
[12, [2.1598449493429825, 2.5], 'ESCAPE']
[12, [2.1598449493429825, 2.25], 'ESCAPE']
[12, [2.1598449493429825, 2.125], 'COLLIDE']
[12, [2.1598449493429825, 2.1875], 'COLLIDE']
[12, [2.1598449493429825, 2.21875], 'COLLIDE']
[12, [2.1598449493429825, 2.234375], 'ESCAPE']
[12, [2.1598449493429825, 2.2265625], 'COLLIDE']
[12, [2.1598449493429825, 2.23046875], 'ESCAPE']
[13, [2.356194490192345, 32.0], 'ESCAPE']
[13, [2.356194490192345, 16.0], 'ESCAPE']
[13, [2.356194490192345, 8.0], 'ESCAPE']
[13, [2.356194490192345, 4.0], 'ESCAPE']
[13, [2.356194490192345, 2.0], 'COLLIDE']
[13, [2.356194490192345, 3.0], 'ESCAPE']
[13, [2.356194490192345, 2.5], 'ESCAPE']
[13, [2.356194490192345, 2.25], 'COLLIDE']
[13, [2.356194490192345, 2.375], 'COLLIDE']
[13, [2.356194490192345, 2.4375], 'ESCAPE']
[13, [2.356194490192345, 2.40625], 'COLLIDE']
[13, [2.356194490192345, 2.421875], 'COLLIDE']
[13, [2.356194490192345, 2.4296875], 'COLLIDE']
[13, [2.356194490192345, 2.43359375], 'COLLIDE']
[14, [2.552544031041707, 32.0], 'ESCAPE']
[14, [2.552544031041707, 16.0], 'ESCAPE']
[14, [2.552544031041707, 8.0], 'ESCAPE']
[14, [2.552544031041707, 4.0], 'ESCAPE']
[14, [2.552544031041707, 2.0], 'COLLIDE']
[14, [2.552544031041707, 3.0], 'ESCAPE']
[14, [2.552544031041707, 2.5], 'COLLIDE']
[14, [2.552544031041707, 2.75], 'ESCAPE']
[14, [2.552544031041707, 2.625], 'COLLIDE']
[14, [2.552544031041707, 2.6875], 'COLLIDE']
[14, [2.552544031041707, 2.71875], 'ESCAPE']
[14, [2.552544031041707, 2.703125], 'ESCAPE']
[14, [2.552544031041707, 2.6953125], 'COLLIDE']
[14, [2.552544031041707, 2.69921875], 'ESCAPE']
[15, [2.748893571891069, 32.0], 'ESCAPE']
[15, [2.748893571891069, 16.0], 'ESCAPE']
[15, [2.748893571891069, 8.0], 'ESCAPE']
[15, [2.748893571891069, 4.0], 'ESCAPE']
[15, [2.748893571891069, 2.0], 'COLLIDE']
[15, [2.748893571891069, 3.0], 'COLLIDE']
[15, [2.748893571891069, 3.5], 'ESCAPE']
[15, [2.748893571891069, 3.25], 'ESCAPE']
[15, [2.748893571891069, 3.125], 'ESCAPE']
[15, [2.748893571891069, 3.0625], 'ESCAPE']
[15, [2.748893571891069, 3.03125], 'COLLIDE']
[15, [2.748893571891069, 3.046875], 'ESCAPE']
[15, [2.748893571891069, 3.0390625], 'ESCAPE']
[15, [2.748893571891069, 3.03515625], 'ESCAPE']
[16, [2.945243112740431, 32.0], 'ESCAPE']
[16, [2.945243112740431, 16.0], 'ESCAPE']
[16, [2.945243112740431, 8.0], 'ESCAPE']
[16, [2.945243112740431, 4.0], 'ESCAPE']
[16, [2.945243112740431, 2.0], 'COLLIDE']
[16, [2.945243112740431, 3.0], 'COLLIDE']
[16, [2.945243112740431, 3.5], 'ESCAPE']
[16, [2.945243112740431, 3.25], 'COLLIDE']
[16, [2.945243112740431, 3.375], 'COLLIDE']
[16, [2.945243112740431, 3.4375], 'COLLIDE']
[16, [2.945243112740431, 3.46875], 'ESCAPE']
[16, [2.945243112740431, 3.453125], 'ESCAPE']
[16, [2.945243112740431, 3.4453125], 'COLLIDE']
[16, [2.945243112740431, 3.44921875], 'COLLIDE']
[17, [3.141592653589793, 32.0], 'ESCAPE']
[17, [3.141592653589793, 16.0], 'ESCAPE']
[17, [3.141592653589793, 8.0], 'ESCAPE']
[17, [3.141592653589793, 4.0], 'ESCAPE']
[17, [3.141592653589793, 2.0], 'COLLIDE']
[17, [3.141592653589793, 3.0], 'COLLIDE']
[17, [3.141592653589793, 3.5], 'COLLIDE']
[17, [3.141592653589793, 3.75], 'COLLIDE']
[17, [3.141592653589793, 3.875], 'COLLIDE']
[17, [3.141592653589793, 3.9375], 'COLLIDE']
[17, [3.141592653589793, 3.96875], 'ESCAPE']
[17, [3.141592653589793, 3.953125], 'COLLIDE']
[17, [3.141592653589793, 3.9609375], 'COLLIDE']
[17, [3.141592653589793, 3.96484375], 'ESCAPE']
[18, [3.141592653589793, 32.0], 'ESCAPE']
[18, [3.141592653589793, 16.0], 'ESCAPE']
[18, [3.141592653589793, 8.0], 'ESCAPE']
[18, [3.141592653589793, 4.0], 'ESCAPE']
[18, [3.141592653589793, 2.0], 'COLLIDE']
[18, [3.141592653589793, 3.0], 'COLLIDE']
[18, [3.141592653589793, 3.5], 'COLLIDE']
[18, [3.141592653589793, 3.75], 'COLLIDE']
[18, [3.141592653589793, 3.875], 'COLLIDE']
[18, [3.141592653589793, 3.9375], 'COLLIDE']
[18, [3.141592653589793, 3.96875], 'ESCAPE']
[18, [3.141592653589793, 3.953125], 'COLLIDE']
[18, [3.141592653589793, 3.9609375], 'COLLIDE']
[18, [3.141592653589793, 3.96484375], 'ESCAPE']
