0.000000 0.859375
10.000000 0.867188
20.000000 0.871094
30.000000 0.886719
40.000000 0.914062
45.000000 0.929688
50.000000 0.949219
60.000000 0.988281
70.000000 1.046875
80.000000 1.105469
90.000000 1.171875
100.000000 1.277344
110.000000 1.394531
120.000000 1.515625
130.000000 1.679688
135.000000 1.781250
140.000000 1.902344
150.000000 2.320312
160.000000 3.250000
170.000000 5.933594
180.000000 6.625000
