0.000000 2.281250
10.000000 2.281250
20.000000 2.281250
30.000000 2.277344
40.000000 2.285156
45.000000 2.285156
50.000000 2.292969
60.000000 2.308594
70.000000 2.339844
80.000000 2.375000
90.000000 2.425781
100.000000 2.417969
110.000000 2.468750
120.000000 2.531250
130.000000 2.601562
135.000000 2.644531
140.000000 2.691406
150.000000 2.812500
160.000000 2.964844
170.000000 3.156250
180.000000 3.386719
