pygame 2.1.2 (SDL 2.0.20, Python 3.10.6)
Hello from the pygame community. https://www.pygame.org/contribute.html
[0, [0, 0.0], 'COLLIDE']
[0, [0, 64.0], 'ESCAPE']
[1, [0, 32.0], 'ESCAPE']
[1, [0, 16.0], 'ESCAPE']
[1, [0, 8.0], 'ESCAPE']
[1, [0, 4.0], 'ESCAPE']
[1, [0, 2.0], 'COLLIDE']
[1, [0, 3.0], 'ESCAPE']
[1, [0, 2.5], 'ESCAPE']
[1, [0, 2.25], 'ESCAPE']
[1, [0, 2.125], 'COLLIDE']
[1, [0, 2.1875], 'COLLIDE']
[1, [0, 2.21875], 'COLLIDE']
[1, [0, 2.234375], 'ESCAPE']
[1, [0, 2.2265625], 'COLLIDE']
[1, [0, 2.23046875], 'COLLIDE']
[2, [10.0, 32.0], 'ESCAPE']
[2, [10.0, 16.0], 'ESCAPE']
[2, [10.0, 8.0], 'ESCAPE']
[2, [10.0, 4.0], 'ESCAPE']
[2, [10.0, 2.0], 'COLLIDE']
[2, [10.0, 3.0], 'ESCAPE']
[2, [10.0, 2.5], 'ESCAPE']
[2, [10.0, 2.25], 'ESCAPE']
[2, [10.0, 2.125], 'COLLIDE']
[2, [10.0, 2.1875], 'COLLIDE']
[2, [10.0, 2.21875], 'COLLIDE']
[2, [10.0, 2.234375], 'COLLIDE']
[2, [10.0, 2.2421875], 'ESCAPE']
[2, [10.0, 2.23828125], 'COLLIDE']
[3, [20.0, 32.0], 'ESCAPE']
[3, [20.0, 16.0], 'ESCAPE']
[3, [20.0, 8.0], 'ESCAPE']
[3, [20.0, 4.0], 'ESCAPE']
[3, [20.0, 2.0], 'COLLIDE']
[3, [20.0, 3.0], 'ESCAPE']
[3, [20.0, 2.5], 'ESCAPE']
[3, [20.0, 2.25], 'ESCAPE']
[3, [20.0, 2.125], 'COLLIDE']
[3, [20.0, 2.1875], 'COLLIDE']
[3, [20.0, 2.21875], 'COLLIDE']
[3, [20.0, 2.234375], 'ESCAPE']
[3, [20.0, 2.2265625], 'COLLIDE']
[3, [20.0, 2.23046875], 'ESCAPE']
[4, [30.0, 32.0], 'ESCAPE']
[4, [30.0, 16.0], 'ESCAPE']
[4, [30.0, 8.0], 'ESCAPE']
[4, [30.0, 4.0], 'ESCAPE']
[4, [30.0, 2.0], 'COLLIDE']
[4, [30.0, 3.0], 'ESCAPE']
[4, [30.0, 2.5], 'ESCAPE']
[4, [30.0, 2.25], 'ESCAPE']
[4, [30.0, 2.125], 'COLLIDE']
[4, [30.0, 2.1875], 'COLLIDE']
[4, [30.0, 2.21875], 'COLLIDE']
[4, [30.0, 2.234375], 'COLLIDE']
[4, [30.0, 2.2421875], 'ESCAPE']
[4, [30.0, 2.23828125], 'COLLIDE']
[5, [40, 32.0], 'ESCAPE']
[5, [40, 16.0], 'ESCAPE']
[5, [40, 8.0], 'ESCAPE']
[5, [40, 4.0], 'ESCAPE']
[5, [40, 2.0], 'COLLIDE']
[5, [40, 3.0], 'ESCAPE']
[5, [40, 2.5], 'ESCAPE']
[5, [40, 2.25], 'COLLIDE']
[5, [40, 2.375], 'ESCAPE']
[5, [40, 2.3125], 'ESCAPE']
[5, [40, 2.28125], 'ESCAPE']
[5, [40, 2.265625], 'ESCAPE']
[5, [40, 2.2578125], 'COLLIDE']
[5, [40, 2.26171875], 'COLLIDE']
[6, [45, 32.0], 'ESCAPE']
[6, [45, 16.0], 'ESCAPE']
[6, [45, 8.0], 'ESCAPE']
[6, [45, 4.0], 'ESCAPE']
[6, [45, 2.0], 'COLLIDE']
[6, [45, 3.0], 'ESCAPE']
[6, [45, 2.5], 'ESCAPE']
[6, [45, 2.25], 'COLLIDE']
[6, [45, 2.375], 'ESCAPE']
[6, [45, 2.3125], 'ESCAPE']
[6, [45, 2.28125], 'ESCAPE']
[6, [45, 2.265625], 'COLLIDE']
[6, [45, 2.2734375], 'COLLIDE']
[6, [45, 2.27734375], 'COLLIDE']
[7, [50, 32.0], 'ESCAPE']
[7, [50, 16.0], 'ESCAPE']
[7, [50, 8.0], 'ESCAPE']
[7, [50, 4.0], 'ESCAPE']
[7, [50, 2.0], 'COLLIDE']
[7, [50, 3.0], 'ESCAPE']
[7, [50, 2.5], 'ESCAPE']
[7, [50, 2.25], 'COLLIDE']
[7, [50, 2.375], 'ESCAPE']
[7, [50, 2.3125], 'ESCAPE']
[7, [50, 2.28125], 'COLLIDE']
[7, [50, 2.296875], 'ESCAPE']
[7, [50, 2.2890625], 'COLLIDE']
[7, [50, 2.29296875], 'COLLIDE']
[8, [60, 32.0], 'ESCAPE']
[8, [60, 16.0], 'ESCAPE']
[8, [60, 8.0], 'ESCAPE']
[8, [60, 4.0], 'ESCAPE']
[8, [60, 2.0], 'COLLIDE']
[8, [60, 3.0], 'ESCAPE']
[8, [60, 2.5], 'ESCAPE']
[8, [60, 2.25], 'COLLIDE']
[8, [60, 2.375], 'ESCAPE']
[8, [60, 2.3125], 'COLLIDE']
[8, [60, 2.34375], 'ESCAPE']
[8, [60, 2.328125], 'COLLIDE']
[8, [60, 2.3359375], 'ESCAPE']
[8, [60, 2.33203125], 'ESCAPE']
[9, [70, 32.0], 'ESCAPE']
[9, [70, 16.0], 'ESCAPE']
[9, [70, 8.0], 'ESCAPE']
[9, [70, 4.0], 'ESCAPE']
[9, [70, 2.0], 'COLLIDE']
[9, [70, 3.0], 'ESCAPE']
[9, [70, 2.5], 'ESCAPE']
[9, [70, 2.25], 'COLLIDE']
[9, [70, 2.375], 'COLLIDE']
[9, [70, 2.4375], 'ESCAPE']
[9, [70, 2.40625], 'ESCAPE']
[9, [70, 2.390625], 'ESCAPE']
[9, [70, 2.3828125], 'ESCAPE']
[9, [70, 2.37890625], 'ESCAPE']
[10, [80, 32.0], 'ESCAPE']
[10, [80, 16.0], 'ESCAPE']
[10, [80, 8.0], 'ESCAPE']
[10, [80, 4.0], 'ESCAPE']
[10, [80, 2.0], 'COLLIDE']
[10, [80, 3.0], 'ESCAPE']
[10, [80, 2.5], 'ESCAPE']
[10, [80, 2.25], 'COLLIDE']
[10, [80, 2.375], 'COLLIDE']
[10, [80, 2.4375], 'ESCAPE']
[10, [80, 2.40625], 'COLLIDE']
[10, [80, 2.421875], 'COLLIDE']
[10, [80, 2.4296875], 'COLLIDE']
[10, [80, 2.43359375], 'ESCAPE']
[11, [90, 32.0], 'ESCAPE']
[11, [90, 16.0], 'ESCAPE']
[11, [90, 8.0], 'ESCAPE']
[11, [90, 4.0], 'ESCAPE']
[11, [90, 2.0], 'COLLIDE']
[11, [90, 3.0], 'ESCAPE']
[11, [90, 2.5], 'COLLIDE']
[11, [90, 2.75], 'ESCAPE']
[11, [90, 2.625], 'ESCAPE']
[11, [90, 2.5625], 'ESCAPE']
[11, [90, 2.53125], 'ESCAPE']
[11, [90, 2.515625], 'ESCAPE']
[11, [90, 2.5078125], 'COLLIDE']
[11, [90, 2.51171875], 'ESCAPE']
[12, [100, 32.0], 'ESCAPE']
[12, [100, 16.0], 'ESCAPE']
[12, [100, 8.0], 'ESCAPE']
[12, [100, 4.0], 'ESCAPE']
[12, [100, 2.0], 'COLLIDE']
[12, [100, 3.0], 'ESCAPE']
[12, [100, 2.5], 'COLLIDE']
[12, [100, 2.75], 'ESCAPE']
[12, [100, 2.625], 'ESCAPE']
[12, [100, 2.5625], 'COLLIDE']
[12, [100, 2.59375], 'ESCAPE']
[12, [100, 2.578125], 'COLLIDE']
[12, [100, 2.5859375], 'COLLIDE']
[12, [100, 2.58984375], 'COLLIDE']
[13, [110, 32.0], 'ESCAPE']
[13, [110, 16.0], 'ESCAPE']
[13, [110, 8.0], 'ESCAPE']
[13, [110, 4.0], 'ESCAPE']
[13, [110, 2.0], 'COLLIDE']
[13, [110, 3.0], 'ESCAPE']
[13, [110, 2.5], 'COLLIDE']
[13, [110, 2.75], 'ESCAPE']
[13, [110, 2.625], 'COLLIDE']
[13, [110, 2.6875], 'ESCAPE']
[13, [110, 2.65625], 'COLLIDE']
[13, [110, 2.671875], 'COLLIDE']
[13, [110, 2.6796875], 'ESCAPE']
[13, [110, 2.67578125], 'ESCAPE']
[14, [120, 32.0], 'ESCAPE']
[14, [120, 16.0], 'ESCAPE']
[14, [120, 8.0], 'ESCAPE']
[14, [120, 4.0], 'ESCAPE']
[14, [120, 2.0], 'COLLIDE']
[14, [120, 3.0], 'ESCAPE']
[14, [120, 2.5], 'COLLIDE']
[14, [120, 2.75], 'COLLIDE']
[14, [120, 2.875], 'ESCAPE']
[14, [120, 2.8125], 'ESCAPE']
[14, [120, 2.78125], 'ESCAPE']
[14, [120, 2.765625], 'COLLIDE']
[14, [120, 2.7734375], 'ESCAPE']
[14, [120, 2.76953125], 'COLLIDE']
[15, [130, 32.0], 'ESCAPE']
[15, [130, 16.0], 'ESCAPE']
[15, [130, 8.0], 'ESCAPE']
[15, [130, 4.0], 'ESCAPE']
[15, [130, 2.0], 'COLLIDE']
[15, [130, 3.0], 'ESCAPE']
[15, [130, 2.5], 'COLLIDE']
[15, [130, 2.75], 'COLLIDE']
[15, [130, 2.875], 'COLLIDE']
[15, [130, 2.9375], 'ESCAPE']
[15, [130, 2.90625], 'COLLIDE']
[15, [130, 2.921875], 'COLLIDE']
[15, [130, 2.9296875], 'COLLIDE']
[15, [130, 2.93359375], 'ESCAPE']
[16, [135, 32.0], 'ESCAPE']
[16, [135, 16.0], 'ESCAPE']
[16, [135, 8.0], 'ESCAPE']
[16, [135, 4.0], 'ESCAPE']
[16, [135, 2.0], 'COLLIDE']
[16, [135, 3.0], 'COLLIDE']
[16, [135, 3.5], 'ESCAPE']
[16, [135, 3.25], 'ESCAPE']
[16, [135, 3.125], 'ESCAPE']
[16, [135, 3.0625], 'ESCAPE']
[16, [135, 3.03125], 'COLLIDE']
[16, [135, 3.046875], 'ESCAPE']
[16, [135, 3.0390625], 'ESCAPE']
[16, [135, 3.03515625], 'ESCAPE']
[17, [140, 32.0], 'ESCAPE']
[17, [140, 16.0], 'ESCAPE']
[17, [140, 8.0], 'ESCAPE']
[17, [140, 4.0], 'ESCAPE']
[17, [140, 2.0], 'COLLIDE']
[17, [140, 3.0], 'COLLIDE']
[17, [140, 3.5], 'ESCAPE']
[17, [140, 3.25], 'ESCAPE']
[17, [140, 3.125], 'COLLIDE']
[17, [140, 3.1875], 'ESCAPE']
[17, [140, 3.15625], 'COLLIDE']
[17, [140, 3.171875], 'ESCAPE']
[17, [140, 3.1640625], 'ESCAPE']
[17, [140, 3.16015625], 'COLLIDE']
[18, [150, 32.0], 'ESCAPE']
[18, [150, 16.0], 'ESCAPE']
[18, [150, 8.0], 'ESCAPE']
[18, [150, 4.0], 'ESCAPE']
[18, [150, 2.0], 'COLLIDE']
[18, [150, 3.0], 'COLLIDE']
[18, [150, 3.5], 'COLLIDE']
[18, [150, 3.75], 'ESCAPE']
[18, [150, 3.625], 'ESCAPE']
[18, [150, 3.5625], 'COLLIDE']
[18, [150, 3.59375], 'ESCAPE']
[18, [150, 3.578125], 'COLLIDE']
[18, [150, 3.5859375], 'ESCAPE']
[18, [150, 3.58203125], 'ESCAPE']
[19, [160, 32.0], 'ESCAPE']
[19, [160, 16.0], 'ESCAPE']
[19, [160, 8.0], 'ESCAPE']
[19, [160, 4.0], 'COLLIDE']
[19, [160, 6.0], 'ESCAPE']
[19, [160, 5.0], 'ESCAPE']
[19, [160, 4.5], 'COLLIDE']
[19, [160, 4.75], 'ESCAPE']
[19, [160, 4.625], 'ESCAPE']
[19, [160, 4.5625], 'ESCAPE']
[19, [160, 4.53125], 'ESCAPE']
[19, [160, 4.515625], 'ESCAPE']
[19, [160, 4.5078125], 'ESCAPE']
[19, [160, 4.50390625], 'COLLIDE']
[20, [170, 32.0], 'ESCAPE']
[20, [170, 16.0], 'ESCAPE']
[20, [170, 8.0], 'ESCAPE']
[20, [170, 4.0], 'COLLIDE']
[20, [170, 6.0], 'COLLIDE']
[20, [170, 7.0], 'COLLIDE']
[20, [170, 7.5], 'ESCAPE']
[20, [170, 7.25], 'ESCAPE']
[20, [170, 7.125], 'COLLIDE']
[20, [170, 7.1875], 'COLLIDE']
[20, [170, 7.21875], 'ESCAPE']
[20, [170, 7.203125], 'ESCAPE']
[20, [170, 7.1953125], 'ESCAPE']
[20, [170, 7.19140625], 'ESCAPE']
[21, [180, 32.0], 'ESCAPE']
[21, [180, 16.0], 'ESCAPE']
[21, [180, 8.0], 'COLLIDE']
[21, [180, 12.0], 'ESCAPE']
[21, [180, 10.0], 'ESCAPE']
[21, [180, 9.0], 'ESCAPE']
[21, [180, 8.5], 'ESCAPE']
[21, [180, 8.25], 'ESCAPE']
[21, [180, 8.125], 'ESCAPE']
[21, [180, 8.0625], 'ESCAPE']
[21, [180, 8.03125], 'ESCAPE']
[21, [180, 8.015625], 'COLLIDE']
[21, [180, 8.0234375], 'ESCAPE']
[21, [180, 8.01953125], 'COLLIDE']
[22, [180, 32.0], 'ESCAPE']
[22, [180, 16.0], 'ESCAPE']
[22, [180, 8.0], 'COLLIDE']
[22, [180, 12.0], 'ESCAPE']
[22, [180, 10.0], 'ESCAPE']
[22, [180, 9.0], 'ESCAPE']
[22, [180, 8.5], 'ESCAPE']
[22, [180, 8.25], 'ESCAPE']
[22, [180, 8.125], 'ESCAPE']
[22, [180, 8.0625], 'ESCAPE']
[22, [180, 8.03125], 'ESCAPE']
[22, [180, 8.015625], 'COLLIDE']
[22, [180, 8.0234375], 'ESCAPE']
[22, [180, 8.01953125], 'COLLIDE']
