pygame 2.1.2 (SDL 2.0.20, Python 3.10.6)
Hello from the pygame community. https://www.pygame.org/contribute.html
[0, [0, 0.0], 'COLLIDE']
[0, [0, 64.0], 'ESCAPE']
[1, [0, 32.0], 'ESCAPE']
[1, [0, 16.0], 'ESCAPE']
[1, [0, 8.0], 'COLLIDE']
[1, [0, 12.0], 'COLLIDE']
[1, [0, 14.0], 'ESCAPE']
[1, [0, 13.0], 'COLLIDE']
[1, [0, 13.5], 'ESCAPE']
[1, [0, 13.25], 'ESCAPE']
[1, [0, 13.125], 'COLLIDE']
[1, [0, 13.1875], 'ESCAPE']
[1, [0, 13.15625], 'COLLIDE']
[1, [0, 13.171875], 'COLLIDE']
[1, [0, 13.1796875], 'COLLIDE']
[1, [0, 13.18359375], 'COLLIDE']
[2, [10.0, 32.0], 'ESCAPE']
[2, [10.0, 16.0], 'ESCAPE']
[2, [10.0, 8.0], 'COLLIDE']
[2, [10.0, 12.0], 'COLLIDE']
[2, [10.0, 14.0], 'ESCAPE']
[2, [10.0, 13.0], 'ESCAPE']
[2, [10.0, 12.5], 'COLLIDE']
[2, [10.0, 12.75], 'ESCAPE']
[2, [10.0, 12.625], 'COLLIDE']
[2, [10.0, 12.6875], 'COLLIDE']
[2, [10.0, 12.71875], 'ESCAPE']
[2, [10.0, 12.703125], 'ESCAPE']
[2, [10.0, 12.6953125], 'COLLIDE']
[2, [10.0, 12.69921875], 'ESCAPE']
[3, [20.0, 32.0], 'ESCAPE']
[3, [20.0, 16.0], 'ESCAPE']
[3, [20.0, 8.0], 'COLLIDE']
[3, [20.0, 12.0], 'COLLIDE']
[3, [20.0, 14.0], 'ESCAPE']
[3, [20.0, 13.0], 'ESCAPE']
[3, [20.0, 12.5], 'ESCAPE']
[3, [20.0, 12.25], 'COLLIDE']
[3, [20.0, 12.375], 'ESCAPE']
[3, [20.0, 12.3125], 'ESCAPE']
[3, [20.0, 12.28125], 'ESCAPE']
[3, [20.0, 12.265625], 'COLLIDE']
[3, [20.0, 12.2734375], 'ESCAPE']
[3, [20.0, 12.26953125], 'COLLIDE']
[4, [30.0, 32.0], 'ESCAPE']
[4, [30.0, 16.0], 'ESCAPE']
[4, [30.0, 8.0], 'COLLIDE']
[4, [30.0, 12.0], 'ESCAPE']
[4, [30.0, 10.0], 'COLLIDE']
[4, [30.0, 11.0], 'COLLIDE']
[4, [30.0, 11.5], 'COLLIDE']
[4, [30.0, 11.75], 'COLLIDE']
[4, [30.0, 11.875], 'COLLIDE']
[4, [30.0, 11.9375], 'COLLIDE']
[4, [30.0, 11.96875], 'COLLIDE']
[4, [30.0, 11.984375], 'COLLIDE']
[4, [30.0, 11.9921875], 'COLLIDE']
[4, [30.0, 11.99609375], 'ESCAPE']
[5, [40, 32.0], 'ESCAPE']
[5, [40, 16.0], 'ESCAPE']
[5, [40, 8.0], 'COLLIDE']
[5, [40, 12.0], 'ESCAPE']
[5, [40, 10.0], 'COLLIDE']
[5, [40, 11.0], 'COLLIDE']
[5, [40, 11.5], 'COLLIDE']
[5, [40, 11.75], 'COLLIDE']
[5, [40, 11.875], 'ESCAPE']
[5, [40, 11.8125], 'ESCAPE']
[5, [40, 11.78125], 'COLLIDE']
[5, [40, 11.796875], 'COLLIDE']
[5, [40, 11.8046875], 'ESCAPE']
[5, [40, 11.80078125], 'COLLIDE']
[6, [45, 32.0], 'ESCAPE']
[6, [45, 16.0], 'ESCAPE']
[6, [45, 8.0], 'COLLIDE']
[6, [45, 12.0], 'ESCAPE']
[6, [45, 10.0], 'COLLIDE']
[6, [45, 11.0], 'COLLIDE']
[6, [45, 11.5], 'COLLIDE']
[6, [45, 11.75], 'COLLIDE']
[6, [45, 11.875], 'ESCAPE']
[6, [45, 11.8125], 'ESCAPE']
[6, [45, 11.78125], 'ESCAPE']
[6, [45, 11.765625], 'ESCAPE']
[6, [45, 11.7578125], 'COLLIDE']
[6, [45, 11.76171875], 'ESCAPE']
[7, [50, 32.0], 'ESCAPE']
[7, [50, 16.0], 'ESCAPE']
[7, [50, 8.0], 'COLLIDE']
[7, [50, 12.0], 'ESCAPE']
[7, [50, 10.0], 'COLLIDE']
[7, [50, 11.0], 'COLLIDE']
[7, [50, 11.5], 'COLLIDE']
[7, [50, 11.75], 'ESCAPE']
[7, [50, 11.625], 'COLLIDE']
[7, [50, 11.6875], 'COLLIDE']
[7, [50, 11.71875], 'ESCAPE']
[7, [50, 11.703125], 'ESCAPE']
[7, [50, 11.6953125], 'COLLIDE']
[7, [50, 11.69921875], 'COLLIDE']
[8, [60, 32.0], 'ESCAPE']
[8, [60, 16.0], 'ESCAPE']
[8, [60, 8.0], 'COLLIDE']
[8, [60, 12.0], 'ESCAPE']
[8, [60, 10.0], 'COLLIDE']
[8, [60, 11.0], 'COLLIDE']
[8, [60, 11.5], 'COLLIDE']
[8, [60, 11.75], 'ESCAPE']
[8, [60, 11.625], 'COLLIDE']
[8, [60, 11.6875], 'ESCAPE']
[8, [60, 11.65625], 'COLLIDE']
[8, [60, 11.671875], 'ESCAPE']
[8, [60, 11.6640625], 'COLLIDE']
[8, [60, 11.66796875], 'COLLIDE']
[9, [70, 32.0], 'ESCAPE']
[9, [70, 16.0], 'ESCAPE']
[9, [70, 8.0], 'COLLIDE']
[9, [70, 12.0], 'ESCAPE']
[9, [70, 10.0], 'COLLIDE']
[9, [70, 11.0], 'COLLIDE']
[9, [70, 11.5], 'COLLIDE']
[9, [70, 11.75], 'ESCAPE']
[9, [70, 11.625], 'COLLIDE']
[9, [70, 11.6875], 'ESCAPE']
[9, [70, 11.65625], 'COLLIDE']
[9, [70, 11.671875], 'COLLIDE']
[9, [70, 11.6796875], 'ESCAPE']
[9, [70, 11.67578125], 'COLLIDE']
[10, [80, 32.0], 'ESCAPE']
[10, [80, 16.0], 'ESCAPE']
[10, [80, 8.0], 'COLLIDE']
[10, [80, 12.0], 'ESCAPE']
[10, [80, 10.0], 'COLLIDE']
[10, [80, 11.0], 'COLLIDE']
[10, [80, 11.5], 'COLLIDE']
[10, [80, 11.75], 'ESCAPE']
[10, [80, 11.625], 'COLLIDE']
[10, [80, 11.6875], 'COLLIDE']
[10, [80, 11.71875], 'ESCAPE']
[10, [80, 11.703125], 'COLLIDE']
[10, [80, 11.7109375], 'COLLIDE']
[10, [80, 11.71484375], 'ESCAPE']
[11, [90, 32.0], 'ESCAPE']
[11, [90, 16.0], 'ESCAPE']
[11, [90, 8.0], 'COLLIDE']
[11, [90, 12.0], 'ESCAPE']
[11, [90, 10.0], 'COLLIDE']
[11, [90, 11.0], 'COLLIDE']
[11, [90, 11.5], 'COLLIDE']
[11, [90, 11.75], 'ESCAPE']
[11, [90, 11.625], 'COLLIDE']
[11, [90, 11.6875], 'COLLIDE']
[11, [90, 11.71875], 'COLLIDE']
[11, [90, 11.734375], 'ESCAPE']
[11, [90, 11.7265625], 'COLLIDE']
[11, [90, 11.73046875], 'COLLIDE']
[12, [100, 32.0], 'ESCAPE']
[12, [100, 16.0], 'ESCAPE']
[12, [100, 8.0], 'COLLIDE']
[12, [100, 12.0], 'ESCAPE']
[12, [100, 10.0], 'COLLIDE']
[12, [100, 11.0], 'COLLIDE']
[12, [100, 11.5], 'COLLIDE']
[12, [100, 11.75], 'COLLIDE']
[12, [100, 11.875], 'ESCAPE']
[12, [100, 11.8125], 'ESCAPE']
[12, [100, 11.78125], 'ESCAPE']
[12, [100, 11.765625], 'ESCAPE']
[12, [100, 11.7578125], 'ESCAPE']
[12, [100, 11.75390625], 'ESCAPE']
[13, [110, 32.0], 'ESCAPE']
[13, [110, 16.0], 'ESCAPE']
[13, [110, 8.0], 'COLLIDE']
[13, [110, 12.0], 'ESCAPE']
[13, [110, 10.0], 'COLLIDE']
[13, [110, 11.0], 'COLLIDE']
[13, [110, 11.5], 'COLLIDE']
[13, [110, 11.75], 'COLLIDE']
[13, [110, 11.875], 'ESCAPE']
[13, [110, 11.8125], 'COLLIDE']
[13, [110, 11.84375], 'ESCAPE']
[13, [110, 11.828125], 'ESCAPE']
[13, [110, 11.8203125], 'COLLIDE']
[13, [110, 11.82421875], 'COLLIDE']
[14, [120, 32.0], 'ESCAPE']
[14, [120, 16.0], 'ESCAPE']
[14, [120, 8.0], 'COLLIDE']
[14, [120, 12.0], 'ESCAPE']
[14, [120, 10.0], 'COLLIDE']
[14, [120, 11.0], 'COLLIDE']
[14, [120, 11.5], 'COLLIDE']
[14, [120, 11.75], 'COLLIDE']
[14, [120, 11.875], 'COLLIDE']
[14, [120, 11.9375], 'COLLIDE']
[14, [120, 11.96875], 'COLLIDE']
[14, [120, 11.984375], 'ESCAPE']
[14, [120, 11.9765625], 'COLLIDE']
[14, [120, 11.98046875], 'ESCAPE']
[15, [130, 32.0], 'ESCAPE']
[15, [130, 16.0], 'ESCAPE']
[15, [130, 8.0], 'COLLIDE']
[15, [130, 12.0], 'COLLIDE']
[15, [130, 14.0], 'ESCAPE']
[15, [130, 13.0], 'ESCAPE']
[15, [130, 12.5], 'ESCAPE']
[15, [130, 12.25], 'ESCAPE']
[15, [130, 12.125], 'COLLIDE']
[15, [130, 12.1875], 'COLLIDE']
[15, [130, 12.21875], 'COLLIDE']
[15, [130, 12.234375], 'COLLIDE']
[15, [130, 12.2421875], 'ESCAPE']
[15, [130, 12.23828125], 'COLLIDE']
[16, [135, 32.0], 'ESCAPE']
[16, [135, 16.0], 'ESCAPE']
[16, [135, 8.0], 'COLLIDE']
[16, [135, 12.0], 'COLLIDE']
[16, [135, 14.0], 'ESCAPE']
[16, [135, 13.0], 'ESCAPE']
[16, [135, 12.5], 'ESCAPE']
[16, [135, 12.25], 'COLLIDE']
[16, [135, 12.375], 'COLLIDE']
[16, [135, 12.4375], 'ESCAPE']
[16, [135, 12.40625], 'COLLIDE']
[16, [135, 12.421875], 'COLLIDE']
[16, [135, 12.4296875], 'ESCAPE']
[16, [135, 12.42578125], 'ESCAPE']
[17, [140, 32.0], 'ESCAPE']
[17, [140, 16.0], 'ESCAPE']
[17, [140, 8.0], 'COLLIDE']
[17, [140, 12.0], 'COLLIDE']
[17, [140, 14.0], 'ESCAPE']
[17, [140, 13.0], 'ESCAPE']
[17, [140, 12.5], 'COLLIDE']
[17, [140, 12.75], 'ESCAPE']
[17, [140, 12.625], 'ESCAPE']
[17, [140, 12.5625], 'COLLIDE']
[17, [140, 12.59375], 'COLLIDE']
[17, [140, 12.609375], 'ESCAPE']
[17, [140, 12.6015625], 'ESCAPE']
[17, [140, 12.59765625], 'ESCAPE']
[18, [150, 32.0], 'ESCAPE']
[18, [150, 16.0], 'ESCAPE']
[18, [150, 8.0], 'COLLIDE']
[18, [150, 12.0], 'COLLIDE']
[18, [150, 14.0], 'ESCAPE']
[18, [150, 13.0], 'COLLIDE']
[18, [150, 13.5], 'ESCAPE']
[18, [150, 13.25], 'ESCAPE']
[18, [150, 13.125], 'ESCAPE']
[18, [150, 13.0625], 'COLLIDE']
[18, [150, 13.09375], 'COLLIDE']
[18, [150, 13.109375], 'ESCAPE']
[18, [150, 13.1015625], 'ESCAPE']
[18, [150, 13.09765625], 'COLLIDE']
[19, [160, 32.0], 'ESCAPE']
[19, [160, 16.0], 'ESCAPE']
[19, [160, 8.0], 'COLLIDE']
[19, [160, 12.0], 'COLLIDE']
[19, [160, 14.0], 'ESCAPE']
[19, [160, 13.0], 'COLLIDE']
[19, [160, 13.5], 'COLLIDE']
[19, [160, 13.75], 'ESCAPE']
[19, [160, 13.625], 'COLLIDE']
[19, [160, 13.6875], 'COLLIDE']
[19, [160, 13.71875], 'COLLIDE']
[19, [160, 13.734375], 'ESCAPE']
[19, [160, 13.7265625], 'ESCAPE']
[19, [160, 13.72265625], 'COLLIDE']
[20, [170, 32.0], 'ESCAPE']
[20, [170, 16.0], 'ESCAPE']
[20, [170, 8.0], 'COLLIDE']
[20, [170, 12.0], 'COLLIDE']
[20, [170, 14.0], 'COLLIDE']
[20, [170, 15.0], 'ESCAPE']
[20, [170, 14.5], 'COLLIDE']
[20, [170, 14.75], 'ESCAPE']
[20, [170, 14.625], 'ESCAPE']
[20, [170, 14.5625], 'ESCAPE']
[20, [170, 14.53125], 'ESCAPE']
[20, [170, 14.515625], 'COLLIDE']
[20, [170, 14.5234375], 'COLLIDE']
[20, [170, 14.52734375], 'COLLIDE']
[21, [180, 32.0], 'ESCAPE']
[21, [180, 16.0], 'ESCAPE']
[21, [180, 8.0], 'COLLIDE']
[21, [180, 12.0], 'COLLIDE']
[21, [180, 14.0], 'COLLIDE']
[21, [180, 15.0], 'COLLIDE']
[21, [180, 15.5], 'ESCAPE']
[21, [180, 15.25], 'COLLIDE']
[21, [180, 15.375], 'COLLIDE']
[21, [180, 15.4375], 'ESCAPE']
[21, [180, 15.40625], 'COLLIDE']
[21, [180, 15.421875], 'ESCAPE']
[21, [180, 15.4140625], 'ESCAPE']
[21, [180, 15.41015625], 'ESCAPE']
[22, [180, 32.0], 'ESCAPE']
[22, [180, 16.0], 'ESCAPE']
[22, [180, 8.0], 'COLLIDE']
[22, [180, 12.0], 'COLLIDE']
[22, [180, 14.0], 'COLLIDE']
[22, [180, 15.0], 'COLLIDE']
[22, [180, 15.5], 'ESCAPE']
[22, [180, 15.25], 'COLLIDE']
[22, [180, 15.375], 'COLLIDE']
[22, [180, 15.4375], 'ESCAPE']
[22, [180, 15.40625], 'COLLIDE']
[22, [180, 15.421875], 'ESCAPE']
[22, [180, 15.4140625], 'ESCAPE']
[22, [180, 15.41015625], 'ESCAPE']
