0.000000 2.234375
10.000000 2.234375
20.000000 2.222656
30.000000 2.250000
40.000000 2.277344
45.000000 2.296875
50.000000 2.312500
60.000000 2.355469
70.000000 2.410156
80.000000 2.480469
90.000000 2.511719
100.000000 2.542969
110.000000 2.605469
120.000000 2.683594
130.000000 2.773438
135.000000 2.816406
140.000000 2.871094
150.000000 3.007812
160.000000 3.179688
170.000000 3.367188
180.000000 3.605469
