0.000000 1.589844
0.196350 1.597656
0.392699 1.617188
0.589049 1.648438
0.837758 1.710938
0.981748 1.761719
1.178097 1.851562
1.374447 1.917969
1.570796 1.945312
1.767146 1.980469
1.963495 2.074219
2.159845 2.230469
2.356194 2.437500
2.552544 2.699219
2.748894 3.035156
2.945243 3.453125
3.141593 3.964844
