pygame 2.1.2 (SDL 2.0.20, Python 3.10.6)
Hello from the pygame community. https://www.pygame.org/contribute.html
[0, [0, 0.0], 'COLLIDE']
[0, [0, 64.0], 'ESCAPE']
[1, [0, 32.0], 'ESCAPE']
[1, [0, 16.0], 'ESCAPE']
[1, [0, 8.0], 'ESCAPE']
[1, [0, 4.0], 'ESCAPE']
[1, [0, 2.0], 'COLLIDE']
[1, [0, 3.0], 'ESCAPE']
[1, [0, 2.5], 'ESCAPE']
[1, [0, 2.25], 'ESCAPE']
[1, [0, 2.125], 'ESCAPE']
[1, [0, 2.0625], 'ESCAPE']
[1, [0, 2.03125], 'COLLIDE']
[1, [0, 2.046875], 'COLLIDE']
[1, [0, 2.0546875], 'ESCAPE']
[1, [0, 2.05078125], 'ESCAPE']
[2, [10.0, 32.0], 'ESCAPE']
[2, [10.0, 16.0], 'ESCAPE']
[2, [10.0, 8.0], 'ESCAPE']
[2, [10.0, 4.0], 'ESCAPE']
[2, [10.0, 2.0], 'COLLIDE']
[2, [10.0, 3.0], 'ESCAPE']
[2, [10.0, 2.5], 'ESCAPE']
[2, [10.0, 2.25], 'ESCAPE']
[2, [10.0, 2.125], 'COLLIDE']
[2, [10.0, 2.1875], 'COLLIDE']
[2, [10.0, 2.21875], 'ESCAPE']
[2, [10.0, 2.203125], 'COLLIDE']
[2, [10.0, 2.2109375], 'ESCAPE']
[2, [10.0, 2.20703125], 'COLLIDE']
[3, [20.0, 32.0], 'ESCAPE']
[3, [20.0, 16.0], 'ESCAPE']
[3, [20.0, 8.0], 'ESCAPE']
[3, [20.0, 4.0], 'ESCAPE']
[3, [20.0, 2.0], 'COLLIDE']
[3, [20.0, 3.0], 'ESCAPE']
[3, [20.0, 2.5], 'ESCAPE']
[3, [20.0, 2.25], 'ESCAPE']
[3, [20.0, 2.125], 'COLLIDE']
[3, [20.0, 2.1875], 'COLLIDE']
[3, [20.0, 2.21875], 'COLLIDE']
[3, [20.0, 2.234375], 'ESCAPE']
[3, [20.0, 2.2265625], 'COLLIDE']
[3, [20.0, 2.23046875], 'COLLIDE']
[4, [30.0, 32.0], 'ESCAPE']
[4, [30.0, 16.0], 'ESCAPE']
[4, [30.0, 8.0], 'ESCAPE']
[4, [30.0, 4.0], 'ESCAPE']
[4, [30.0, 2.0], 'COLLIDE']
[4, [30.0, 3.0], 'ESCAPE']
[4, [30.0, 2.5], 'ESCAPE']
[4, [30.0, 2.25], 'COLLIDE']
[4, [30.0, 2.375], 'ESCAPE']
[4, [30.0, 2.3125], 'ESCAPE']
[4, [30.0, 2.28125], 'ESCAPE']
[4, [30.0, 2.265625], 'ESCAPE']
[4, [30.0, 2.2578125], 'ESCAPE']
[4, [30.0, 2.25390625], 'COLLIDE']
[5, [40, 32.0], 'ESCAPE']
[5, [40, 16.0], 'ESCAPE']
[5, [40, 8.0], 'ESCAPE']
[5, [40, 4.0], 'ESCAPE']
[5, [40, 2.0], 'COLLIDE']
[5, [40, 3.0], 'ESCAPE']
[5, [40, 2.5], 'ESCAPE']
[5, [40, 2.25], 'COLLIDE']
[5, [40, 2.375], 'ESCAPE']
[5, [40, 2.3125], 'ESCAPE']
[5, [40, 2.28125], 'ESCAPE']
[5, [40, 2.265625], 'COLLIDE']
[5, [40, 2.2734375], 'COLLIDE']
[5, [40, 2.27734375], 'ESCAPE']
[6, [45, 32.0], 'ESCAPE']
[6, [45, 16.0], 'ESCAPE']
[6, [45, 8.0], 'ESCAPE']
[6, [45, 4.0], 'ESCAPE']
[6, [45, 2.0], 'COLLIDE']
[6, [45, 3.0], 'ESCAPE']
[6, [45, 2.5], 'ESCAPE']
[6, [45, 2.25], 'COLLIDE']
[6, [45, 2.375], 'ESCAPE']
[6, [45, 2.3125], 'ESCAPE']
[6, [45, 2.28125], 'COLLIDE']
[6, [45, 2.296875], 'ESCAPE']
[6, [45, 2.2890625], 'COLLIDE']
[6, [45, 2.29296875], 'COLLIDE']
[7, [50, 32.0], 'ESCAPE']
[7, [50, 16.0], 'ESCAPE']
[7, [50, 8.0], 'ESCAPE']
[7, [50, 4.0], 'ESCAPE']
[7, [50, 2.0], 'COLLIDE']
[7, [50, 3.0], 'ESCAPE']
[7, [50, 2.5], 'ESCAPE']
[7, [50, 2.25], 'COLLIDE']
[7, [50, 2.375], 'ESCAPE']
[7, [50, 2.3125], 'COLLIDE']
[7, [50, 2.34375], 'ESCAPE']
[7, [50, 2.328125], 'ESCAPE']
[7, [50, 2.3203125], 'ESCAPE']
[7, [50, 2.31640625], 'ESCAPE']
[8, [60, 32.0], 'ESCAPE']
[8, [60, 16.0], 'ESCAPE']
[8, [60, 8.0], 'ESCAPE']
[8, [60, 4.0], 'ESCAPE']
[8, [60, 2.0], 'COLLIDE']
[8, [60, 3.0], 'ESCAPE']
[8, [60, 2.5], 'ESCAPE']
[8, [60, 2.25], 'COLLIDE']
[8, [60, 2.375], 'ESCAPE']
[8, [60, 2.3125], 'COLLIDE']
[8, [60, 2.34375], 'COLLIDE']
[8, [60, 2.359375], 'COLLIDE']
[8, [60, 2.3671875], 'ESCAPE']
[8, [60, 2.36328125], 'ESCAPE']
[9, [70, 32.0], 'ESCAPE']
[9, [70, 16.0], 'ESCAPE']
[9, [70, 8.0], 'ESCAPE']
[9, [70, 4.0], 'ESCAPE']
[9, [70, 2.0], 'COLLIDE']
[9, [70, 3.0], 'ESCAPE']
[9, [70, 2.5], 'ESCAPE']
[9, [70, 2.25], 'COLLIDE']
[9, [70, 2.375], 'COLLIDE']
[9, [70, 2.4375], 'ESCAPE']
[9, [70, 2.40625], 'COLLIDE']
[9, [70, 2.421875], 'ESCAPE']
[9, [70, 2.4140625], 'COLLIDE']
[9, [70, 2.41796875], 'COLLIDE']
[10, [80, 32.0], 'ESCAPE']
[10, [80, 16.0], 'ESCAPE']
[10, [80, 8.0], 'ESCAPE']
[10, [80, 4.0], 'ESCAPE']
[10, [80, 2.0], 'COLLIDE']
[10, [80, 3.0], 'ESCAPE']
[10, [80, 2.5], 'ESCAPE']
[10, [80, 2.25], 'COLLIDE']
[10, [80, 2.375], 'COLLIDE']
[10, [80, 2.4375], 'COLLIDE']
[10, [80, 2.46875], 'COLLIDE']
[10, [80, 2.484375], 'COLLIDE']
[10, [80, 2.4921875], 'COLLIDE']
[10, [80, 2.49609375], 'COLLIDE']
[11, [90, 32.0], 'ESCAPE']
[11, [90, 16.0], 'ESCAPE']
[11, [90, 8.0], 'ESCAPE']
[11, [90, 4.0], 'ESCAPE']
[11, [90, 2.0], 'COLLIDE']
[11, [90, 3.0], 'ESCAPE']
[11, [90, 2.5], 'COLLIDE']
[11, [90, 2.75], 'ESCAPE']
[11, [90, 2.625], 'ESCAPE']
[11, [90, 2.5625], 'COLLIDE']
[11, [90, 2.59375], 'ESCAPE']
[11, [90, 2.578125], 'COLLIDE']
[11, [90, 2.5859375], 'ESCAPE']
[11, [90, 2.58203125], 'COLLIDE']
[12, [100, 32.0], 'ESCAPE']
[12, [100, 16.0], 'ESCAPE']
[12, [100, 8.0], 'ESCAPE']
[12, [100, 4.0], 'ESCAPE']
[12, [100, 2.0], 'COLLIDE']
[12, [100, 3.0], 'ESCAPE']
[12, [100, 2.5], 'COLLIDE']
[12, [100, 2.75], 'ESCAPE']
[12, [100, 2.625], 'COLLIDE']
[12, [100, 2.6875], 'COLLIDE']
[12, [100, 2.71875], 'ESCAPE']
[12, [100, 2.703125], 'ESCAPE']
[12, [100, 2.6953125], 'COLLIDE']
[12, [100, 2.69921875], 'ESCAPE']
[13, [110, 32.0], 'ESCAPE']
[13, [110, 16.0], 'ESCAPE']
[13, [110, 8.0], 'ESCAPE']
[13, [110, 4.0], 'ESCAPE']
[13, [110, 2.0], 'COLLIDE']
[13, [110, 3.0], 'ESCAPE']
[13, [110, 2.5], 'COLLIDE']
[13, [110, 2.75], 'COLLIDE']
[13, [110, 2.875], 'ESCAPE']
[13, [110, 2.8125], 'COLLIDE']
[13, [110, 2.84375], 'COLLIDE']
[13, [110, 2.859375], 'ESCAPE']
[13, [110, 2.8515625], 'ESCAPE']
[13, [110, 2.84765625], 'COLLIDE']
[14, [120, 32.0], 'ESCAPE']
[14, [120, 16.0], 'ESCAPE']
[14, [120, 8.0], 'ESCAPE']
[14, [120, 4.0], 'ESCAPE']
[14, [120, 2.0], 'COLLIDE']
[14, [120, 3.0], 'COLLIDE']
[14, [120, 3.5], 'ESCAPE']
[14, [120, 3.25], 'ESCAPE']
[14, [120, 3.125], 'ESCAPE']
[14, [120, 3.0625], 'COLLIDE']
[14, [120, 3.09375], 'ESCAPE']
[14, [120, 3.078125], 'COLLIDE']
[14, [120, 3.0859375], 'ESCAPE']
[14, [120, 3.08203125], 'COLLIDE']
[15, [130, 32.0], 'ESCAPE']
[15, [130, 16.0], 'ESCAPE']
[15, [130, 8.0], 'ESCAPE']
[15, [130, 4.0], 'ESCAPE']
[15, [130, 2.0], 'COLLIDE']
[15, [130, 3.0], 'COLLIDE']
[15, [130, 3.5], 'ESCAPE']
[15, [130, 3.25], 'COLLIDE']
[15, [130, 3.375], 'COLLIDE']
[15, [130, 3.4375], 'COLLIDE']
[15, [130, 3.46875], 'ESCAPE']
[15, [130, 3.453125], 'ESCAPE']
[15, [130, 3.4453125], 'ESCAPE']
[15, [130, 3.44140625], 'ESCAPE']
[16, [135, 32.0], 'ESCAPE']
[16, [135, 16.0], 'ESCAPE']
[16, [135, 8.0], 'ESCAPE']
[16, [135, 4.0], 'ESCAPE']
[16, [135, 2.0], 'COLLIDE']
[16, [135, 3.0], 'COLLIDE']
[16, [135, 3.5], 'COLLIDE']
[16, [135, 3.75], 'ESCAPE']
[16, [135, 3.625], 'COLLIDE']
[16, [135, 3.6875], 'ESCAPE']
[16, [135, 3.65625], 'COLLIDE']
[16, [135, 3.671875], 'COLLIDE']
[16, [135, 3.6796875], 'ESCAPE']
[16, [135, 3.67578125], 'COLLIDE']
[17, [140, 32.0], 'ESCAPE']
[17, [140, 16.0], 'ESCAPE']
[17, [140, 8.0], 'ESCAPE']
[17, [140, 4.0], 'ESCAPE']
[17, [140, 2.0], 'COLLIDE']
[17, [140, 3.0], 'COLLIDE']
[17, [140, 3.5], 'COLLIDE']
[17, [140, 3.75], 'COLLIDE']
[17, [140, 3.875], 'COLLIDE']
[17, [140, 3.9375], 'COLLIDE']
[17, [140, 3.96875], 'COLLIDE']
[17, [140, 3.984375], 'COLLIDE']
[17, [140, 3.9921875], 'ESCAPE']
[17, [140, 3.98828125], 'ESCAPE']
[18, [150, 32.0], 'ESCAPE']
[18, [150, 16.0], 'ESCAPE']
[18, [150, 8.0], 'ESCAPE']
[18, [150, 4.0], 'COLLIDE']
[18, [150, 6.0], 'ESCAPE']
[18, [150, 5.0], 'ESCAPE']
[18, [150, 4.5], 'COLLIDE']
[18, [150, 4.75], 'COLLIDE']
[18, [150, 4.875], 'COLLIDE']
[18, [150, 4.9375], 'ESCAPE']
[18, [150, 4.90625], 'COLLIDE']
[18, [150, 4.921875], 'ESCAPE']
[18, [150, 4.9140625], 'ESCAPE']
[18, [150, 4.91015625], 'ESCAPE']
[19, [160, 32.0], 'ESCAPE']
[19, [160, 16.0], 'ESCAPE']
[19, [160, 8.0], 'ESCAPE']
[19, [160, 4.0], 'COLLIDE']
[19, [160, 6.0], 'COLLIDE']
[19, [160, 7.0], 'ESCAPE']
[19, [160, 6.5], 'COLLIDE']
[19, [160, 6.75], 'COLLIDE']
[19, [160, 6.875], 'ESCAPE']
[19, [160, 6.8125], 'ESCAPE']
[19, [160, 6.78125], 'COLLIDE']
[19, [160, 6.796875], 'ESCAPE']
[19, [160, 6.7890625], 'ESCAPE']
[19, [160, 6.78515625], 'COLLIDE']
[20, [170, 32.0], 'ESCAPE']
[20, [170, 16.0], 'ESCAPE']
[20, [170, 8.0], 'COLLIDE']
[20, [170, 12.0], 'ESCAPE']
[20, [170, 10.0], 'COLLIDE']
[20, [170, 11.0], 'ESCAPE']
[20, [170, 10.5], 'COLLIDE']
[20, [170, 10.75], 'ESCAPE']
[20, [170, 10.625], 'ESCAPE']
[20, [170, 10.5625], 'COLLIDE']
[20, [170, 10.59375], 'ESCAPE']
[20, [170, 10.578125], 'ESCAPE']
[20, [170, 10.5703125], 'ESCAPE']
[20, [170, 10.56640625], 'COLLIDE']
[21, [180, 32.0], 'ESCAPE']
[21, [180, 16.0], 'ESCAPE']
[21, [180, 8.0], 'COLLIDE']
[21, [180, 12.0], 'ESCAPE']
[21, [180, 10.0], 'COLLIDE']
[21, [180, 11.0], 'ESCAPE']
[21, [180, 10.5], 'COLLIDE']
[21, [180, 10.75], 'ESCAPE']
[21, [180, 10.625], 'COLLIDE']
[21, [180, 10.6875], 'ESCAPE']
[21, [180, 10.65625], 'COLLIDE']
[21, [180, 10.671875], 'ESCAPE']
[21, [180, 10.6640625], 'COLLIDE']
[21, [180, 10.66796875], 'ESCAPE']
[22, [180, 32.0], 'ESCAPE']
[22, [180, 16.0], 'ESCAPE']
[22, [180, 8.0], 'COLLIDE']
[22, [180, 12.0], 'ESCAPE']
[22, [180, 10.0], 'COLLIDE']
[22, [180, 11.0], 'ESCAPE']
[22, [180, 10.5], 'COLLIDE']
[22, [180, 10.75], 'ESCAPE']
[22, [180, 10.625], 'COLLIDE']
[22, [180, 10.6875], 'ESCAPE']
[22, [180, 10.65625], 'COLLIDE']
[22, [180, 10.671875], 'ESCAPE']
[22, [180, 10.6640625], 'COLLIDE']
[22, [180, 10.66796875], 'ESCAPE']
