0.000000 1.414062
10.000000 1.417969
20.000000 1.441406
30.000000 1.468750
40.000000 1.511719
45.000000 1.535156
50.000000 1.570312
60.000000 1.628906
70.000000 1.683594
80.000000 1.730469
90.000000 1.738281
100.000000 1.753906
110.000000 1.792969
120.000000 1.886719
130.000000 2.003906
135.000000 2.085938
140.000000 2.160156
150.000000 2.347656
160.000000 2.558594
170.000000 2.824219
180.000000 3.121094
