0.000000 2.050781
10.000000 2.210938
20.000000 2.234375
30.000000 2.257812
40.000000 2.277344
45.000000 2.296875
50.000000 2.316406
60.000000 2.363281
70.000000 2.421875
80.000000 2.500000
90.000000 2.585938
100.000000 2.699219
110.000000 2.851562
120.000000 3.085938
130.000000 3.441406
135.000000 3.679688
140.000000 3.988281
150.000000 4.910156
160.000000 6.789062
170.000000 10.570312
180.000000 10.667969
