pygame 2.1.2 (SDL 2.0.20, Python 3.10.6)
Hello from the pygame community. https://www.pygame.org/contribute.html
[0, [0, 0.0], 'COLLIDE']
[0, [0, 64.0], 'ESCAPE']
[1, [0, 32.0], 'COLLIDE']
[1, [0, 48.0], 'ESCAPE']
[1, [0, 40.0], 'ESCAPE']
[1, [0, 36.0], 'ESCAPE']
[1, [0, 34.0], 'ESCAPE']
[1, [0, 33.0], 'COLLIDE']
[1, [0, 33.5], 'COLLIDE']
[1, [0, 33.75], 'ESCAPE']
[1, [0, 33.625], 'COLLIDE']
[1, [0, 33.6875], 'COLLIDE']
[1, [0, 33.71875], 'ESCAPE']
[1, [0, 33.703125], 'ESCAPE']
[1, [0, 33.6953125], 'COLLIDE']
[1, [0, 33.69921875], 'ESCAPE']
[2, [10.0, 32.0], 'ESCAPE']
[2, [10.0, 16.0], 'COLLIDE']
[2, [10.0, 24.0], 'COLLIDE']
[2, [10.0, 28.0], 'COLLIDE']
[2, [10.0, 30.0], 'COLLIDE']
[2, [10.0, 31.0], 'COLLIDE']
[2, [10.0, 31.5], 'COLLIDE']
[2, [10.0, 31.75], 'COLLIDE']
[2, [10.0, 31.875], 'ESCAPE']
[2, [10.0, 31.8125], 'ESCAPE']
[2, [10.0, 31.78125], 'COLLIDE']
[2, [10.0, 31.796875], 'COLLIDE']
[2, [10.0, 31.8046875], 'ESCAPE']
[2, [10.0, 31.80078125], 'ESCAPE']
[3, [20.0, 32.0], 'ESCAPE']
[3, [20.0, 16.0], 'COLLIDE']
[3, [20.0, 24.0], 'COLLIDE']
[3, [20.0, 28.0], 'COLLIDE']
[3, [20.0, 30.0], 'COLLIDE']
[3, [20.0, 31.0], 'ESCAPE']
[3, [20.0, 30.5], 'ESCAPE']
[3, [20.0, 30.25], 'ESCAPE']
[3, [20.0, 30.125], 'COLLIDE']
[3, [20.0, 30.1875], 'ESCAPE']
[3, [20.0, 30.15625], 'COLLIDE']
[3, [20.0, 30.171875], 'ESCAPE']
[3, [20.0, 30.1640625], 'ESCAPE']
[3, [20.0, 30.16015625], 'ESCAPE']
[4, [30.0, 32.0], 'ESCAPE']
[4, [30.0, 16.0], 'COLLIDE']
[4, [30.0, 24.0], 'COLLIDE']
[4, [30.0, 28.0], 'COLLIDE']
[4, [30.0, 30.0], 'ESCAPE']
[4, [30.0, 29.0], 'COLLIDE']
[4, [30.0, 29.5], 'ESCAPE']
[4, [30.0, 29.25], 'COLLIDE']
[4, [30.0, 29.375], 'ESCAPE']
[4, [30.0, 29.3125], 'ESCAPE']
[4, [30.0, 29.28125], 'ESCAPE']
[4, [30.0, 29.265625], 'ESCAPE']
[4, [30.0, 29.2578125], 'COLLIDE']
[4, [30.0, 29.26171875], 'COLLIDE']
[5, [40, 32.0], 'ESCAPE']
[5, [40, 16.0], 'COLLIDE']
[5, [40, 24.0], 'COLLIDE']
[5, [40, 28.0], 'COLLIDE']
[5, [40, 30.0], 'ESCAPE']
[5, [40, 29.0], 'ESCAPE']
[5, [40, 28.5], 'ESCAPE']
[5, [40, 28.25], 'COLLIDE']
[5, [40, 28.375], 'COLLIDE']
[5, [40, 28.4375], 'ESCAPE']
[5, [40, 28.40625], 'ESCAPE']
[5, [40, 28.390625], 'ESCAPE']
[5, [40, 28.3828125], 'COLLIDE']
[5, [40, 28.38671875], 'COLLIDE']
[6, [45, 32.0], 'ESCAPE']
[6, [45, 16.0], 'COLLIDE']
[6, [45, 24.0], 'COLLIDE']
[6, [45, 28.0], 'ESCAPE']
[6, [45, 26.0], 'COLLIDE']
[6, [45, 27.0], 'COLLIDE']
[6, [45, 27.5], 'COLLIDE']
[6, [45, 27.75], 'COLLIDE']
[6, [45, 27.875], 'COLLIDE']
[6, [45, 27.9375], 'COLLIDE']
[6, [45, 27.96875], 'COLLIDE']
[6, [45, 27.984375], 'ESCAPE']
[6, [45, 27.9765625], 'COLLIDE']
[6, [45, 27.98046875], 'ESCAPE']
[7, [50, 32.0], 'ESCAPE']
[7, [50, 16.0], 'COLLIDE']
[7, [50, 24.0], 'COLLIDE']
[7, [50, 28.0], 'COLLIDE']
[7, [50, 30.0], 'ESCAPE']
[7, [50, 29.0], 'ESCAPE']
[7, [50, 28.5], 'ESCAPE']
[7, [50, 28.25], 'ESCAPE']
[7, [50, 28.125], 'ESCAPE']
[7, [50, 28.0625], 'ESCAPE']
[7, [50, 28.03125], 'ESCAPE']
[7, [50, 28.015625], 'ESCAPE']
[7, [50, 28.0078125], 'COLLIDE']
[7, [50, 28.01171875], 'ESCAPE']
[8, [60, 32.0], 'ESCAPE']
[8, [60, 16.0], 'COLLIDE']
[8, [60, 24.0], 'COLLIDE']
[8, [60, 28.0], 'ESCAPE']
[8, [60, 26.0], 'COLLIDE']
[8, [60, 27.0], 'COLLIDE']
[8, [60, 27.5], 'ESCAPE']
[8, [60, 27.25], 'COLLIDE']
[8, [60, 27.375], 'COLLIDE']
[8, [60, 27.4375], 'ESCAPE']
[8, [60, 27.40625], 'COLLIDE']
[8, [60, 27.421875], 'ESCAPE']
[8, [60, 27.4140625], 'ESCAPE']
[8, [60, 27.41015625], 'COLLIDE']
[9, [70, 32.0], 'ESCAPE']
[9, [70, 16.0], 'COLLIDE']
[9, [70, 24.0], 'COLLIDE']
[9, [70, 28.0], 'ESCAPE']
[9, [70, 26.0], 'COLLIDE']
[9, [70, 27.0], 'COLLIDE']
[9, [70, 27.5], 'ESCAPE']
[9, [70, 27.25], 'COLLIDE']
[9, [70, 27.375], 'COLLIDE']
[9, [70, 27.4375], 'COLLIDE']
[9, [70, 27.46875], 'COLLIDE']
[9, [70, 27.484375], 'ESCAPE']
[9, [70, 27.4765625], 'ESCAPE']
[9, [70, 27.47265625], 'ESCAPE']
[10, [80, 32.0], 'ESCAPE']
[10, [80, 16.0], 'COLLIDE']
[10, [80, 24.0], 'COLLIDE']
[10, [80, 28.0], 'ESCAPE']
[10, [80, 26.0], 'COLLIDE']
[10, [80, 27.0], 'COLLIDE']
[10, [80, 27.5], 'COLLIDE']
[10, [80, 27.75], 'ESCAPE']
[10, [80, 27.625], 'ESCAPE']
[10, [80, 27.5625], 'ESCAPE']
[10, [80, 27.53125], 'ESCAPE']
[10, [80, 27.515625], 'ESCAPE']
[10, [80, 27.5078125], 'COLLIDE']
[10, [80, 27.51171875], 'ESCAPE']
[11, [90, 32.0], 'ESCAPE']
[11, [90, 16.0], 'COLLIDE']
[11, [90, 24.0], 'COLLIDE']
[11, [90, 28.0], 'ESCAPE']
[11, [90, 26.0], 'COLLIDE']
[11, [90, 27.0], 'COLLIDE']
[11, [90, 27.5], 'COLLIDE']
[11, [90, 27.75], 'ESCAPE']
[11, [90, 27.625], 'ESCAPE']
[11, [90, 27.5625], 'ESCAPE']
[11, [90, 27.53125], 'COLLIDE']
[11, [90, 27.546875], 'ESCAPE']
[11, [90, 27.5390625], 'ESCAPE']
[11, [90, 27.53515625], 'COLLIDE']
[12, [100, 32.0], 'ESCAPE']
[12, [100, 16.0], 'COLLIDE']
[12, [100, 24.0], 'COLLIDE']
[12, [100, 28.0], 'ESCAPE']
[12, [100, 26.0], 'COLLIDE']
[12, [100, 27.0], 'COLLIDE']
[12, [100, 27.5], 'COLLIDE']
[12, [100, 27.75], 'ESCAPE']
[12, [100, 27.625], 'ESCAPE']
[12, [100, 27.5625], 'COLLIDE']
[12, [100, 27.59375], 'ESCAPE']
[12, [100, 27.578125], 'ESCAPE']
[12, [100, 27.5703125], 'ESCAPE']
[12, [100, 27.56640625], 'COLLIDE']
[13, [110, 32.0], 'ESCAPE']
[13, [110, 16.0], 'COLLIDE']
[13, [110, 24.0], 'COLLIDE']
[13, [110, 28.0], 'ESCAPE']
[13, [110, 26.0], 'COLLIDE']
[13, [110, 27.0], 'COLLIDE']
[13, [110, 27.5], 'COLLIDE']
[13, [110, 27.75], 'ESCAPE']
[13, [110, 27.625], 'COLLIDE']
[13, [110, 27.6875], 'ESCAPE']
[13, [110, 27.65625], 'ESCAPE']
[13, [110, 27.640625], 'COLLIDE']
[13, [110, 27.6484375], 'ESCAPE']
[13, [110, 27.64453125], 'COLLIDE']
[14, [120, 32.0], 'ESCAPE']
[14, [120, 16.0], 'COLLIDE']
[14, [120, 24.0], 'COLLIDE']
[14, [120, 28.0], 'COLLIDE']
[14, [120, 30.0], 'ESCAPE']
[14, [120, 29.0], 'ESCAPE']
[14, [120, 28.5], 'ESCAPE']
[14, [120, 28.25], 'ESCAPE']
[14, [120, 28.125], 'ESCAPE']
[14, [120, 28.0625], 'ESCAPE']
[14, [120, 28.03125], 'ESCAPE']
[14, [120, 28.015625], 'ESCAPE']
[14, [120, 28.0078125], 'COLLIDE']
[14, [120, 28.01171875], 'COLLIDE']
[15, [130, 32.0], 'ESCAPE']
[15, [130, 16.0], 'COLLIDE']
[15, [130, 24.0], 'COLLIDE']
[15, [130, 28.0], 'COLLIDE']
[15, [130, 30.0], 'ESCAPE']
[15, [130, 29.0], 'ESCAPE']
[15, [130, 28.5], 'ESCAPE']
[15, [130, 28.25], 'COLLIDE']
[15, [130, 28.375], 'COLLIDE']
[15, [130, 28.4375], 'COLLIDE']
[15, [130, 28.46875], 'ESCAPE']
[15, [130, 28.453125], 'COLLIDE']
[15, [130, 28.4609375], 'ESCAPE']
[15, [130, 28.45703125], 'ESCAPE']
[16, [135, 32.0], 'ESCAPE']
[16, [135, 16.0], 'COLLIDE']
[16, [135, 24.0], 'COLLIDE']
[16, [135, 28.0], 'COLLIDE']
[16, [135, 30.0], 'ESCAPE']
[16, [135, 29.0], 'COLLIDE']
[16, [135, 29.5], 'ESCAPE']
[16, [135, 29.25], 'ESCAPE']
[16, [135, 29.125], 'ESCAPE']
[16, [135, 29.0625], 'ESCAPE']
[16, [135, 29.03125], 'ESCAPE']
[16, [135, 29.015625], 'COLLIDE']
[16, [135, 29.0234375], 'COLLIDE']
[16, [135, 29.02734375], 'COLLIDE']
[17, [140, 32.0], 'ESCAPE']
[17, [140, 16.0], 'COLLIDE']
[17, [140, 24.0], 'COLLIDE']
[17, [140, 28.0], 'COLLIDE']
[17, [140, 30.0], 'ESCAPE']
[17, [140, 29.0], 'COLLIDE']
[17, [140, 29.5], 'ESCAPE']
[17, [140, 29.25], 'COLLIDE']
[17, [140, 29.375], 'COLLIDE']
[17, [140, 29.4375], 'ESCAPE']
[17, [140, 29.40625], 'COLLIDE']
[17, [140, 29.421875], 'ESCAPE']
[17, [140, 29.4140625], 'ESCAPE']
[17, [140, 29.41015625], 'COLLIDE']
[18, [150, 32.0], 'ESCAPE']
[18, [150, 16.0], 'COLLIDE']
[18, [150, 24.0], 'COLLIDE']
[18, [150, 28.0], 'COLLIDE']
[18, [150, 30.0], 'COLLIDE']
[18, [150, 31.0], 'ESCAPE']
[18, [150, 30.5], 'ESCAPE']
[18, [150, 30.25], 'COLLIDE']
[18, [150, 30.375], 'COLLIDE']
[18, [150, 30.4375], 'COLLIDE']
[18, [150, 30.46875], 'COLLIDE']
[18, [150, 30.484375], 'ESCAPE']
[18, [150, 30.4765625], 'ESCAPE']
[18, [150, 30.47265625], 'ESCAPE']
[19, [160, 32.0], 'COLLIDE']
[19, [160, 48.0], 'ESCAPE']
[19, [160, 40.0], 'ESCAPE']
[19, [160, 36.0], 'ESCAPE']
[19, [160, 34.0], 'ESCAPE']
[19, [160, 33.0], 'ESCAPE']
[19, [160, 32.5], 'ESCAPE']
[19, [160, 32.25], 'ESCAPE']
[19, [160, 32.125], 'COLLIDE']
[19, [160, 32.1875], 'COLLIDE']
[19, [160, 32.21875], 'COLLIDE']
[19, [160, 32.234375], 'COLLIDE']
[19, [160, 32.2421875], 'COLLIDE']
[19, [160, 32.24609375], 'ESCAPE']
[20, [170, 32.0], 'COLLIDE']
[20, [170, 48.0], 'ESCAPE']
[20, [170, 40.0], 'ESCAPE']
[20, [170, 36.0], 'ESCAPE']
[20, [170, 34.0], 'COLLIDE']
[20, [170, 35.0], 'ESCAPE']
[20, [170, 34.5], 'ESCAPE']
[20, [170, 34.25], 'ESCAPE']
[20, [170, 34.125], 'COLLIDE']
[20, [170, 34.1875], 'ESCAPE']
[20, [170, 34.15625], 'ESCAPE']
[20, [170, 34.140625], 'ESCAPE']
[20, [170, 34.1328125], 'ESCAPE']
[20, [170, 34.12890625], 'ESCAPE']
[21, [180, 32.0], 'COLLIDE']
[21, [180, 48.0], 'ESCAPE']
[21, [180, 40.0], 'ESCAPE']
[21, [180, 36.0], 'COLLIDE']
[21, [180, 38.0], 'ESCAPE']
[21, [180, 37.0], 'ESCAPE']
[21, [180, 36.5], 'COLLIDE']
[21, [180, 36.75], 'ESCAPE']
[21, [180, 36.625], 'ESCAPE']
[21, [180, 36.5625], 'ESCAPE']
[21, [180, 36.53125], 'ESCAPE']
[21, [180, 36.515625], 'ESCAPE']
[21, [180, 36.5078125], 'ESCAPE']
[21, [180, 36.50390625], 'ESCAPE']
[22, [180, 32.0], 'COLLIDE']
[22, [180, 48.0], 'ESCAPE']
[22, [180, 40.0], 'ESCAPE']
[22, [180, 36.0], 'COLLIDE']
[22, [180, 38.0], 'ESCAPE']
[22, [180, 37.0], 'ESCAPE']
[22, [180, 36.5], 'COLLIDE']
[22, [180, 36.75], 'ESCAPE']
[22, [180, 36.625], 'ESCAPE']
[22, [180, 36.5625], 'ESCAPE']
[22, [180, 36.53125], 'ESCAPE']
[22, [180, 36.515625], 'ESCAPE']
[22, [180, 36.5078125], 'ESCAPE']
[22, [180, 36.50390625], 'ESCAPE']
