0.000000 3.222656
10.000000 3.156250
20.000000 3.109375
30.000000 3.164062
40.000000 3.148438
45.000000 3.164062
50.000000 3.156250
60.000000 3.117188
70.000000 3.066406
80.000000 2.992188
90.000000 2.953125
100.000000 2.960938
110.000000 2.972656
120.000000 3.007812
130.000000 3.105469
135.000000 3.136719
140.000000 3.160156
150.000000 3.234375
160.000000 3.316406
170.000000 3.375000
180.000000 3.425781
