<?xml version="1.0" encoding="UTF-8" standalone="no"?>
<svg xmlns="http://www.w3.org/2000/svg" version="1.1" viewBox="0 0 171 74">
   <polyline fill="none" points="130,36 140,36" stroke="rgb(0, 0, 0)" stroke-linecap="square" stroke-width="3.0"/>
   <polyline fill="none" points="140,6 160,6" stroke="rgb(0, 0, 0)" stroke-linecap="square" stroke-width="3.0"/>
   <text fill="rgb(0, 0, 0)" font-family="SansSerif" font-size="12" x="10.0" y="21.0">X</text>
   <text fill="rgb(0, 0, 0)" font-family="SansSerif" font-size="12" x="9.0" y="62.0">Y</text>
   <text fill="rgb(0, 0, 0)" font-family="SansSerif" font-size="12" x="136.0" y="23.0">X+Y</text>
   <polyline fill="none" points="30,16 70,16 72,16" stroke="rgb(0, 0, 0)" stroke-linecap="square" stroke-width="3.0"/>
   <polyline fill="none" points="30,56 70,56 72,56" stroke="rgb(0, 0, 0)" stroke-linecap="square" stroke-width="3.0"/>
   <path d=" M120.0,36.0 C100.0,11.0 100.0,11.0 70.0,11.0 C83.0,36.0 83.0,36.0 70.0,61.0 C100.0,61.0 100.0,61.0 120.0,36.0 Z" fill="none" stroke="rgb(0, 0, 0)" stroke-linecap="square" stroke-width="2.0"/>
   <ellipse cx="125.0" cy="36.0" fill="none" rx="4.5" ry="4.5" stroke="rgb(0, 0, 0)" stroke-width="2.0"/>
</svg>
