<?xml version="1.0" encoding="UTF-8" standalone="no"?>
<svg width="841.89px" height="595.275px" viewBox="0 0 841.89 595.275"
 xmlns="http://www.w3.org/2000/svg" xmlns:xlink="http://www.w3.org/1999/xlink" version="1.2" baseProfile="tiny">
<title>Title</title>
<desc>Generated by MuseScore 2.3.2</desc>
<polyline class="StaffLines" fill="none" stroke="#000000" stroke-width="0.45" stroke-linejoin="bevel" points="28.3465,122.99 813.544,122.99"/>
<polyline class="StaffLines" fill="none" stroke="#000000" stroke-width="0.45" stroke-linejoin="bevel" points="28.3465,128.557 813.544,128.557"/>
<polyline class="StaffLines" fill="none" stroke="#000000" stroke-width="0.45" stroke-linejoin="bevel" points="28.3465,134.124 813.544,134.124"/>
<polyline class="StaffLines" fill="none" stroke="#000000" stroke-width="0.45" stroke-linejoin="bevel" points="28.3465,139.691 813.544,139.691"/>
<polyline class="StaffLines" fill="none" stroke="#000000" stroke-width="0.45" stroke-linejoin="bevel" points="28.3465,145.259 813.544,145.259"/>
<polyline class="BarLine" fill="none" stroke="#000000" stroke-width="0.89" stroke-linejoin="bevel" points="808.088,122.99 808.088,145.259"/>
<polyline class="BarLine" fill="none" stroke="#000000" stroke-width="2.78" stroke-linejoin="bevel" points="812.152,122.99 812.152,145.259"/>
<polyline class="BarLine" fill="none" stroke="#000000" stroke-width="0.89" stroke-linejoin="bevel" points="662.131,122.99 662.131,145.259"/>
<path class="BarLine" transform="matrix(1.11345,0,0,1.11345,506.226,134.124)" d="M0.335938,-1.70313 C0.111979,-1.92188 0,-2.1875 0,-2.5 C0,-2.8125 0.111979,-3.08073 0.335938,-3.30469 C0.559896,-3.52865 0.828125,-3.64063 1.14063,-3.64063 C1.45313,-3.64063 1.71875,-3.52865 1.9375,-3.30469 C2.15625,-3.08073 2.26563,-2.8125 2.26563,-2.5 C2.26563,-2.1875 2.15625,-1.92188 1.9375,-1.70313 C1.71875,-1.48438 1.45313,-1.375 1.14063,-1.375 C0.828125,-1.375 0.559896,-1.48438 0.335938,-1.70313"/>
<path class="BarLine" transform="matrix(1.11345,0,0,1.11345,506.226,139.691)" d="M0.335938,-1.70313 C0.111979,-1.92188 0,-2.1875 0,-2.5 C0,-2.8125 0.111979,-3.08073 0.335938,-3.30469 C0.559896,-3.52865 0.828125,-3.64063 1.14063,-3.64063 C1.45313,-3.64063 1.71875,-3.52865 1.9375,-3.30469 C2.15625,-3.08073 2.26563,-2.8125 2.26563,-2.5 C2.26563,-2.1875 2.15625,-1.92188 1.9375,-1.70313 C1.71875,-1.48438 1.45313,-1.375 1.14063,-1.375 C0.828125,-1.375 0.559896,-1.48438 0.335938,-1.70313"/>
<polyline class="BarLine" fill="none" stroke="#000000" stroke-width="0.89" stroke-linejoin="bevel" points="511.421,122.99 511.421,145.259"/>
<polyline class="BarLine" fill="none" stroke="#000000" stroke-width="2.78" stroke-linejoin="bevel" points="515.485,122.99 515.485,145.259"/>
<path class="BarLine" transform="matrix(1.11345,0,0,1.11345,358.891,134.124)" d="M0.335938,-1.70313 C0.111979,-1.92188 0,-2.1875 0,-2.5 C0,-2.8125 0.111979,-3.08073 0.335938,-3.30469 C0.559896,-3.52865 0.828125,-3.64063 1.14063,-3.64063 C1.45313,-3.64063 1.71875,-3.52865 1.9375,-3.30469 C2.15625,-3.08073 2.26563,-2.8125 2.26563,-2.5 C2.26563,-2.1875 2.15625,-1.92188 1.9375,-1.70313 C1.71875,-1.48438 1.45313,-1.375 1.14063,-1.375 C0.828125,-1.375 0.559896,-1.48438 0.335938,-1.70313"/>
<path class="BarLine" transform="matrix(1.11345,0,0,1.11345,358.891,139.691)" d="M0.335938,-1.70313 C0.111979,-1.92188 0,-2.1875 0,-2.5 C0,-2.8125 0.111979,-3.08073 0.335938,-3.30469 C0.559896,-3.52865 0.828125,-3.64063 1.14063,-3.64063 C1.45313,-3.64063 1.71875,-3.52865 1.9375,-3.30469 C2.15625,-3.08073 2.26563,-2.8125 2.26563,-2.5 C2.26563,-2.1875 2.15625,-1.92188 1.9375,-1.70313 C1.71875,-1.48438 1.45313,-1.375 1.14063,-1.375 C0.828125,-1.375 0.559896,-1.48438 0.335938,-1.70313"/>
<polyline class="BarLine" fill="none" stroke="#000000" stroke-width="0.89" stroke-linejoin="bevel" points="356.222,122.99 356.222,145.259"/>
<polyline class="BarLine" fill="none" stroke="#000000" stroke-width="2.78" stroke-linejoin="bevel" points="352.158,122.99 352.158,145.259"/>
<polyline class="BarLine" fill="none" stroke="#000000" stroke-width="0.89" stroke-linejoin="bevel" points="205.254,122.99 205.254,145.259"/>
<polyline class="LedgerLine" fill="none" stroke="#000000" stroke-width="0.89" stroke-linecap="square" stroke-linejoin="bevel" points="668.144,150.826 682.51,150.826"/>
<path class="Note" transform="matrix(1.11345,0,0,1.11345,669.814,150.826)" d="M4.29688,-2.25 C3.82813,-2.25 3.48958,-2.08854 3.28125,-1.76563 C3.05208,-1.45313 2.9375,-1.02604 2.9375,-0.484375 C2.9375,0.130208 3.09896,0.65625 3.42188,1.09375 C3.74479,1.52083 4.10417,1.82292 4.5,2 C4.84375,2.16667 5.21354,2.25 5.60938,2.25 C6.06771,2.25 6.41146,2.08854 6.64063,1.76563 C6.85938,1.43229 6.96875,1.00521 6.96875,0.484375 C6.96875,-0.130208 6.80729,-0.65625 6.48438,-1.09375 C6.16146,-1.51042 5.8125,-1.8125 5.4375,-2 C5.05208,-2.16667 4.67188,-2.25 4.29688,-2.25 M4.96875,-2.75 C6.375,-2.75 7.54688,-2.47917 8.48438,-1.9375 C9.43229,-1.38542 9.90625,-0.739583 9.90625,0 C9.90625,0.791667 9.41667,1.44271 8.4375,1.95313 C7.45833,2.48438 6.30208,2.75 4.96875,2.75 C3.58333,2.75 2.41146,2.47917 1.45313,1.9375 C0.484375,1.38542 0,0.739583 0,0 C0,-0.791667 0.494792,-1.44271 1.48438,-1.95313 C2.46354,-2.48438 3.625,-2.75 4.96875,-2.75"/>
<path class="Note" transform="matrix(1.11345,0,0,1.11345,523.857,131.34)" d="M4.29688,-2.25 C3.82813,-2.25 3.48958,-2.08854 3.28125,-1.76563 C3.05208,-1.45313 2.9375,-1.02604 2.9375,-0.484375 C2.9375,0.130208 3.09896,0.65625 3.42188,1.09375 C3.74479,1.52083 4.10417,1.82292 4.5,2 C4.84375,2.16667 5.21354,2.25 5.60938,2.25 C6.06771,2.25 6.41146,2.08854 6.64063,1.76563 C6.85938,1.43229 6.96875,1.00521 6.96875,0.484375 C6.96875,-0.130208 6.80729,-0.65625 6.48438,-1.09375 C6.16146,-1.51042 5.8125,-1.8125 5.4375,-2 C5.05208,-2.16667 4.67188,-2.25 4.29688,-2.25 M4.96875,-2.75 C6.375,-2.75 7.54688,-2.47917 8.48438,-1.9375 C9.43229,-1.38542 9.90625,-0.739583 9.90625,0 C9.90625,0.791667 9.41667,1.44271 8.4375,1.95313 C7.45833,2.48438 6.30208,2.75 4.96875,2.75 C3.58333,2.75 2.41146,2.47917 1.45313,1.9375 C0.484375,1.38542 0,0.739583 0,0 C0,-0.791667 0.494792,-1.44271 1.48438,-1.95313 C2.46354,-2.48438 3.625,-2.75 4.96875,-2.75"/>
<path class="Note" transform="matrix(1.11345,0,0,1.11345,368.397,134.124)" d="M4.29688,-2.25 C3.82813,-2.25 3.48958,-2.08854 3.28125,-1.76563 C3.05208,-1.45313 2.9375,-1.02604 2.9375,-0.484375 C2.9375,0.130208 3.09896,0.65625 3.42188,1.09375 C3.74479,1.52083 4.10417,1.82292 4.5,2 C4.84375,2.16667 5.21354,2.25 5.60938,2.25 C6.06771,2.25 6.41146,2.08854 6.64063,1.76563 C6.85938,1.43229 6.96875,1.00521 6.96875,0.484375 C6.96875,-0.130208 6.80729,-0.65625 6.48438,-1.09375 C6.16146,-1.51042 5.8125,-1.8125 5.4375,-2 C5.05208,-2.16667 4.67188,-2.25 4.29688,-2.25 M4.96875,-2.75 C6.375,-2.75 7.54688,-2.47917 8.48438,-1.9375 C9.43229,-1.38542 9.90625,-0.739583 9.90625,0 C9.90625,0.791667 9.41667,1.44271 8.4375,1.95313 C7.45833,2.48438 6.30208,2.75 4.96875,2.75 C3.58333,2.75 2.41146,2.47917 1.45313,1.9375 C0.484375,1.38542 0,0.739583 0,0 C0,-0.791667 0.494792,-1.44271 1.48438,-1.95313 C2.46354,-2.48438 3.625,-2.75 4.96875,-2.75"/>
<path class="Note" transform="matrix(1.11345,0,0,1.11345,212.937,136.908)" d="M4.29688,-2.25 C3.82813,-2.25 3.48958,-2.08854 3.28125,-1.76563 C3.05208,-1.45313 2.9375,-1.02604 2.9375,-0.484375 C2.9375,0.130208 3.09896,0.65625 3.42188,1.09375 C3.74479,1.52083 4.10417,1.82292 4.5,2 C4.84375,2.16667 5.21354,2.25 5.60938,2.25 C6.06771,2.25 6.41146,2.08854 6.64063,1.76563 C6.85938,1.43229 6.96875,1.00521 6.96875,0.484375 C6.96875,-0.130208 6.80729,-0.65625 6.48438,-1.09375 C6.16146,-1.51042 5.8125,-1.8125 5.4375,-2 C5.05208,-2.16667 4.67188,-2.25 4.29688,-2.25 M4.96875,-2.75 C6.375,-2.75 7.54688,-2.47917 8.48438,-1.9375 C9.43229,-1.38542 9.90625,-0.739583 9.90625,0 C9.90625,0.791667 9.41667,1.44271 8.4375,1.95313 C7.45833,2.48438 6.30208,2.75 4.96875,2.75 C3.58333,2.75 2.41146,2.47917 1.45313,1.9375 C0.484375,1.38542 0,0.739583 0,0 C0,-0.791667 0.494792,-1.44271 1.48438,-1.95313 C2.46354,-2.48438 3.625,-2.75 4.96875,-2.75"/>
<path class="Note" transform="matrix(1.11345,0,0,1.11345,70.1982,139.691)" d="M4.29688,-2.25 C3.82813,-2.25 3.48958,-2.08854 3.28125,-1.76563 C3.05208,-1.45313 2.9375,-1.02604 2.9375,-0.484375 C2.9375,0.130208 3.09896,0.65625 3.42188,1.09375 C3.74479,1.52083 4.10417,1.82292 4.5,2 C4.84375,2.16667 5.21354,2.25 5.60938,2.25 C6.06771,2.25 6.41146,2.08854 6.64063,1.76563 C6.85938,1.43229 6.96875,1.00521 6.96875,0.484375 C6.96875,-0.130208 6.80729,-0.65625 6.48438,-1.09375 C6.16146,-1.51042 5.8125,-1.8125 5.4375,-2 C5.05208,-2.16667 4.67188,-2.25 4.29688,-2.25 M4.96875,-2.75 C6.375,-2.75 7.54688,-2.47917 8.48438,-1.9375 C9.43229,-1.38542 9.90625,-0.739583 9.90625,0 C9.90625,0.791667 9.41667,1.44271 8.4375,1.95313 C7.45833,2.48438 6.30208,2.75 4.96875,2.75 C3.58333,2.75 2.41146,2.47917 1.45313,1.9375 C0.484375,1.38542 0,0.739583 0,0 C0,-0.791667 0.494792,-1.44271 1.48438,-1.95313 C2.46354,-2.48438 3.625,-2.75 4.96875,-2.75"/>
<path class="Clef" transform="matrix(1.11345,0,0,1.11345,31.9095,139.691)" d="M7.34375,-5.125 C7.34375,-5.125 7.38542,-5.125 7.46875,-5.125 C7.52083,-5.13542 7.5625,-5.14063 7.59375,-5.14063 C9.05208,-5.14063 10.25,-4.625 11.1875,-3.59375 C12.125,-2.58333 12.5938,-1.40104 12.5938,-0.046875 C12.5938,1.64063 11.901,3.01042 10.5156,4.0625 C10.151,4.35417 9.67188,4.58854 9.07813,4.76563 C9.15104,5.60938 9.1875,6.29167 9.1875,6.8125 C9.1875,6.91667 9.17188,7.29688 9.14063,7.95313 C9.08854,9.16146 8.67188,10.2083 7.89063,11.0938 C7.14063,11.9688 6.20313,12.4063 5.07813,12.4063 C4.02604,12.4063 3.13021,12.0365 2.39063,11.2969 C1.64063,10.5365 1.26563,9.625 1.26563,8.5625 C1.26563,8 1.48438,7.52083 1.92188,7.125 C2.35938,6.73958 2.86979,6.54688 3.45313,6.54688 C3.97396,6.54688 4.41146,6.75 4.76563,7.15625 C5.13021,7.53125 5.3125,8 5.3125,8.5625 C5.3125,9.0625 5.13021,9.49479 4.76563,9.85938 C4.40104,10.224 3.96354,10.4063 3.45313,10.4063 C3.24479,10.4063 3.04688,10.3698 2.85938,10.2969 C3.43229,11.1406 4.19271,11.5625 5.14063,11.5625 C6.03646,11.5625 6.77083,11.1979 7.34375,10.4688 C7.94792,9.71875 8.27604,8.83854 8.32813,7.82813 C8.34896,7.20313 8.35938,6.84896 8.35938,6.76563 C8.35938,6.03646 8.33333,5.4375 8.28125,4.96875 C7.63542,5.07292 7.05729,5.125 6.54688,5.125 C4.73438,5.125 3.19271,4.40625 1.92188,2.96875 C0.671875,1.52083 0.046875,-0.197917 0.046875,-2.1875 C0.046875,-2.60417 0.0833333,-3.02604 0.15625,-3.45313 C0.239583,-3.80729 0.338542,-4.19271 0.453125,-4.60938 C0.515625,-4.84896 0.692708,-5.22917 0.984375,-5.75 C1.08854,-5.90625 1.20573,-6.10156 1.33594,-6.33594 C1.46615,-6.57031 1.55729,-6.72396 1.60938,-6.79688 C1.73438,-7.05729 1.98438,-7.41146 2.35938,-7.85938 C2.46354,-7.97396 2.57292,-8.10156 2.6875,-8.24219 C2.80208,-8.38281 2.89844,-8.5 2.97656,-8.59375 C3.05469,-8.6875 3.11198,-8.76042 3.14844,-8.8125 C3.1849,-8.86458 3.47917,-9.20833 4.03125,-9.84375 C4.15625,-9.97917 4.28125,-10.1198 4.40625,-10.2656 C4.53125,-10.4115 4.63281,-10.5286 4.71094,-10.6172 C4.78906,-10.7057 4.84896,-10.7656 4.89063,-10.7969 C4.42188,-12.349 4.125,-13.5885 4,-14.5156 C3.91667,-15.2552 3.875,-16.2708 3.875,-17.5625 C3.875,-18.6979 4.13542,-19.7604 4.65625,-20.75 C5.15625,-21.7708 5.86458,-22.6094 6.78125,-23.2656 C6.83333,-23.3073 6.89583,-23.3281 6.96875,-23.3281 C7.0625,-23.3281 7.13021,-23.3073 7.17188,-23.2656 C7.86979,-22.4219 8.47396,-21.3229 8.98438,-19.9688 C9.50521,-18.6146 9.76563,-17.3802 9.76563,-16.2656 C9.76563,-15.0156 9.46875,-13.8438 8.875,-12.75 C8.19792,-11.5938 7.32292,-10.3958 6.25,-9.15625 C6.52083,-8.30208 6.88542,-6.95833 7.34375,-5.125 M9,3.96875 C9.67708,3.71875 10.2083,3.29688 10.5938,2.70313 C11.0104,2.13021 11.2188,1.48438 11.2188,0.765625 C11.2188,-0.161458 10.9063,-0.984375 10.2813,-1.70313 C9.63542,-2.44271 8.81771,-2.85938 7.82813,-2.95313 C8.39063,-0.203125 8.78125,2.10417 9,3.96875 M1.45313,-0.546875 C1.45313,0.744792 1.97396,1.88021 3.01563,2.85938 C4.07813,3.80729 5.27604,4.28125 6.60938,4.28125 C7.15104,4.28125 7.68229,4.23958 8.20313,4.15625 C7.99479,2.17708 7.58333,-0.192708 6.96875,-2.95313 C6.22917,-2.86979 5.64063,-2.60938 5.20313,-2.17188 C4.76563,-1.71354 4.54688,-1.19792 4.54688,-0.625 C4.54688,0.364583 5.07813,1.16667 6.14063,1.78125 C6.22396,1.875 6.26563,1.97396 6.26563,2.07813 C6.26563,2.18229 6.22396,2.27604 6.14063,2.35938 C6.05729,2.45313 5.95833,2.5 5.84375,2.5 C5.83333,2.5 5.77604,2.48958 5.67188,2.46875 C4.92188,2.0625 4.34896,1.54167 3.95313,0.90625 C3.56771,0.21875 3.375,-0.46875 3.375,-1.15625 C3.375,-2.05208 3.65625,-2.86458 4.21875,-3.59375 C4.80208,-4.32292 5.5625,-4.79167 6.5,-5 C6.13542,-6.45833 5.83854,-7.59896 5.60938,-8.42188 C5.40104,-8.18229 5.15104,-7.89844 4.85938,-7.57031 C4.56771,-7.24219 4.39583,-7.04167 4.34375,-6.96875 C3.875,-6.36458 3.51563,-5.89063 3.26563,-5.54688 C2.81771,-4.93229 2.48958,-4.40625 2.28125,-3.96875 C2.0625,-3.46875 1.86979,-2.92708 1.70313,-2.34375 C1.53646,-1.78125 1.45313,-1.18229 1.45313,-0.546875 M7.96875,-20.4063 C6.98958,-19.9271 6.22396,-19.2396 5.67188,-18.3438 C5.09896,-17.4167 4.8125,-16.4219 4.8125,-15.3594 C4.8125,-14.4219 5.04688,-13.1563 5.51563,-11.5625 C6.45313,-12.6979 7.15625,-13.7448 7.625,-14.7031 C8.11458,-15.724 8.35938,-16.7865 8.35938,-17.8906 C8.35938,-18.724 8.22917,-19.5625 7.96875,-20.4063"/>
<path class="TimeSig" transform="matrix(1.11345,0,0,1.11345,51.5479,128.557)" d="M4.5,-4.75 C4.88542,-4.75 5.21615,-4.79427 5.49219,-4.88281 C5.76823,-4.97135 5.94271,-5.01563 6.01563,-5.01563 C6.10938,-5.01563 6.18229,-4.98958 6.23438,-4.9375 C6.27604,-4.90625 6.30208,-4.86458 6.3125,-4.8125 C6.3125,-4.78125 6.29688,-4.73958 6.26563,-4.6875 L0.59375,1.92188 L3.92188,1.92188 L3.92188,-0.703125 C3.92188,-0.869792 3.96875,-1.01563 4.0625,-1.14063 C4.21875,-1.26563 4.34896,-1.34375 4.45313,-1.375 C4.61979,-1.44792 4.82813,-1.63021 5.07813,-1.92188 C5.28646,-2.15104 5.53646,-2.55729 5.82813,-3.14063 C5.85938,-3.22396 5.91667,-3.26563 6,-3.26563 C6.15625,-3.26563 6.24479,-3.17188 6.26563,-2.98438 L6.26563,1.92188 L7.70313,1.92188 C7.88021,1.92188 7.98438,2.01563 8.01563,2.20313 C8.01563,2.40104 7.91146,2.5 7.70313,2.5 L6.26563,2.5 L6.26563,2.65625 C6.26563,3.17708 6.39583,3.61979 6.65625,3.98438 C6.95833,4.34896 7.3125,4.53125 7.71875,4.53125 C7.875,4.53125 7.95313,4.60938 7.95313,4.76563 C7.95313,4.92188 7.875,5 7.71875,5 C7.44792,5 7.00521,4.96354 6.39063,4.89063 C5.82813,4.79688 5.39063,4.75 5.07813,4.75 C4.75521,4.75 4.31771,4.79688 3.76563,4.89063 C3.18229,4.96354 2.75,5 2.46875,5 C2.3125,5 2.23438,4.92188 2.23438,4.76563 C2.23438,4.60938 2.3125,4.53125 2.46875,4.53125 C2.86458,4.53125 3.21354,4.34896 3.51563,3.98438 C3.78646,3.60938 3.92188,3.16667 3.92188,2.65625 L3.92188,2.5 L0.59375,2.5 C0.364583,2.5 0.208333,2.44792 0.125,2.34375 C0.0104167,2.27083 -0.046875,2.16667 -0.046875,2.03125 C-0.046875,1.98958 0.0520833,1.85417 0.25,1.625 C0.479167,1.36458 0.713542,1.04688 0.953125,0.671875 C1.24479,0.223958 1.52083,-0.234375 1.78125,-0.703125 C2.0625,-1.23438 2.29167,-1.84896 2.46875,-2.54688 C2.65625,-3.24479 2.75,-3.95833 2.75,-4.6875 C2.75,-4.89583 2.84375,-5 3.03125,-5 C3.07292,-5 3.15625,-4.97917 3.28125,-4.9375 C3.32292,-4.92708 3.40625,-4.90885 3.53125,-4.88281 C3.65625,-4.85677 3.75521,-4.83333 3.82813,-4.8125 C4.06771,-4.77083 4.29167,-4.75 4.5,-4.75"/>
<path class="TimeSig" transform="matrix(1.11345,0,0,1.11345,51.5479,139.691)" d="M4.5,-4.75 C4.88542,-4.75 5.21615,-4.79427 5.49219,-4.88281 C5.76823,-4.97135 5.94271,-5.01563 6.01563,-5.01563 C6.10938,-5.01563 6.18229,-4.98958 6.23438,-4.9375 C6.27604,-4.90625 6.30208,-4.86458 6.3125,-4.8125 C6.3125,-4.78125 6.29688,-4.73958 6.26563,-4.6875 L0.59375,1.92188 L3.92188,1.92188 L3.92188,-0.703125 C3.92188,-0.869792 3.96875,-1.01563 4.0625,-1.14063 C4.21875,-1.26563 4.34896,-1.34375 4.45313,-1.375 C4.61979,-1.44792 4.82813,-1.63021 5.07813,-1.92188 C5.28646,-2.15104 5.53646,-2.55729 5.82813,-3.14063 C5.85938,-3.22396 5.91667,-3.26563 6,-3.26563 C6.15625,-3.26563 6.24479,-3.17188 6.26563,-2.98438 L6.26563,1.92188 L7.70313,1.92188 C7.88021,1.92188 7.98438,2.01563 8.01563,2.20313 C8.01563,2.40104 7.91146,2.5 7.70313,2.5 L6.26563,2.5 L6.26563,2.65625 C6.26563,3.17708 6.39583,3.61979 6.65625,3.98438 C6.95833,4.34896 7.3125,4.53125 7.71875,4.53125 C7.875,4.53125 7.95313,4.60938 7.95313,4.76563 C7.95313,4.92188 7.875,5 7.71875,5 C7.44792,5 7.00521,4.96354 6.39063,4.89063 C5.82813,4.79688 5.39063,4.75 5.07813,4.75 C4.75521,4.75 4.31771,4.79688 3.76563,4.89063 C3.18229,4.96354 2.75,5 2.46875,5 C2.3125,5 2.23438,4.92188 2.23438,4.76563 C2.23438,4.60938 2.3125,4.53125 2.46875,4.53125 C2.86458,4.53125 3.21354,4.34896 3.51563,3.98438 C3.78646,3.60938 3.92188,3.16667 3.92188,2.65625 L3.92188,2.5 L0.59375,2.5 C0.364583,2.5 0.208333,2.44792 0.125,2.34375 C0.0104167,2.27083 -0.046875,2.16667 -0.046875,2.03125 C-0.046875,1.98958 0.0520833,1.85417 0.25,1.625 C0.479167,1.36458 0.713542,1.04688 0.953125,0.671875 C1.24479,0.223958 1.52083,-0.234375 1.78125,-0.703125 C2.0625,-1.23438 2.29167,-1.84896 2.46875,-2.54688 C2.65625,-3.24479 2.75,-3.95833 2.75,-4.6875 C2.75,-4.89583 2.84375,-5 3.03125,-5 C3.07292,-5 3.15625,-4.97917 3.28125,-4.9375 C3.32292,-4.92708 3.40625,-4.90885 3.53125,-4.88281 C3.65625,-4.85677 3.75521,-4.83333 3.82813,-4.8125 C4.06771,-4.77083 4.29167,-4.75 4.5,-4.75"/>
<path class="Marker" d="M662.967,114.293 C662.967,114.428 662.915,114.517 662.811,114.558 C662.769,114.652 662.686,114.699 662.561,114.699 C662.436,114.699 662.352,114.652 662.311,114.558 C662.217,114.517 662.17,114.428 662.17,114.293 L662.17,111.855 C660.899,111.72 659.904,111.032 659.186,109.793 C658.446,108.605 658.055,107.142 658.014,105.402 L655.623,105.402 C655.488,105.402 655.389,105.355 655.326,105.261 C655.243,105.209 655.201,105.121 655.201,104.996 C655.201,104.871 655.243,104.787 655.326,104.746 C655.378,104.662 655.477,104.621 655.623,104.621 L658.014,104.621 C658.055,102.902 658.446,101.449 659.186,100.261 C659.873,99.0322 660.868,98.3343 662.17,98.1676 L662.17,95.7457 C662.17,95.6207 662.217,95.5322 662.311,95.4801 C662.352,95.3968 662.443,95.3551 662.584,95.3551 C662.725,95.3551 662.8,95.3968 662.811,95.4801 C662.904,95.5322 662.956,95.6207 662.967,95.7457 L662.967,98.1676 C664.248,98.303 665.238,98.9853 665.936,100.214 C666.675,101.402 667.066,102.871 667.108,104.621 L669.545,104.621 C669.68,104.621 669.774,104.662 669.826,104.746 C669.92,104.787 669.967,104.879 669.967,105.019 C669.967,105.16 669.92,105.241 669.826,105.261 C669.785,105.345 669.691,105.392 669.545,105.402 L667.108,105.402 C667.066,107.121 666.675,108.584 665.936,109.793 C665.248,111.022 664.259,111.709 662.967,111.855 L662.967,114.293 M662.967,104.621 L665.123,104.621 C665.123,103.839 665.087,103.183 665.014,102.652 C664.941,102.058 664.863,101.511 664.779,101.011 C664.644,100.438 664.43,99.9801 664.139,99.6364 C663.858,99.3134 663.467,99.1103 662.967,99.027 L662.967,104.621 M662.967,105.402 L662.967,111.043 C663.467,110.949 663.858,110.735 664.139,110.402 C664.43,110.069 664.644,109.616 664.779,109.043 C664.894,108.543 664.972,107.985 665.014,107.371 C665.055,106.839 665.092,106.183 665.123,105.402 L662.967,105.402 M662.17,104.621 L662.17,99.027 C661.68,99.1103 661.3,99.3134 661.029,99.6364 C660.738,99.9801 660.514,100.438 660.358,101.011 C660.233,101.491 660.149,102.037 660.108,102.652 C660.066,103.183 660.045,103.839 660.045,104.621 L662.17,104.621 M662.17,105.402 L660.045,105.402 C660.045,106.183 660.066,106.839 660.108,107.371 C660.18,107.964 660.264,108.522 660.358,109.043 C660.483,109.616 660.706,110.069 661.029,110.402 C661.311,110.725 661.691,110.938 662.17,111.043 L662.17,105.402 "/>
<path class="Marker" d="M320.122,103.793 L319.419,103.793 C318.689,103.793 318.2,103.892 317.95,104.089 C317.7,104.287 317.497,104.746 317.34,105.464 L317.028,105.464 L317.106,103.246 L324.45,103.246 L324.528,105.464 L324.215,105.464 C324.07,104.746 323.872,104.287 323.622,104.089 C323.372,103.892 322.877,103.793 322.137,103.793 L321.45,103.793 L321.45,110.433 C321.45,110.912 321.523,111.222 321.669,111.363 C321.814,111.504 322.153,111.584 322.684,111.605 L322.684,111.855 L318.887,111.855 L318.887,111.605 C319.429,111.574 319.77,111.485 319.911,111.339 C320.051,111.194 320.122,110.845 320.122,110.293 L320.122,103.793 M327.528,105.871 C328.361,105.871 329.046,106.149 329.583,106.707 C330.119,107.264 330.387,107.964 330.387,108.808 C330.387,109.714 330.109,110.47 329.551,111.074 C328.994,111.678 328.309,111.98 327.497,111.98 C326.684,111.98 326.007,111.688 325.465,111.105 C324.924,110.522 324.653,109.793 324.653,108.918 C324.653,108.022 324.919,107.29 325.45,106.722 C325.981,106.155 326.674,105.871 327.528,105.871 M325.825,108.277 C325.825,109.204 325.994,109.993 326.333,110.644 C326.671,111.295 327.111,111.621 327.653,111.621 C328.143,111.621 328.525,111.412 328.801,110.996 C329.077,110.579 329.215,110.001 329.215,109.261 C329.215,108.376 329.041,107.652 328.692,107.089 C328.343,106.527 327.898,106.246 327.356,106.246 C326.898,106.246 326.528,106.431 326.247,106.8 C325.965,107.17 325.825,107.662 325.825,108.277 M334.403,107.636 C334.403,106.282 334.82,105.183 335.653,104.339 C336.486,103.496 337.523,103.074 338.762,103.074 C339.314,103.074 339.833,103.144 340.317,103.285 C340.801,103.425 341.085,103.496 341.169,103.496 C341.45,103.496 341.632,103.355 341.715,103.074 L341.981,103.074 L342.106,106.011 L341.809,106.011 C341.33,104.397 340.398,103.589 339.012,103.589 C338.064,103.589 337.312,103.941 336.755,104.644 C336.197,105.347 335.919,106.287 335.919,107.464 C335.919,108.214 336.015,108.866 336.208,109.418 C336.4,109.97 336.661,110.386 336.989,110.668 C337.317,110.949 337.658,111.152 338.012,111.277 C338.367,111.402 338.742,111.464 339.137,111.464 C340.158,111.464 341.127,111.027 342.044,110.152 L342.278,110.386 C341.872,110.918 341.361,111.326 340.747,111.613 C340.132,111.899 339.455,112.043 338.715,112.043 C337.434,112.043 336.395,111.639 335.598,110.832 C334.801,110.024 334.403,108.959 334.403,107.636 M345.856,105.871 C346.689,105.871 347.374,106.149 347.911,106.707 C348.447,107.264 348.715,107.964 348.715,108.808 C348.715,109.714 348.437,110.47 347.88,111.074 C347.322,111.678 346.637,111.98 345.825,111.98 C345.012,111.98 344.335,111.688 343.794,111.105 C343.252,110.522 342.981,109.793 342.981,108.918 C342.981,108.022 343.247,107.29 343.778,106.722 C344.309,106.155 345.002,105.871 345.856,105.871 M344.153,108.277 C344.153,109.204 344.322,109.993 344.661,110.644 C344.999,111.295 345.439,111.621 345.981,111.621 C346.471,111.621 346.854,111.412 347.13,110.996 C347.406,110.579 347.544,110.001 347.544,109.261 C347.544,108.376 347.369,107.652 347.02,107.089 C346.671,106.527 346.226,106.246 345.684,106.246 C345.226,106.246 344.856,106.431 344.575,106.8 C344.294,107.17 344.153,107.662 344.153,108.277 M353.481,111.98 L353.419,111.949 L353.419,111.121 C353.002,111.694 352.45,111.98 351.762,111.98 C351.044,111.98 350.463,111.722 350.02,111.207 C349.577,110.691 349.356,110.017 349.356,109.183 C349.356,108.267 349.619,107.485 350.145,106.839 C350.671,106.194 351.309,105.871 352.059,105.871 C352.528,105.871 352.981,106.058 353.419,106.433 L353.419,104.402 C353.419,104.131 353.38,103.954 353.301,103.871 C353.223,103.787 353.064,103.746 352.825,103.746 C352.7,103.746 352.606,103.751 352.544,103.761 L352.544,103.543 C353.325,103.334 353.96,103.147 354.45,102.98 L354.512,102.996 L354.512,110.371 C354.512,110.673 354.549,110.873 354.622,110.972 C354.695,111.071 354.851,111.121 355.09,111.121 C355.132,111.121 355.231,111.116 355.387,111.105 L355.387,111.308 L353.481,111.98 M352.262,111.308 C352.596,111.308 352.872,111.214 353.09,111.027 C353.309,110.839 353.419,110.673 353.419,110.527 L353.419,107.543 C353.419,107.188 353.286,106.884 353.02,106.629 C352.755,106.373 352.445,106.246 352.09,106.246 C351.601,106.246 351.208,106.464 350.911,106.902 C350.614,107.339 350.465,107.928 350.465,108.668 C350.465,109.47 350.632,110.11 350.965,110.589 C351.299,111.069 351.731,111.308 352.262,111.308 M355.84,110.589 C355.84,110.433 355.856,110.29 355.887,110.16 C355.919,110.03 355.979,109.905 356.067,109.785 C356.156,109.665 356.239,109.558 356.317,109.464 C356.395,109.371 356.512,109.274 356.669,109.175 C356.825,109.076 356.955,108.993 357.059,108.925 C357.163,108.858 357.322,108.78 357.536,108.691 C357.749,108.603 357.911,108.535 358.02,108.488 C358.13,108.441 358.307,108.368 358.551,108.269 C358.796,108.17 358.976,108.1 359.09,108.058 L359.09,107.261 C359.09,106.543 358.762,106.183 358.106,106.183 C357.846,106.183 357.624,106.246 357.442,106.371 C357.26,106.496 357.169,106.647 357.169,106.824 C357.169,106.897 357.179,106.993 357.2,107.113 C357.221,107.233 357.231,107.308 357.231,107.339 C357.231,107.485 357.171,107.613 357.051,107.722 C356.932,107.832 356.794,107.886 356.637,107.886 C356.492,107.886 356.364,107.832 356.255,107.722 C356.145,107.613 356.09,107.48 356.09,107.324 C356.09,106.918 356.299,106.574 356.715,106.293 C357.132,106.011 357.648,105.871 358.262,105.871 C358.981,105.871 359.473,106.043 359.739,106.386 C360.005,106.73 360.137,107.251 360.137,107.949 L360.137,110.496 C360.137,110.777 360.166,110.972 360.223,111.082 C360.281,111.191 360.382,111.246 360.528,111.246 C360.715,111.246 360.908,111.162 361.106,110.996 L361.106,111.339 C360.877,111.589 360.679,111.759 360.512,111.847 C360.346,111.936 360.153,111.98 359.934,111.98 C359.663,111.98 359.465,111.907 359.34,111.761 C359.215,111.616 359.137,111.376 359.106,111.043 C358.356,111.668 357.721,111.98 357.2,111.98 C356.804,111.98 356.479,111.85 356.223,111.589 C355.968,111.329 355.84,110.996 355.84,110.589 M359.09,110.261 L359.09,108.371 C358.309,108.652 357.762,108.928 357.45,109.199 C357.137,109.47 356.981,109.798 356.981,110.183 C356.981,110.537 357.067,110.8 357.239,110.972 C357.411,111.144 357.596,111.23 357.794,111.23 C358.096,111.23 358.413,111.131 358.747,110.933 C358.882,110.85 358.973,110.767 359.02,110.683 C359.067,110.6 359.09,110.459 359.09,110.261"/>
<path class="Marker" d="M208.348,104.746 C208.255,104.642 208.208,104.517 208.208,104.371 C208.208,104.225 208.255,104.1 208.348,103.996 C208.442,103.892 208.567,103.839 208.723,103.839 C208.88,103.839 209.01,103.892 209.114,103.996 C209.218,104.1 209.27,104.225 209.27,104.371 C209.27,104.517 209.218,104.642 209.114,104.746 C209.01,104.85 208.88,104.902 208.723,104.902 C208.567,104.902 208.442,104.85 208.348,104.746 M202.294,106.511 C202.195,106.407 202.145,106.282 202.145,106.136 C202.145,105.991 202.195,105.866 202.294,105.761 C202.393,105.657 202.52,105.605 202.676,105.605 C202.833,105.605 202.958,105.657 203.051,105.761 C203.145,105.866 203.192,105.991 203.192,106.136 C203.192,106.282 203.145,106.407 203.051,106.511 C202.958,106.616 202.833,106.668 202.676,106.668 C202.52,106.668 202.393,106.616 202.294,106.511 M205.083,109.261 C205.083,108.553 205.4,108.199 206.036,108.199 C206.359,108.199 206.614,108.319 206.801,108.558 C206.979,108.777 207.067,109.027 207.067,109.308 C207.067,109.558 206.999,109.793 206.864,110.011 C206.718,110.209 206.551,110.345 206.364,110.418 C206.426,110.688 206.572,110.902 206.801,111.058 C207.041,111.235 207.296,111.324 207.567,111.324 C207.89,111.324 208.161,111.194 208.38,110.933 C208.619,110.683 208.739,110.376 208.739,110.011 C208.739,108.605 207.729,107.319 205.708,106.152 L202.364,111.855 L201.301,111.855 L204.895,105.714 C203.801,105.11 202.926,104.464 202.27,103.777 C201.624,103.089 201.301,102.298 201.301,101.402 C201.301,100.621 201.551,99.9697 202.051,99.4489 C202.551,98.9176 203.145,98.652 203.833,98.652 C204.52,98.652 205.109,98.902 205.598,99.402 C206.077,99.9332 206.317,100.548 206.317,101.246 C206.317,101.954 206.005,102.308 205.38,102.308 C205.057,102.308 204.796,102.188 204.598,101.949 C204.421,101.73 204.333,101.48 204.333,101.199 C204.333,100.949 204.4,100.714 204.536,100.496 C204.682,100.298 204.848,100.162 205.036,100.089 C204.984,99.8187 204.838,99.6051 204.598,99.4489 C204.369,99.2718 204.114,99.1832 203.833,99.1832 C203.51,99.1832 203.239,99.3134 203.02,99.5739 C202.781,99.8239 202.661,100.131 202.661,100.496 C202.661,101.912 203.676,103.199 205.708,104.355 L209.051,98.652 L210.098,98.652 L206.52,104.793 C207.604,105.397 208.473,106.043 209.13,106.73 C209.775,107.418 210.098,108.209 210.098,109.105 C210.098,109.886 209.848,110.537 209.348,111.058 C208.859,111.589 208.265,111.855 207.567,111.855 C206.88,111.855 206.296,111.6 205.817,111.089 C205.327,110.569 205.083,109.959 205.083,109.261"/>
<path class="Jump" d="M460.175,107.511 C460.175,107.907 460.131,108.29 460.042,108.66 C459.954,109.03 459.795,109.415 459.566,109.816 C459.337,110.217 459.04,110.561 458.675,110.847 C458.311,111.134 457.826,111.373 457.222,111.566 C456.618,111.759 455.936,111.855 455.175,111.855 L451.472,111.855 L451.472,111.605 C451.972,111.574 452.29,111.488 452.425,111.347 C452.561,111.207 452.628,110.902 452.628,110.433 L452.628,104.668 C452.628,104.188 452.566,103.884 452.441,103.754 C452.316,103.623 451.993,103.537 451.472,103.496 L451.472,103.246 L454.988,103.246 C455.779,103.246 456.485,103.334 457.105,103.511 C457.725,103.688 458.222,103.918 458.597,104.199 C458.972,104.48 459.285,104.813 459.535,105.199 C459.785,105.584 459.954,105.964 460.042,106.339 C460.131,106.714 460.175,107.105 460.175,107.511 M458.753,107.605 C458.753,107.23 458.717,106.871 458.644,106.527 C458.571,106.183 458.441,105.837 458.253,105.488 C458.066,105.139 457.819,104.839 457.511,104.589 C457.204,104.339 456.806,104.134 456.316,103.972 C455.826,103.811 455.264,103.73 454.628,103.73 C454.358,103.73 454.178,103.764 454.089,103.832 C454.001,103.899 453.957,104.032 453.957,104.23 L453.957,110.839 C453.957,111.048 454.003,111.188 454.097,111.261 C454.191,111.334 454.368,111.371 454.628,111.371 C457.378,111.371 458.753,110.116 458.753,107.605 M462.253,110.558 C462.451,110.558 462.623,110.631 462.769,110.777 C462.915,110.923 462.988,111.095 462.988,111.293 C462.988,111.491 462.912,111.657 462.761,111.793 C462.61,111.928 462.436,111.996 462.238,111.996 C462.05,111.996 461.886,111.928 461.746,111.793 C461.605,111.657 461.535,111.491 461.535,111.293 C461.535,111.095 461.608,110.923 461.753,110.777 C461.899,110.631 462.066,110.558 462.253,110.558 M468.8,110.105 C468.8,109.699 468.657,109.337 468.371,109.019 C468.084,108.701 467.735,108.431 467.324,108.207 C466.912,107.983 466.506,107.751 466.105,107.511 C465.704,107.272 465.36,106.964 465.074,106.589 C464.787,106.214 464.644,105.782 464.644,105.293 C464.644,104.636 464.868,104.103 465.316,103.691 C465.764,103.28 466.29,103.074 466.894,103.074 C467.259,103.074 467.654,103.147 468.082,103.293 C468.509,103.438 468.764,103.511 468.847,103.511 C469.066,103.511 469.201,103.366 469.253,103.074 L469.535,103.074 L469.816,105.839 L469.488,105.839 C469.279,105.079 468.962,104.517 468.535,104.152 C468.108,103.787 467.634,103.605 467.113,103.605 C466.717,103.605 466.394,103.717 466.144,103.941 C465.894,104.165 465.769,104.454 465.769,104.808 C465.769,105.152 465.915,105.48 466.207,105.793 C466.498,106.105 466.988,106.454 467.675,106.839 C468.529,107.298 469.149,107.751 469.535,108.199 C469.92,108.647 470.113,109.136 470.113,109.668 C470.113,110.334 469.855,110.897 469.339,111.355 C468.824,111.813 468.196,112.043 467.457,112.043 C467.019,112.043 466.579,111.967 466.136,111.816 C465.694,111.665 465.42,111.589 465.316,111.589 C465.212,111.589 465.126,111.631 465.058,111.714 C464.99,111.798 464.951,111.902 464.941,112.027 L464.66,112.027 L464.269,109.261 L464.566,109.261 C464.889,110.053 465.261,110.636 465.683,111.011 C466.105,111.386 466.608,111.574 467.191,111.574 C467.67,111.574 468.058,111.436 468.355,111.16 C468.652,110.884 468.8,110.532 468.8,110.105 M472.378,110.558 C472.576,110.558 472.748,110.631 472.894,110.777 C473.04,110.923 473.113,111.095 473.113,111.293 C473.113,111.491 473.037,111.657 472.886,111.793 C472.735,111.928 472.561,111.996 472.363,111.996 C472.175,111.996 472.011,111.928 471.871,111.793 C471.73,111.657 471.66,111.491 471.66,111.293 C471.66,111.095 471.733,110.923 471.878,110.777 C472.024,110.631 472.191,110.558 472.378,110.558 M477.582,110.589 C477.582,110.433 477.597,110.29 477.628,110.16 C477.66,110.03 477.72,109.905 477.808,109.785 C477.897,109.665 477.98,109.558 478.058,109.464 C478.136,109.371 478.253,109.274 478.41,109.175 C478.566,109.076 478.696,108.993 478.8,108.925 C478.904,108.858 479.063,108.78 479.277,108.691 C479.49,108.603 479.652,108.535 479.761,108.488 C479.871,108.441 480.048,108.368 480.292,108.269 C480.537,108.17 480.717,108.1 480.832,108.058 L480.832,107.261 C480.832,106.543 480.503,106.183 479.847,106.183 C479.587,106.183 479.365,106.246 479.183,106.371 C479.001,106.496 478.91,106.647 478.91,106.824 C478.91,106.897 478.92,106.993 478.941,107.113 C478.962,107.233 478.972,107.308 478.972,107.339 C478.972,107.485 478.912,107.613 478.792,107.722 C478.673,107.832 478.535,107.886 478.378,107.886 C478.233,107.886 478.105,107.832 477.996,107.722 C477.886,107.613 477.832,107.48 477.832,107.324 C477.832,106.918 478.04,106.574 478.457,106.293 C478.873,106.011 479.389,105.871 480.003,105.871 C480.722,105.871 481.214,106.043 481.48,106.386 C481.746,106.73 481.878,107.251 481.878,107.949 L481.878,110.496 C481.878,110.777 481.907,110.972 481.964,111.082 C482.022,111.191 482.123,111.246 482.269,111.246 C482.457,111.246 482.649,111.162 482.847,110.996 L482.847,111.339 C482.618,111.589 482.42,111.759 482.253,111.847 C482.087,111.936 481.894,111.98 481.675,111.98 C481.404,111.98 481.207,111.907 481.082,111.761 C480.957,111.616 480.878,111.376 480.847,111.043 C480.097,111.668 479.462,111.98 478.941,111.98 C478.545,111.98 478.22,111.85 477.964,111.589 C477.709,111.329 477.582,110.996 477.582,110.589 M480.832,110.261 L480.832,108.371 C480.05,108.652 479.503,108.928 479.191,109.199 C478.878,109.47 478.722,109.798 478.722,110.183 C478.722,110.537 478.808,110.8 478.98,110.972 C479.152,111.144 479.337,111.23 479.535,111.23 C479.837,111.23 480.154,111.131 480.488,110.933 C480.623,110.85 480.714,110.767 480.761,110.683 C480.808,110.6 480.832,110.459 480.832,110.261 M482.941,103.761 L482.941,103.543 C483.806,103.334 484.498,103.147 485.019,102.98 L485.066,102.996 L485.066,110.761 C485.066,111.116 485.123,111.347 485.238,111.457 C485.352,111.566 485.618,111.636 486.035,111.668 L486.035,111.855 L482.972,111.855 L482.972,111.668 C483.378,111.626 483.647,111.545 483.777,111.425 C483.907,111.306 483.972,111.074 483.972,110.73 L483.972,104.527 C483.972,104.225 483.933,104.017 483.855,103.902 C483.777,103.787 483.634,103.73 483.425,103.73 C483.248,103.73 483.087,103.741 482.941,103.761 M489.863,107.636 C489.863,106.282 490.279,105.183 491.113,104.339 C491.946,103.496 492.983,103.074 494.222,103.074 C494.774,103.074 495.292,103.144 495.777,103.285 C496.261,103.425 496.545,103.496 496.628,103.496 C496.91,103.496 497.092,103.355 497.175,103.074 L497.441,103.074 L497.566,106.011 L497.269,106.011 C496.79,104.397 495.858,103.589 494.472,103.589 C493.524,103.589 492.772,103.941 492.214,104.644 C491.657,105.347 491.378,106.287 491.378,107.464 C491.378,108.214 491.475,108.866 491.667,109.418 C491.86,109.97 492.121,110.386 492.449,110.668 C492.777,110.949 493.118,111.152 493.472,111.277 C493.826,111.402 494.201,111.464 494.597,111.464 C495.618,111.464 496.587,111.027 497.503,110.152 L497.738,110.386 C497.332,110.918 496.821,111.326 496.207,111.613 C495.592,111.899 494.915,112.043 494.175,112.043 C492.894,112.043 491.855,111.639 491.058,110.832 C490.261,110.024 489.863,108.959 489.863,107.636 M501.316,105.871 C502.149,105.871 502.834,106.149 503.371,106.707 C503.907,107.264 504.175,107.964 504.175,108.808 C504.175,109.714 503.897,110.47 503.339,111.074 C502.782,111.678 502.097,111.98 501.285,111.98 C500.472,111.98 499.795,111.688 499.253,111.105 C498.712,110.522 498.441,109.793 498.441,108.918 C498.441,108.022 498.707,107.29 499.238,106.722 C499.769,106.155 500.462,105.871 501.316,105.871 M499.613,108.277 C499.613,109.204 499.782,109.993 500.121,110.644 C500.459,111.295 500.899,111.621 501.441,111.621 C501.931,111.621 502.313,111.412 502.589,110.996 C502.865,110.579 503.003,110.001 503.003,109.261 C503.003,108.376 502.829,107.652 502.48,107.089 C502.131,106.527 501.686,106.246 501.144,106.246 C500.686,106.246 500.316,106.431 500.035,106.8 C499.753,107.17 499.613,107.662 499.613,108.277 M508.941,111.98 L508.878,111.949 L508.878,111.121 C508.462,111.694 507.91,111.98 507.222,111.98 C506.503,111.98 505.923,111.722 505.48,111.207 C505.037,110.691 504.816,110.017 504.816,109.183 C504.816,108.267 505.079,107.485 505.605,106.839 C506.131,106.194 506.769,105.871 507.519,105.871 C507.988,105.871 508.441,106.058 508.878,106.433 L508.878,104.402 C508.878,104.131 508.839,103.954 508.761,103.871 C508.683,103.787 508.524,103.746 508.285,103.746 C508.16,103.746 508.066,103.751 508.003,103.761 L508.003,103.543 C508.785,103.334 509.42,103.147 509.91,102.98 L509.972,102.996 L509.972,110.371 C509.972,110.673 510.009,110.873 510.082,110.972 C510.154,111.071 510.311,111.121 510.55,111.121 C510.592,111.121 510.691,111.116 510.847,111.105 L510.847,111.308 L508.941,111.98 M507.722,111.308 C508.056,111.308 508.332,111.214 508.55,111.027 C508.769,110.839 508.878,110.673 508.878,110.527 L508.878,107.543 C508.878,107.188 508.746,106.884 508.48,106.629 C508.214,106.373 507.904,106.246 507.55,106.246 C507.061,106.246 506.667,106.464 506.371,106.902 C506.074,107.339 505.925,107.928 505.925,108.668 C505.925,109.47 506.092,110.11 506.425,110.589 C506.759,111.069 507.191,111.308 507.722,111.308 M511.3,110.589 C511.3,110.433 511.316,110.29 511.347,110.16 C511.378,110.03 511.438,109.905 511.527,109.785 C511.615,109.665 511.699,109.558 511.777,109.464 C511.855,109.371 511.972,109.274 512.128,109.175 C512.285,109.076 512.415,108.993 512.519,108.925 C512.623,108.858 512.782,108.78 512.996,108.691 C513.209,108.603 513.371,108.535 513.48,108.488 C513.589,108.441 513.766,108.368 514.011,108.269 C514.256,108.17 514.436,108.1 514.55,108.058 L514.55,107.261 C514.55,106.543 514.222,106.183 513.566,106.183 C513.306,106.183 513.084,106.246 512.902,106.371 C512.72,106.496 512.628,106.647 512.628,106.824 C512.628,106.897 512.639,106.993 512.66,107.113 C512.681,107.233 512.691,107.308 512.691,107.339 C512.691,107.485 512.631,107.613 512.511,107.722 C512.391,107.832 512.253,107.886 512.097,107.886 C511.951,107.886 511.824,107.832 511.714,107.722 C511.605,107.613 511.55,107.48 511.55,107.324 C511.55,106.918 511.759,106.574 512.175,106.293 C512.592,106.011 513.108,105.871 513.722,105.871 C514.441,105.871 514.933,106.043 515.199,106.386 C515.464,106.73 515.597,107.251 515.597,107.949 L515.597,110.496 C515.597,110.777 515.626,110.972 515.683,111.082 C515.74,111.191 515.842,111.246 515.988,111.246 C516.175,111.246 516.368,111.162 516.566,110.996 L516.566,111.339 C516.337,111.589 516.139,111.759 515.972,111.847 C515.806,111.936 515.613,111.98 515.394,111.98 C515.123,111.98 514.925,111.907 514.8,111.761 C514.675,111.616 514.597,111.376 514.566,111.043 C513.816,111.668 513.181,111.98 512.66,111.98 C512.264,111.98 511.938,111.85 511.683,111.589 C511.428,111.329 511.3,110.996 511.3,110.589 M514.55,110.261 L514.55,108.371 C513.769,108.652 513.222,108.928 512.91,109.199 C512.597,109.47 512.441,109.798 512.441,110.183 C512.441,110.537 512.527,110.8 512.699,110.972 C512.871,111.144 513.056,111.23 513.253,111.23 C513.556,111.23 513.873,111.131 514.207,110.933 C514.342,110.85 514.433,110.767 514.48,110.683 C514.527,110.6 514.55,110.459 514.55,110.261"/>
</svg>
