<?xml version="1.0" encoding="UTF-8" standalone="no"?>
<!-- Created with Inkscape (http://www.inkscape.org/) -->

<svg
   width="50"
   height="15"
   id="svg4139"
   sodipodi:version="0.32"
   inkscape:version="1.1.2 (0a00cf5339, 2022-02-04)"
   version="1.0"
   sodipodi:docname="Light_Bulb-Silhouette.svg"
   inkscape:output_extension="org.inkscape.output.svg.inkscape"
   xmlns:inkscape="http://www.inkscape.org/namespaces/inkscape"
   xmlns:sodipodi="http://sodipodi.sourceforge.net/DTD/sodipodi-0.dtd"
   xmlns="http://www.w3.org/2000/svg"
   xmlns:svg="http://www.w3.org/2000/svg"
   xmlns:rdf="http://www.w3.org/1999/02/22-rdf-syntax-ns#"
   xmlns:cc="http://creativecommons.org/ns#"
   xmlns:dc="http://purl.org/dc/elements/1.1/">
  <defs
     id="defs4141" />
  <sodipodi:namedview
     id="base"
     pagecolor="#ffffff"
     bordercolor="#666666"
     borderopacity="1.0"
     gridtolerance="10000"
     guidetolerance="10"
     objecttolerance="10"
     inkscape:pageopacity="0.0"
     inkscape:pageshadow="2"
     inkscape:zoom="19.55"
     inkscape:cx="29.309463"
     inkscape:cy="9.2838875"
     inkscape:document-units="px"
     inkscape:current-layer="g9145"
     height="110px"
     width="50px"
     inkscape:window-width="2317"
     inkscape:window-height="1136"
     inkscape:window-x="74"
     inkscape:window-y="27"
     inkscape:pagecheckerboard="0"
     showgrid="true"
     inkscape:window-maximized="0">
    <inkscape:grid
       type="xygrid"
       id="grid8663" />
  </sodipodi:namedview>
  <metadata
     id="metadata4144">
    <rdf:RDF>
      <cc:Work
         rdf:about="">
        <dc:format>image/svg+xml</dc:format>
        <dc:type
           rdf:resource="http://purl.org/dc/dcmitype/StillImage" />
      </cc:Work>
    </rdf:RDF>
  </metadata>
  <g
     inkscape:label="Layer 1"
     inkscape:groupmode="layer"
     id="layer1"
     transform="translate(-314.9389,-506.47161)">
    <g
       id="g9145"
       transform="matrix(0.3246143,0,0,0.3246143,311.60581,432.06822)">
      <path
         style="color:#000000;display:inline;overflow:visible;visibility:visible;fill:#000000;fill-opacity:1;fill-rule:nonzero;stroke:none;stroke-width:0.276001;stroke-linecap:butt;stroke-linejoin:miter;stroke-miterlimit:4;stroke-dasharray:none;stroke-dashoffset:0;stroke-opacity:1;marker:none"
         d="m 107.63458,244.16284 c -2.83245,0 -5.134,1.94896 -5.134,4.34749 0,1.19927 0.57533,2.28677 1.50443,3.07354 0.20157,0.17069 0.61841,0.65132 0.96884,1.14357 0.17522,0.24612 0.33615,0.49744 0.45143,0.71675 0.11527,0.21931 0.18076,0.41222 0.18076,0.51023 v 1.88624 0.12796 l 0.1492,-8.1e-4 0.12337,0.39523 v 0.2535 l 3.50619,-0.25836 0.008,-8.1e-4 0.13294,-0.4009 0.13773,-8.1e-4 v -0.12634 -1.8749 c 0,-0.098 0.0655,-0.29092 0.18076,-0.51023 0.11527,-0.21931 0.2762,-0.47063 0.45142,-0.71675 0.35043,-0.49225 0.76727,-0.97288 0.96884,-1.14357 0.9291,-0.78677 1.50443,-1.87427 1.50443,-3.07354 0,-2.39853 -2.30155,-4.34749 -5.13399,-4.34749 z m 0,0.25349 c 2.67016,0 4.83464,1.83289 4.83464,4.094 0,1.13056 -0.54124,2.15343 -1.41644,2.89456 -0.24951,0.21128 -0.65517,0.68625 -1.01475,1.19135 -0.17979,0.25255 -0.34585,0.51067 -0.46864,0.74429 -0.12279,0.23361 -0.20658,0.43778 -0.20658,0.61389 v 1.74856 l -3.45646,0.0105 v -1.75909 c 0,-0.17611 -0.0838,-0.38028 -0.20659,-0.61389 -0.12279,-0.23362 -0.28884,-0.49174 -0.46864,-0.74429 -0.35958,-0.5051 -0.76524,-0.98007 -1.01474,-1.19135 -0.8752,-0.74113 -1.41644,-1.764 -1.41644,-2.89456 0,-2.26111 2.16447,-4.094 4.83464,-4.094 z m 1.72249,12.04714 -3.44211,0.2543 -0.0363,0.0518 -0.11286,0.16116 0.11381,0.16117 0.0316,0.0454 3.44307,-0.2535 0.0363,-0.0518 0.11286,-0.16036 -0.11286,-0.16036 z m 0.0335,0.52157 -3.50619,0.25916 h -0.005 v 0.14983 l 3.50523,-0.25835 0.006,-8.1e-4 z m -0.0335,0.25592 -3.44211,0.25431 -0.0354,0.0502 -0.11382,0.16279 0.11382,0.16198 0.0316,0.0445 3.44306,-0.25349 0.0363,-0.0518 0.11286,-0.16036 -0.11286,-0.16035 z m 0.0335,0.52157 -3.50619,0.25917 h -0.005 v 0.14983 l 3.50523,-0.25836 0.006,-8.1e-4 z m -0.0335,0.25593 -3.44211,0.2543 -0.0354,0.0502 -0.11382,0.16279 0.11477,0.16278 0.0306,0.0437 3.44307,-0.2535 0.0363,-0.0518 0.11286,-0.16036 -0.11286,-0.16036 z m 0.0335,0.52157 -3.50619,0.25916 h -0.004 v 0.15064 l 0.6054,0.30938 0.0134,-0.0454 h 2.27912 l 0.0134,0.0454 0.59871,-0.30938 z m -2.64925,0.77749 0.35674,0.16198 0.0316,0.0146 v 0.0308 h 1.01762 v -0.0308 l 0.0325,-0.0146 0.35578,-0.16198 z"
         id="path1311" />
      <g
         id="g8661-5-6-8-4-0-59"
         transform="matrix(0.0606025,0,0,0.04986731,12.089103,232.60895)">
        <path
           style="color:#000000;display:inline;overflow:visible;visibility:visible;fill:#060000;fill-opacity:1;fill-rule:nonzero;stroke:none;stroke-width:5.02063;stroke-linecap:butt;stroke-linejoin:miter;stroke-miterlimit:4;stroke-dasharray:none;stroke-dashoffset:0;stroke-opacity:1;marker:none"
           d="m 306.67947,246.77467 c -46.73813,0 -84.71593,39.08303 -84.71593,87.1813 0,24.04914 9.49351,45.85711 24.82454,61.63432 3.32605,3.42285 10.20431,13.06111 15.98682,22.93219 2.89125,4.93554 5.5468,9.97528 7.44894,14.37322 1.90214,4.39794 2.98273,8.2663 2.98273,10.23179 v 37.82512 2.56607 l 2.46194,-0.0162 2.03584,7.92557 v 5.08341 l 57.85555,-5.18085 0.12625,-0.0162 2.19365,-8.03926 2.27256,-0.0162 v -2.53359 -37.59774 c 0,-1.96549 1.0806,-5.83385 2.98273,-10.23179 1.90214,-4.39794 4.55769,-9.43768 7.44894,-14.37322 5.78251,-9.87109 12.66077,-19.50935 15.98682,-22.93219 15.33103,-15.7772 24.82455,-37.58518 24.82455,-61.63432 0,-48.09828 -37.97782,-87.18131 -84.71593,-87.18131 z m 0,5.08341 c 44.06032,0 79.77627,36.75533 79.77627,82.09789 0,22.67128 -8.93099,43.18315 -23.37263,58.04508 -4.11713,4.23693 -10.81082,13.76151 -16.74434,23.8904 -2.96677,5.06445 -5.70684,10.24068 -7.73301,14.92541 -2.02618,4.68474 -3.40884,8.77901 -3.40884,12.31063 v 35.06416 l -57.03491,0.21113 v -35.27529 c 0,-3.53162 -1.38266,-7.62589 -3.40883,-12.31063 -2.02618,-4.68473 -4.76625,-9.86097 -7.73302,-14.92541 -5.93352,-10.12889 -12.62721,-19.65347 -16.74433,-23.8904 -14.44165,-14.86193 -23.37264,-35.3738 -23.37264,-58.04508 1e-5,-45.34256 35.71594,-82.09789 79.77628,-82.09789 z m 28.42276,241.5838 -56.79818,5.09965 -0.5997,1.03942 -1.86224,3.23195 1.87802,3.23194 0.52079,0.9095 56.81396,-5.08342 0.59971,-1.03941 1.86223,-3.21571 -1.86223,-3.2157 z m 0.55236,10.45916 -57.85555,5.1971 h -0.0789 v 3.00457 l 57.83977,-5.18086 0.0947,-0.0162 z m -0.55236,5.13213 -56.79818,5.09966 -0.58392,1.00693 -1.87802,3.26443 1.87802,3.24819 0.52079,0.89325 56.81396,-5.08341 0.59971,-1.03942 1.86223,-3.21571 -1.86223,-3.2157 z m 0.55236,10.45916 -57.85555,5.1971 h -0.0789 v 3.00457 l 57.83977,-5.18086 0.0947,-0.0162 z m -0.55236,5.13214 -56.79818,5.09965 -0.58392,1.00693 -1.87802,3.26443 1.8938,3.26443 0.50501,0.87701 56.81396,-5.08341 0.59971,-1.03942 1.86223,-3.21571 -1.86223,-3.2157 z m 0.55236,10.45915 -57.85555,5.1971 h -0.0631 v 3.02081 l 9.98979,6.20404 0.22094,-0.9095 h 37.60769 l 0.22094,0.9095 9.87932,-6.20404 z m -43.71519,15.59129 5.88656,3.24819 0.52079,0.29234 v 0.61715 h 16.79168 v -0.61715 l 0.53658,-0.29234 5.87078,-3.24819 z"
           id="path1311-9-3-6-3-1-9-3" />
        <path
           style="fill:#000000;stroke:#000000;stroke-width:3.08058px;stroke-linecap:butt;stroke-linejoin:miter;stroke-opacity:1"
           d="m 278.16201,478.40278 c -0.89583,-5.24489 0.17006,-10.58498 0.30822,-15.91468 0.11215,-4.32626 -6.13762,-50.27289 7.23484,-36.40099 3.71553,3.85429 -4.65231,9.06429 -4.65231,9.06429 0,0 -6.06163,-2.74899 -6.75452,-3.96237 -2.57824,-4.51501 -0.72172,-3.95408 -3.79544,-8.25729 -2.01915,-4.24871 -4.53937,-4.26404 -5.86714,-8.42042 -1.8579,-2.32238 -9.10829,-11.48584 -10.05653,-13.38231 -0.11693,-0.23391 0,-0.52301 0,-0.78452 -0.27752,-0.83259 3.98847,5.9249 3.55304,5.16291 -1.79234,-3.1366 -9.0263,-13.78383 -11.03597,-16.79834 -4.16806,-6.2521 -7.57224,-13.01968 -11.67922,-19.18014 -0.77713,-1.1657 -0.15473,4.51359 -0.78386,3.35644 -0.72045,-1.32513 -7.13643,-13.43226 -3.90052,-9.31569 4.68438,5.95925 -0.105,-5.18163 -0.31115,-5.69699 0.40914,-2.03526 0.64115,1.23065 0,0 -1.3742,-5.56408 -4.43236,-4.12984 -5.64563,-7.5601 -0.94125,-2.82375 5.08433,-3.18154 3.98045,-5.94122 -0.29154,-0.72883 -1.41694,-0.92049 -1.66517,-1.66518 -0.2824,-0.84722 -1.00644,-6.62629 -0.83259,-7.4933 0.72659,-3.6237 1.89017,-7.15692 2.49776,-10.80246 0.36722,-2.20332 -1.0961,-7.08864 0,-9.22909 2.13805,-4.17516 2.78076,-13.64172 5.50239,-17.452 0,0 0.29952,13.73788 0,0 7.70396,-10.95701 0.71134,-8.39845 10.19001,-19.07568 8.53074,-9.60943 7.79812,-9.04129 8.53074,-9.60943 3.47085,-2.69158 6.92248,-2.98286 10.69946,-4.87135 1.41346,-0.70673 1.48084,-2.02037 3.28431,-2.46704 3.1541,-0.78117 -10.87379,4.61787 7.18063,-3.77742 9.84678,-4.57875 5.57349,2.56309 3.75025,1.22605 -4.57631,-3.35594 8.21426,-6.24521 10.2478,-6.75352 0.37593,-0.094 -2.24814,0.72426 -1.87201,0.63113 3.45597,-0.85571 -10.1648,3.29915 7.42889,-2.19999 12.98073,-4.05729 14.17554,1.61134 20.65729,0 0.8826,-0.21941 -18.62072,-0.59625 -17.72414,-0.74884 6.59407,-1.12224 36.17723,5.49523 42.19911,7.51941 2.05392,0.6904 2.99695,2.47831 4.98506,3.33036 2.92291,1.25267 4.81297,1.72216 7.49329,3.33035 0.92316,0.5539 2.18792,3.02049 2.49777,3.33036 1.14428,1.14428 2.89931,1.48685 4.16294,2.49777 3.688,2.95038 8.09992,5.90542 10.82367,9.99106 1.59824,2.39738 2.50149,5.03664 3.31501,7.44712 0.25107,0.74376 1.37268,0.93674 1.66518,1.66518 1.58829,3.95548 5.08287,6.70331 6.44757,10.76279 0.77732,2.31217 0.9705,4.35533 1.84184,6.53364 0.42496,1.06244 0.40759,2.26792 0.83259,3.33036 0.54396,1.35992 2.54954,2.67861 3.26886,4.02474 0.8219,1.53812 1.81933,4.28307 2.40396,6.08902 0.45928,1.41886 -0.65875,3.56025 0,4.87777 -1.55113,5.38384 -3.57275,10.72262 -3.45906,15.55314 4.8614,4.40432 1.07345,0.0418 0.93433,0.80458 -4.89908,26.86007 -12.28583,23.36243 -5.26068,22.80968 -9.15991,5.54484 -5.23531,-8.1658 4.5664,-4.87255 -1.83057,-26.68713 -1.64652,4.27597 -4.95987,6.37 -1.45708,0.92087 0,0 -3.08721,8.56673 0,0 6.08258,-27.69203 0,0 -17.09434,17.46799 -6.05698,8.77385 -8.06961,10.78648 -8.55064,8.55064 -16.79866,20.14971 -23.478,29.95307 -0.40057,0.58792 -2.14541,8.3399 -3.33035,10.69496 -0.41693,0.82862 0.30035,2.24689 0,3.13258 -2.57953,7.60976 -8.07768,11.85845 -6.19138,21.24288 -2.81094,20.48094 0.53326,8.87303 -1.03639,28.33693 -19.40533,-2.33945 -1.80347,-0.32561 -5.22385,-0.33554 -0.7447,0.24823 -1.0129,1.22848 -1.66518,1.66518 -2.13771,1.43119 -26.15114,0.83259 -30.80487,0.83259 -5.86763,0 -14.43661,1.58579 -19.34099,-1.9511 z"
           id="path1558-2-6-6-4-2-3"
           sodipodi:nodetypes="csscsccscssssscccsssssccssssssssssssssssssssssssccsccsccsssccccsscc" />
      </g>
      <g
         id="g8661-5-6-8-4-0-1-5"
         transform="matrix(0.0606025,0,0,0.04986731,27.492003,232.60895)">
        <path
           style="color:#000000;display:inline;overflow:visible;visibility:visible;fill:#060000;fill-opacity:1;fill-rule:nonzero;stroke:none;stroke-width:5.02063;stroke-linecap:butt;stroke-linejoin:miter;stroke-miterlimit:4;stroke-dasharray:none;stroke-dashoffset:0;stroke-opacity:1;marker:none"
           d="m 306.67947,246.77467 c -46.73813,0 -84.71593,39.08303 -84.71593,87.1813 0,24.04914 9.49351,45.85711 24.82454,61.63432 3.32605,3.42285 10.20431,13.06111 15.98682,22.93219 2.89125,4.93554 5.5468,9.97528 7.44894,14.37322 1.90214,4.39794 2.98273,8.2663 2.98273,10.23179 v 37.82512 2.56607 l 2.46194,-0.0162 2.03584,7.92557 v 5.08341 l 57.85555,-5.18085 0.12625,-0.0162 2.19365,-8.03926 2.27256,-0.0162 v -2.53359 -37.59774 c 0,-1.96549 1.0806,-5.83385 2.98273,-10.23179 1.90214,-4.39794 4.55769,-9.43768 7.44894,-14.37322 5.78251,-9.87109 12.66077,-19.50935 15.98682,-22.93219 15.33103,-15.7772 24.82455,-37.58518 24.82455,-61.63432 0,-48.09828 -37.97782,-87.18131 -84.71593,-87.18131 z m 0,5.08341 c 44.06032,0 79.77627,36.75533 79.77627,82.09789 0,22.67128 -8.93099,43.18315 -23.37263,58.04508 -4.11713,4.23693 -10.81082,13.76151 -16.74434,23.8904 -2.96677,5.06445 -5.70684,10.24068 -7.73301,14.92541 -2.02618,4.68474 -3.40884,8.77901 -3.40884,12.31063 v 35.06416 l -57.03491,0.21113 v -35.27529 c 0,-3.53162 -1.38266,-7.62589 -3.40883,-12.31063 -2.02618,-4.68473 -4.76625,-9.86097 -7.73302,-14.92541 -5.93352,-10.12889 -12.62721,-19.65347 -16.74433,-23.8904 -14.44165,-14.86193 -23.37264,-35.3738 -23.37264,-58.04508 1e-5,-45.34256 35.71594,-82.09789 79.77628,-82.09789 z m 28.42276,241.5838 -56.79818,5.09965 -0.5997,1.03942 -1.86224,3.23195 1.87802,3.23194 0.52079,0.9095 56.81396,-5.08342 0.59971,-1.03941 1.86223,-3.21571 -1.86223,-3.2157 z m 0.55236,10.45916 -57.85555,5.1971 h -0.0789 v 3.00457 l 57.83977,-5.18086 0.0947,-0.0162 z m -0.55236,5.13213 -56.79818,5.09966 -0.58392,1.00693 -1.87802,3.26443 1.87802,3.24819 0.52079,0.89325 56.81396,-5.08341 0.59971,-1.03942 1.86223,-3.21571 -1.86223,-3.2157 z m 0.55236,10.45916 -57.85555,5.1971 h -0.0789 v 3.00457 l 57.83977,-5.18086 0.0947,-0.0162 z m -0.55236,5.13214 -56.79818,5.09965 -0.58392,1.00693 -1.87802,3.26443 1.8938,3.26443 0.50501,0.87701 56.81396,-5.08341 0.59971,-1.03942 1.86223,-3.21571 -1.86223,-3.2157 z m 0.55236,10.45915 -57.85555,5.1971 h -0.0631 v 3.02081 l 9.98979,6.20404 0.22094,-0.9095 h 37.60769 l 0.22094,0.9095 9.87932,-6.20404 z m -43.71519,15.59129 5.88656,3.24819 0.52079,0.29234 v 0.61715 h 16.79168 v -0.61715 l 0.53658,-0.29234 5.87078,-3.24819 z"
           id="path1311-9-3-6-3-1-9-6-4" />
        <path
           style="fill:#000000;stroke:#000000;stroke-width:3.08058px;stroke-linecap:butt;stroke-linejoin:miter;stroke-opacity:1"
           d="m 278.16201,478.40278 c -0.89583,-5.24489 0.17006,-10.58498 0.30822,-15.91468 0.11215,-4.32626 -6.13762,-50.27289 7.23484,-36.40099 3.71553,3.85429 -4.65231,9.06429 -4.65231,9.06429 0,0 -6.06163,-2.74899 -6.75452,-3.96237 -2.57824,-4.51501 -0.72172,-3.95408 -3.79544,-8.25729 -2.01915,-4.24871 -4.53937,-4.26404 -5.86714,-8.42042 -1.8579,-2.32238 -9.10829,-11.48584 -10.05653,-13.38231 -0.11693,-0.23391 0,-0.52301 0,-0.78452 -0.27752,-0.83259 3.98847,5.9249 3.55304,5.16291 -1.79234,-3.1366 -9.0263,-13.78383 -11.03597,-16.79834 -4.16806,-6.2521 -7.57224,-13.01968 -11.67922,-19.18014 -0.77713,-1.1657 -0.15473,4.51359 -0.78386,3.35644 -0.72045,-1.32513 -7.13643,-13.43226 -3.90052,-9.31569 4.68438,5.95925 -0.105,-5.18163 -0.31115,-5.69699 0.40914,-2.03526 0.64115,1.23065 0,0 -1.3742,-5.56408 -4.43236,-4.12984 -5.64563,-7.5601 -0.94125,-2.82375 5.08433,-3.18154 3.98045,-5.94122 -0.29154,-0.72883 -1.41694,-0.92049 -1.66517,-1.66518 -0.2824,-0.84722 -1.00644,-6.62629 -0.83259,-7.4933 0.72659,-3.6237 1.89017,-7.15692 2.49776,-10.80246 0.36722,-2.20332 -1.0961,-7.08864 0,-9.22909 2.13805,-4.17516 2.78076,-13.64172 5.50239,-17.452 0,0 0.29952,13.73788 0,0 7.70396,-10.95701 0.71134,-8.39845 10.19001,-19.07568 8.53074,-9.60943 7.79812,-9.04129 8.53074,-9.60943 3.47085,-2.69158 6.92248,-2.98286 10.69946,-4.87135 1.41346,-0.70673 1.48084,-2.02037 3.28431,-2.46704 3.1541,-0.78117 -10.87379,4.61787 7.18063,-3.77742 9.84678,-4.57875 5.57349,2.56309 3.75025,1.22605 -4.57631,-3.35594 8.21426,-6.24521 10.2478,-6.75352 0.37593,-0.094 -2.24814,0.72426 -1.87201,0.63113 3.45597,-0.85571 -10.1648,3.29915 7.42889,-2.19999 12.98073,-4.05729 14.17554,1.61134 20.65729,0 0.8826,-0.21941 -18.62072,-0.59625 -17.72414,-0.74884 6.59407,-1.12224 36.17723,5.49523 42.19911,7.51941 2.05392,0.6904 2.99695,2.47831 4.98506,3.33036 2.92291,1.25267 4.81297,1.72216 7.49329,3.33035 0.92316,0.5539 2.18792,3.02049 2.49777,3.33036 1.14428,1.14428 2.89931,1.48685 4.16294,2.49777 3.688,2.95038 8.09992,5.90542 10.82367,9.99106 1.59824,2.39738 2.50149,5.03664 3.31501,7.44712 0.25107,0.74376 1.37268,0.93674 1.66518,1.66518 1.58829,3.95548 5.08287,6.70331 6.44757,10.76279 0.77732,2.31217 0.9705,4.35533 1.84184,6.53364 0.42496,1.06244 0.40759,2.26792 0.83259,3.33036 0.54396,1.35992 2.54954,2.67861 3.26886,4.02474 0.8219,1.53812 1.81933,4.28307 2.40396,6.08902 0.45928,1.41886 -0.65875,3.56025 0,4.87777 -1.55113,5.38384 -3.57275,10.72262 -3.45906,15.55314 4.8614,4.40432 1.07345,0.0418 0.93433,0.80458 -4.89908,26.86007 -12.28583,23.36243 -5.26068,22.80968 -9.15991,5.54484 -5.23531,-8.1658 4.5664,-4.87255 -1.83057,-26.68713 -1.64652,4.27597 -4.95987,6.37 -1.45708,0.92087 0,0 -3.08721,8.56673 0,0 6.08258,-27.69203 0,0 -17.09434,17.46799 -6.05698,8.77385 -8.06961,10.78648 -8.55064,8.55064 -16.79866,20.14971 -23.478,29.95307 -0.40057,0.58792 -2.14541,8.3399 -3.33035,10.69496 -0.41693,0.82862 0.30035,2.24689 0,3.13258 -2.57953,7.60976 -8.07768,11.85845 -6.19138,21.24288 -2.81094,20.48094 0.53326,8.87303 -1.03639,28.33693 -19.40533,-2.33945 -1.80347,-0.32561 -5.22385,-0.33554 -0.7447,0.24823 -1.0129,1.22848 -1.66518,1.66518 -2.13771,1.43119 -26.15114,0.83259 -30.80487,0.83259 -5.86763,0 -14.43661,1.58579 -19.34099,-1.9511 z"
           id="path1558-2-6-6-4-2-7-7"
           sodipodi:nodetypes="csscsccscssssscccsssssccssssssssssssssssssssssssccsccsccsssccccsscc" />
      </g>
      <g
         id="g8661-5-6-8-4-0-5-3"
         transform="matrix(0.0606025,0,0,0.04986731,42.894893,232.60895)">
        <path
           style="color:#000000;display:inline;overflow:visible;visibility:visible;fill:#060000;fill-opacity:1;fill-rule:nonzero;stroke:none;stroke-width:5.02063;stroke-linecap:butt;stroke-linejoin:miter;stroke-miterlimit:4;stroke-dasharray:none;stroke-dashoffset:0;stroke-opacity:1;marker:none"
           d="m 306.67947,246.77467 c -46.73813,0 -84.71593,39.08303 -84.71593,87.1813 0,24.04914 9.49351,45.85711 24.82454,61.63432 3.32605,3.42285 10.20431,13.06111 15.98682,22.93219 2.89125,4.93554 5.5468,9.97528 7.44894,14.37322 1.90214,4.39794 2.98273,8.2663 2.98273,10.23179 v 37.82512 2.56607 l 2.46194,-0.0162 2.03584,7.92557 v 5.08341 l 57.85555,-5.18085 0.12625,-0.0162 2.19365,-8.03926 2.27256,-0.0162 v -2.53359 -37.59774 c 0,-1.96549 1.0806,-5.83385 2.98273,-10.23179 1.90214,-4.39794 4.55769,-9.43768 7.44894,-14.37322 5.78251,-9.87109 12.66077,-19.50935 15.98682,-22.93219 15.33103,-15.7772 24.82455,-37.58518 24.82455,-61.63432 0,-48.09828 -37.97782,-87.18131 -84.71593,-87.18131 z m 0,5.08341 c 44.06032,0 79.77627,36.75533 79.77627,82.09789 0,22.67128 -8.93099,43.18315 -23.37263,58.04508 -4.11713,4.23693 -10.81082,13.76151 -16.74434,23.8904 -2.96677,5.06445 -5.70684,10.24068 -7.73301,14.92541 -2.02618,4.68474 -3.40884,8.77901 -3.40884,12.31063 v 35.06416 l -57.03491,0.21113 v -35.27529 c 0,-3.53162 -1.38266,-7.62589 -3.40883,-12.31063 -2.02618,-4.68473 -4.76625,-9.86097 -7.73302,-14.92541 -5.93352,-10.12889 -12.62721,-19.65347 -16.74433,-23.8904 -14.44165,-14.86193 -23.37264,-35.3738 -23.37264,-58.04508 1e-5,-45.34256 35.71594,-82.09789 79.77628,-82.09789 z m 28.42276,241.5838 -56.79818,5.09965 -0.5997,1.03942 -1.86224,3.23195 1.87802,3.23194 0.52079,0.9095 56.81396,-5.08342 0.59971,-1.03941 1.86223,-3.21571 -1.86223,-3.2157 z m 0.55236,10.45916 -57.85555,5.1971 h -0.0789 v 3.00457 l 57.83977,-5.18086 0.0947,-0.0162 z m -0.55236,5.13213 -56.79818,5.09966 -0.58392,1.00693 -1.87802,3.26443 1.87802,3.24819 0.52079,0.89325 56.81396,-5.08341 0.59971,-1.03942 1.86223,-3.21571 -1.86223,-3.2157 z m 0.55236,10.45916 -57.85555,5.1971 h -0.0789 v 3.00457 l 57.83977,-5.18086 0.0947,-0.0162 z m -0.55236,5.13214 -56.79818,5.09965 -0.58392,1.00693 -1.87802,3.26443 1.8938,3.26443 0.50501,0.87701 56.81396,-5.08341 0.59971,-1.03942 1.86223,-3.21571 -1.86223,-3.2157 z m 0.55236,10.45915 -57.85555,5.1971 h -0.0631 v 3.02081 l 9.98979,6.20404 0.22094,-0.9095 h 37.60769 l 0.22094,0.9095 9.87932,-6.20404 z m -43.71519,15.59129 5.88656,3.24819 0.52079,0.29234 v 0.61715 h 16.79168 v -0.61715 l 0.53658,-0.29234 5.87078,-3.24819 z"
           id="path1311-9-3-6-3-1-9-2-6" />
        <path
           style="fill:#000000;stroke:#000000;stroke-width:3.08058px;stroke-linecap:butt;stroke-linejoin:miter;stroke-opacity:1"
           d="m 278.16201,478.40278 c -0.89583,-5.24489 0.17006,-10.58498 0.30822,-15.91468 0.11215,-4.32626 -6.13762,-50.27289 7.23484,-36.40099 3.71553,3.85429 -4.65231,9.06429 -4.65231,9.06429 0,0 -6.06163,-2.74899 -6.75452,-3.96237 -2.57824,-4.51501 -0.72172,-3.95408 -3.79544,-8.25729 -2.01915,-4.24871 -4.53937,-4.26404 -5.86714,-8.42042 -1.8579,-2.32238 -9.10829,-11.48584 -10.05653,-13.38231 -0.11693,-0.23391 0,-0.52301 0,-0.78452 -0.27752,-0.83259 3.98847,5.9249 3.55304,5.16291 -1.79234,-3.1366 -9.0263,-13.78383 -11.03597,-16.79834 -4.16806,-6.2521 -7.57224,-13.01968 -11.67922,-19.18014 -0.77713,-1.1657 -0.15473,4.51359 -0.78386,3.35644 -0.72045,-1.32513 -7.13643,-13.43226 -3.90052,-9.31569 4.68438,5.95925 -0.105,-5.18163 -0.31115,-5.69699 0.40914,-2.03526 0.64115,1.23065 0,0 -1.3742,-5.56408 -4.43236,-4.12984 -5.64563,-7.5601 -0.94125,-2.82375 5.08433,-3.18154 3.98045,-5.94122 -0.29154,-0.72883 -1.41694,-0.92049 -1.66517,-1.66518 -0.2824,-0.84722 -1.00644,-6.62629 -0.83259,-7.4933 0.72659,-3.6237 1.89017,-7.15692 2.49776,-10.80246 0.36722,-2.20332 -1.0961,-7.08864 0,-9.22909 2.13805,-4.17516 2.78076,-13.64172 5.50239,-17.452 0,0 0.29952,13.73788 0,0 7.70396,-10.95701 0.71134,-8.39845 10.19001,-19.07568 8.53074,-9.60943 7.79812,-9.04129 8.53074,-9.60943 3.47085,-2.69158 6.92248,-2.98286 10.69946,-4.87135 1.41346,-0.70673 1.48084,-2.02037 3.28431,-2.46704 3.1541,-0.78117 -10.87379,4.61787 7.18063,-3.77742 9.84678,-4.57875 5.57349,2.56309 3.75025,1.22605 -4.57631,-3.35594 8.21426,-6.24521 10.2478,-6.75352 0.37593,-0.094 -2.24814,0.72426 -1.87201,0.63113 3.45597,-0.85571 -10.1648,3.29915 7.42889,-2.19999 12.98073,-4.05729 14.17554,1.61134 20.65729,0 0.8826,-0.21941 -18.62072,-0.59625 -17.72414,-0.74884 6.59407,-1.12224 36.17723,5.49523 42.19911,7.51941 2.05392,0.6904 2.99695,2.47831 4.98506,3.33036 2.92291,1.25267 4.81297,1.72216 7.49329,3.33035 0.92316,0.5539 2.18792,3.02049 2.49777,3.33036 1.14428,1.14428 2.89931,1.48685 4.16294,2.49777 3.688,2.95038 8.09992,5.90542 10.82367,9.99106 1.59824,2.39738 2.50149,5.03664 3.31501,7.44712 0.25107,0.74376 1.37268,0.93674 1.66518,1.66518 1.58829,3.95548 5.08287,6.70331 6.44757,10.76279 0.77732,2.31217 0.9705,4.35533 1.84184,6.53364 0.42496,1.06244 0.40759,2.26792 0.83259,3.33036 0.54396,1.35992 2.54954,2.67861 3.26886,4.02474 0.8219,1.53812 1.81933,4.28307 2.40396,6.08902 0.45928,1.41886 -0.65875,3.56025 0,4.87777 -1.55113,5.38384 -3.57275,10.72262 -3.45906,15.55314 4.8614,4.40432 1.07345,0.0418 0.93433,0.80458 -4.89908,26.86007 -12.28583,23.36243 -5.26068,22.80968 -9.15991,5.54484 -5.23531,-8.1658 4.5664,-4.87255 -1.83057,-26.68713 -1.64652,4.27597 -4.95987,6.37 -1.45708,0.92087 0,0 -3.08721,8.56673 0,0 6.08258,-27.69203 0,0 -17.09434,17.46799 -6.05698,8.77385 -8.06961,10.78648 -8.55064,8.55064 -16.79866,20.14971 -23.478,29.95307 -0.40057,0.58792 -2.14541,8.3399 -3.33035,10.69496 -0.41693,0.82862 0.30035,2.24689 0,3.13258 -2.57953,7.60976 -8.07768,11.85845 -6.19138,21.24288 -2.81094,20.48094 0.53326,8.87303 -1.03639,28.33693 -19.40533,-2.33945 -1.80347,-0.32561 -5.22385,-0.33554 -0.7447,0.24823 -1.0129,1.22848 -1.66518,1.66518 -2.13771,1.43119 -26.15114,0.83259 -30.80487,0.83259 -5.86763,0 -14.43661,1.58579 -19.34099,-1.9511 z"
           id="path1558-2-6-6-4-2-5-8"
           sodipodi:nodetypes="csscsccscssssscccsssssccssssssssssssssssssssssssccsccsccsssccccsscc" />
      </g>
      <g
         id="g8661-5-6-8-4-0-1-2-4"
         transform="matrix(0.0606025,0,0,0.04986731,58.297793,232.60895)">
        <path
           style="color:#000000;display:inline;overflow:visible;visibility:visible;fill:#060000;fill-opacity:1;fill-rule:nonzero;stroke:none;stroke-width:5.02063;stroke-linecap:butt;stroke-linejoin:miter;stroke-miterlimit:4;stroke-dasharray:none;stroke-dashoffset:0;stroke-opacity:1;marker:none"
           d="m 306.67947,246.77467 c -46.73813,0 -84.71593,39.08303 -84.71593,87.1813 0,24.04914 9.49351,45.85711 24.82454,61.63432 3.32605,3.42285 10.20431,13.06111 15.98682,22.93219 2.89125,4.93554 5.5468,9.97528 7.44894,14.37322 1.90214,4.39794 2.98273,8.2663 2.98273,10.23179 v 37.82512 2.56607 l 2.46194,-0.0162 2.03584,7.92557 v 5.08341 l 57.85555,-5.18085 0.12625,-0.0162 2.19365,-8.03926 2.27256,-0.0162 v -2.53359 -37.59774 c 0,-1.96549 1.0806,-5.83385 2.98273,-10.23179 1.90214,-4.39794 4.55769,-9.43768 7.44894,-14.37322 5.78251,-9.87109 12.66077,-19.50935 15.98682,-22.93219 15.33103,-15.7772 24.82455,-37.58518 24.82455,-61.63432 0,-48.09828 -37.97782,-87.18131 -84.71593,-87.18131 z m 0,5.08341 c 44.06032,0 79.77627,36.75533 79.77627,82.09789 0,22.67128 -8.93099,43.18315 -23.37263,58.04508 -4.11713,4.23693 -10.81082,13.76151 -16.74434,23.8904 -2.96677,5.06445 -5.70684,10.24068 -7.73301,14.92541 -2.02618,4.68474 -3.40884,8.77901 -3.40884,12.31063 v 35.06416 l -57.03491,0.21113 v -35.27529 c 0,-3.53162 -1.38266,-7.62589 -3.40883,-12.31063 -2.02618,-4.68473 -4.76625,-9.86097 -7.73302,-14.92541 -5.93352,-10.12889 -12.62721,-19.65347 -16.74433,-23.8904 -14.44165,-14.86193 -23.37264,-35.3738 -23.37264,-58.04508 1e-5,-45.34256 35.71594,-82.09789 79.77628,-82.09789 z m 28.42276,241.5838 -56.79818,5.09965 -0.5997,1.03942 -1.86224,3.23195 1.87802,3.23194 0.52079,0.9095 56.81396,-5.08342 0.59971,-1.03941 1.86223,-3.21571 -1.86223,-3.2157 z m 0.55236,10.45916 -57.85555,5.1971 h -0.0789 v 3.00457 l 57.83977,-5.18086 0.0947,-0.0162 z m -0.55236,5.13213 -56.79818,5.09966 -0.58392,1.00693 -1.87802,3.26443 1.87802,3.24819 0.52079,0.89325 56.81396,-5.08341 0.59971,-1.03942 1.86223,-3.21571 -1.86223,-3.2157 z m 0.55236,10.45916 -57.85555,5.1971 h -0.0789 v 3.00457 l 57.83977,-5.18086 0.0947,-0.0162 z m -0.55236,5.13214 -56.79818,5.09965 -0.58392,1.00693 -1.87802,3.26443 1.8938,3.26443 0.50501,0.87701 56.81396,-5.08341 0.59971,-1.03942 1.86223,-3.21571 -1.86223,-3.2157 z m 0.55236,10.45915 -57.85555,5.1971 h -0.0631 v 3.02081 l 9.98979,6.20404 0.22094,-0.9095 h 37.60769 l 0.22094,0.9095 9.87932,-6.20404 z m -43.71519,15.59129 5.88656,3.24819 0.52079,0.29234 v 0.61715 h 16.79168 v -0.61715 l 0.53658,-0.29234 5.87078,-3.24819 z"
           id="path1311-9-3-6-3-1-9-6-1-6" />
        <path
           style="fill:#000000;stroke:#000000;stroke-width:3.08058px;stroke-linecap:butt;stroke-linejoin:miter;stroke-opacity:1"
           d="m 278.16201,478.40278 c -0.89583,-5.24489 0.17006,-10.58498 0.30822,-15.91468 0.11215,-4.32626 -6.13762,-50.27289 7.23484,-36.40099 3.71553,3.85429 -4.65231,9.06429 -4.65231,9.06429 0,0 -6.06163,-2.74899 -6.75452,-3.96237 -2.57824,-4.51501 -0.72172,-3.95408 -3.79544,-8.25729 -2.01915,-4.24871 -4.53937,-4.26404 -5.86714,-8.42042 -1.8579,-2.32238 -9.10829,-11.48584 -10.05653,-13.38231 -0.11693,-0.23391 0,-0.52301 0,-0.78452 -0.27752,-0.83259 3.98847,5.9249 3.55304,5.16291 -1.79234,-3.1366 -9.0263,-13.78383 -11.03597,-16.79834 -4.16806,-6.2521 -7.57224,-13.01968 -11.67922,-19.18014 -0.77713,-1.1657 -0.15473,4.51359 -0.78386,3.35644 -0.72045,-1.32513 -7.13643,-13.43226 -3.90052,-9.31569 4.68438,5.95925 -0.105,-5.18163 -0.31115,-5.69699 0.40914,-2.03526 0.64115,1.23065 0,0 -1.3742,-5.56408 -4.43236,-4.12984 -5.64563,-7.5601 -0.94125,-2.82375 5.08433,-3.18154 3.98045,-5.94122 -0.29154,-0.72883 -1.41694,-0.92049 -1.66517,-1.66518 -0.2824,-0.84722 -1.00644,-6.62629 -0.83259,-7.4933 0.72659,-3.6237 1.89017,-7.15692 2.49776,-10.80246 0.36722,-2.20332 -1.0961,-7.08864 0,-9.22909 2.13805,-4.17516 2.78076,-13.64172 5.50239,-17.452 0,0 0.29952,13.73788 0,0 7.70396,-10.95701 0.71134,-8.39845 10.19001,-19.07568 8.53074,-9.60943 7.79812,-9.04129 8.53074,-9.60943 3.47085,-2.69158 6.92248,-2.98286 10.69946,-4.87135 1.41346,-0.70673 1.48084,-2.02037 3.28431,-2.46704 3.1541,-0.78117 -10.87379,4.61787 7.18063,-3.77742 9.84678,-4.57875 5.57349,2.56309 3.75025,1.22605 -4.57631,-3.35594 8.21426,-6.24521 10.2478,-6.75352 0.37593,-0.094 -2.24814,0.72426 -1.87201,0.63113 3.45597,-0.85571 -10.1648,3.29915 7.42889,-2.19999 12.98073,-4.05729 14.17554,1.61134 20.65729,0 0.8826,-0.21941 -18.62072,-0.59625 -17.72414,-0.74884 6.59407,-1.12224 36.17723,5.49523 42.19911,7.51941 2.05392,0.6904 2.99695,2.47831 4.98506,3.33036 2.92291,1.25267 4.81297,1.72216 7.49329,3.33035 0.92316,0.5539 2.18792,3.02049 2.49777,3.33036 1.14428,1.14428 2.89931,1.48685 4.16294,2.49777 3.688,2.95038 8.09992,5.90542 10.82367,9.99106 1.59824,2.39738 2.50149,5.03664 3.31501,7.44712 0.25107,0.74376 1.37268,0.93674 1.66518,1.66518 1.58829,3.95548 5.08287,6.70331 6.44757,10.76279 0.77732,2.31217 0.9705,4.35533 1.84184,6.53364 0.42496,1.06244 0.40759,2.26792 0.83259,3.33036 0.54396,1.35992 2.54954,2.67861 3.26886,4.02474 0.8219,1.53812 1.81933,4.28307 2.40396,6.08902 0.45928,1.41886 -0.65875,3.56025 0,4.87777 -1.55113,5.38384 -3.57275,10.72262 -3.45906,15.55314 4.8614,4.40432 1.07345,0.0418 0.93433,0.80458 -4.89908,26.86007 -12.28583,23.36243 -5.26068,22.80968 -9.15991,5.54484 -5.23531,-8.1658 4.5664,-4.87255 -1.83057,-26.68713 -1.64652,4.27597 -4.95987,6.37 -1.45708,0.92087 0,0 -3.08721,8.56673 0,0 6.08258,-27.69203 0,0 -17.09434,17.46799 -6.05698,8.77385 -8.06961,10.78648 -8.55064,8.55064 -16.79866,20.14971 -23.478,29.95307 -0.40057,0.58792 -2.14541,8.3399 -3.33035,10.69496 -0.41693,0.82862 0.30035,2.24689 0,3.13258 -2.57953,7.60976 -8.07768,11.85845 -6.19138,21.24288 -2.81094,20.48094 0.53326,8.87303 -1.03639,28.33693 -19.40533,-2.33945 -1.80347,-0.32561 -5.22385,-0.33554 -0.7447,0.24823 -1.0129,1.22848 -1.66518,1.66518 -2.13771,1.43119 -26.15114,0.83259 -30.80487,0.83259 -5.86763,0 -14.43661,1.58579 -19.34099,-1.9511 z"
           id="path1558-2-6-6-4-2-7-8-9"
           sodipodi:nodetypes="csscsccscssssscccsssssccssssssssssssssssssssssssccsccsccsssccccsscc" />
      </g>
      <g
         id="g8661-5-6-8-4-0-2"
         transform="matrix(0.0606025,0,0,0.04986731,73.700693,232.60895)">
        <path
           style="color:#000000;display:inline;overflow:visible;visibility:visible;fill:#060000;fill-opacity:1;fill-rule:nonzero;stroke:none;stroke-width:5.02063;stroke-linecap:butt;stroke-linejoin:miter;stroke-miterlimit:4;stroke-dasharray:none;stroke-dashoffset:0;stroke-opacity:1;marker:none"
           d="m 306.67947,246.77467 c -46.73813,0 -84.71593,39.08303 -84.71593,87.1813 0,24.04914 9.49351,45.85711 24.82454,61.63432 3.32605,3.42285 10.20431,13.06111 15.98682,22.93219 2.89125,4.93554 5.5468,9.97528 7.44894,14.37322 1.90214,4.39794 2.98273,8.2663 2.98273,10.23179 v 37.82512 2.56607 l 2.46194,-0.0162 2.03584,7.92557 v 5.08341 l 57.85555,-5.18085 0.12625,-0.0162 2.19365,-8.03926 2.27256,-0.0162 v -2.53359 -37.59774 c 0,-1.96549 1.0806,-5.83385 2.98273,-10.23179 1.90214,-4.39794 4.55769,-9.43768 7.44894,-14.37322 5.78251,-9.87109 12.66077,-19.50935 15.98682,-22.93219 15.33103,-15.7772 24.82455,-37.58518 24.82455,-61.63432 0,-48.09828 -37.97782,-87.18131 -84.71593,-87.18131 z m 0,5.08341 c 44.06032,0 79.77627,36.75533 79.77627,82.09789 0,22.67128 -8.93099,43.18315 -23.37263,58.04508 -4.11713,4.23693 -10.81082,13.76151 -16.74434,23.8904 -2.96677,5.06445 -5.70684,10.24068 -7.73301,14.92541 -2.02618,4.68474 -3.40884,8.77901 -3.40884,12.31063 v 35.06416 l -57.03491,0.21113 v -35.27529 c 0,-3.53162 -1.38266,-7.62589 -3.40883,-12.31063 -2.02618,-4.68473 -4.76625,-9.86097 -7.73302,-14.92541 -5.93352,-10.12889 -12.62721,-19.65347 -16.74433,-23.8904 -14.44165,-14.86193 -23.37264,-35.3738 -23.37264,-58.04508 1e-5,-45.34256 35.71594,-82.09789 79.77628,-82.09789 z m 28.42276,241.5838 -56.79818,5.09965 -0.5997,1.03942 -1.86224,3.23195 1.87802,3.23194 0.52079,0.9095 56.81396,-5.08342 0.59971,-1.03941 1.86223,-3.21571 -1.86223,-3.2157 z m 0.55236,10.45916 -57.85555,5.1971 h -0.0789 v 3.00457 l 57.83977,-5.18086 0.0947,-0.0162 z m -0.55236,5.13213 -56.79818,5.09966 -0.58392,1.00693 -1.87802,3.26443 1.87802,3.24819 0.52079,0.89325 56.81396,-5.08341 0.59971,-1.03942 1.86223,-3.21571 -1.86223,-3.2157 z m 0.55236,10.45916 -57.85555,5.1971 h -0.0789 v 3.00457 l 57.83977,-5.18086 0.0947,-0.0162 z m -0.55236,5.13214 -56.79818,5.09965 -0.58392,1.00693 -1.87802,3.26443 1.8938,3.26443 0.50501,0.87701 56.81396,-5.08341 0.59971,-1.03942 1.86223,-3.21571 -1.86223,-3.2157 z m 0.55236,10.45915 -57.85555,5.1971 h -0.0631 v 3.02081 l 9.98979,6.20404 0.22094,-0.9095 h 37.60769 l 0.22094,0.9095 9.87932,-6.20404 z m -43.71519,15.59129 5.88656,3.24819 0.52079,0.29234 v 0.61715 h 16.79168 v -0.61715 l 0.53658,-0.29234 5.87078,-3.24819 z"
           id="path1311-9-3-6-3-1-9-66" />
        <path
           style="fill:#000000;stroke:#000000;stroke-width:3.08058px;stroke-linecap:butt;stroke-linejoin:miter;stroke-opacity:1"
           d="m 278.16201,478.40278 c -0.89583,-5.24489 0.17006,-10.58498 0.30822,-15.91468 0.11215,-4.32626 -6.13762,-50.27289 7.23484,-36.40099 3.71553,3.85429 -4.65231,9.06429 -4.65231,9.06429 0,0 -6.06163,-2.74899 -6.75452,-3.96237 -2.57824,-4.51501 -0.72172,-3.95408 -3.79544,-8.25729 -2.01915,-4.24871 -4.53937,-4.26404 -5.86714,-8.42042 -1.8579,-2.32238 -9.10829,-11.48584 -10.05653,-13.38231 -0.11693,-0.23391 0,-0.52301 0,-0.78452 -0.27752,-0.83259 3.98847,5.9249 3.55304,5.16291 -1.79234,-3.1366 -9.0263,-13.78383 -11.03597,-16.79834 -4.16806,-6.2521 -7.57224,-13.01968 -11.67922,-19.18014 -0.77713,-1.1657 -0.15473,4.51359 -0.78386,3.35644 -0.72045,-1.32513 -7.13643,-13.43226 -3.90052,-9.31569 4.68438,5.95925 -0.105,-5.18163 -0.31115,-5.69699 0.40914,-2.03526 0.64115,1.23065 0,0 -1.3742,-5.56408 -4.43236,-4.12984 -5.64563,-7.5601 -0.94125,-2.82375 5.08433,-3.18154 3.98045,-5.94122 -0.29154,-0.72883 -1.41694,-0.92049 -1.66517,-1.66518 -0.2824,-0.84722 -1.00644,-6.62629 -0.83259,-7.4933 0.72659,-3.6237 1.89017,-7.15692 2.49776,-10.80246 0.36722,-2.20332 -1.0961,-7.08864 0,-9.22909 2.13805,-4.17516 2.78076,-13.64172 5.50239,-17.452 0,0 0.29952,13.73788 0,0 7.70396,-10.95701 0.71134,-8.39845 10.19001,-19.07568 8.53074,-9.60943 7.79812,-9.04129 8.53074,-9.60943 3.47085,-2.69158 6.92248,-2.98286 10.69946,-4.87135 1.41346,-0.70673 1.48084,-2.02037 3.28431,-2.46704 3.1541,-0.78117 -10.87379,4.61787 7.18063,-3.77742 9.84678,-4.57875 5.57349,2.56309 3.75025,1.22605 -4.57631,-3.35594 8.21426,-6.24521 10.2478,-6.75352 0.37593,-0.094 -2.24814,0.72426 -1.87201,0.63113 3.45597,-0.85571 -10.1648,3.29915 7.42889,-2.19999 12.98073,-4.05729 14.17554,1.61134 20.65729,0 0.8826,-0.21941 -18.62072,-0.59625 -17.72414,-0.74884 6.59407,-1.12224 36.17723,5.49523 42.19911,7.51941 2.05392,0.6904 2.99695,2.47831 4.98506,3.33036 2.92291,1.25267 4.81297,1.72216 7.49329,3.33035 0.92316,0.5539 2.18792,3.02049 2.49777,3.33036 1.14428,1.14428 2.89931,1.48685 4.16294,2.49777 3.688,2.95038 8.09992,5.90542 10.82367,9.99106 1.59824,2.39738 2.50149,5.03664 3.31501,7.44712 0.25107,0.74376 1.37268,0.93674 1.66518,1.66518 1.58829,3.95548 5.08287,6.70331 6.44757,10.76279 0.77732,2.31217 0.9705,4.35533 1.84184,6.53364 0.42496,1.06244 0.40759,2.26792 0.83259,3.33036 0.54396,1.35992 2.54954,2.67861 3.26886,4.02474 0.8219,1.53812 1.81933,4.28307 2.40396,6.08902 0.45928,1.41886 -0.65875,3.56025 0,4.87777 -1.55113,5.38384 -3.57275,10.72262 -3.45906,15.55314 4.8614,4.40432 1.07345,0.0418 0.93433,0.80458 -4.89908,26.86007 -12.28583,23.36243 -5.26068,22.80968 -9.15991,5.54484 -5.23531,-8.1658 4.5664,-4.87255 -1.83057,-26.68713 -1.64652,4.27597 -4.95987,6.37 -1.45708,0.92087 0,0 -3.08721,8.56673 0,0 6.08258,-27.69203 0,0 -17.09434,17.46799 -6.05698,8.77385 -8.06961,10.78648 -8.55064,8.55064 -16.79866,20.14971 -23.478,29.95307 -0.40057,0.58792 -2.14541,8.3399 -3.33035,10.69496 -0.41693,0.82862 0.30035,2.24689 0,3.13258 -2.57953,7.60976 -8.07768,11.85845 -6.19138,21.24288 -2.81094,20.48094 0.53326,8.87303 -1.03639,28.33693 -19.40533,-2.33945 -1.80347,-0.32561 -5.22385,-0.33554 -0.7447,0.24823 -1.0129,1.22848 -1.66518,1.66518 -2.13771,1.43119 -26.15114,0.83259 -30.80487,0.83259 -5.86763,0 -14.43661,1.58579 -19.34099,-1.9511 z"
           id="path1558-2-6-6-4-2-54"
           sodipodi:nodetypes="csscsccscssssscccsssssccssssssssssssssssssssssssccsccsccsssccccsscc" />
      </g>
      <g
         id="g8661-5-6-8-4-0-5-2"
         transform="matrix(0.0606025,0,0,0.04986731,104.50649,232.60895)">
        <path
           style="color:#000000;display:inline;overflow:visible;visibility:visible;fill:#060000;fill-opacity:1;fill-rule:nonzero;stroke:none;stroke-width:5.02063;stroke-linecap:butt;stroke-linejoin:miter;stroke-miterlimit:4;stroke-dasharray:none;stroke-dashoffset:0;stroke-opacity:1;marker:none"
           d="m 306.67947,246.77467 c -46.73813,0 -84.71593,39.08303 -84.71593,87.1813 0,24.04914 9.49351,45.85711 24.82454,61.63432 3.32605,3.42285 10.20431,13.06111 15.98682,22.93219 2.89125,4.93554 5.5468,9.97528 7.44894,14.37322 1.90214,4.39794 2.98273,8.2663 2.98273,10.23179 v 37.82512 2.56607 l 2.46194,-0.0162 2.03584,7.92557 v 5.08341 l 57.85555,-5.18085 0.12625,-0.0162 2.19365,-8.03926 2.27256,-0.0162 v -2.53359 -37.59774 c 0,-1.96549 1.0806,-5.83385 2.98273,-10.23179 1.90214,-4.39794 4.55769,-9.43768 7.44894,-14.37322 5.78251,-9.87109 12.66077,-19.50935 15.98682,-22.93219 15.33103,-15.7772 24.82455,-37.58518 24.82455,-61.63432 0,-48.09828 -37.97782,-87.18131 -84.71593,-87.18131 z m 0,5.08341 c 44.06032,0 79.77627,36.75533 79.77627,82.09789 0,22.67128 -8.93099,43.18315 -23.37263,58.04508 -4.11713,4.23693 -10.81082,13.76151 -16.74434,23.8904 -2.96677,5.06445 -5.70684,10.24068 -7.73301,14.92541 -2.02618,4.68474 -3.40884,8.77901 -3.40884,12.31063 v 35.06416 l -57.03491,0.21113 v -35.27529 c 0,-3.53162 -1.38266,-7.62589 -3.40883,-12.31063 -2.02618,-4.68473 -4.76625,-9.86097 -7.73302,-14.92541 -5.93352,-10.12889 -12.62721,-19.65347 -16.74433,-23.8904 -14.44165,-14.86193 -23.37264,-35.3738 -23.37264,-58.04508 1e-5,-45.34256 35.71594,-82.09789 79.77628,-82.09789 z m 28.42276,241.5838 -56.79818,5.09965 -0.5997,1.03942 -1.86224,3.23195 1.87802,3.23194 0.52079,0.9095 56.81396,-5.08342 0.59971,-1.03941 1.86223,-3.21571 -1.86223,-3.2157 z m 0.55236,10.45916 -57.85555,5.1971 h -0.0789 v 3.00457 l 57.83977,-5.18086 0.0947,-0.0162 z m -0.55236,5.13213 -56.79818,5.09966 -0.58392,1.00693 -1.87802,3.26443 1.87802,3.24819 0.52079,0.89325 56.81396,-5.08341 0.59971,-1.03942 1.86223,-3.21571 -1.86223,-3.2157 z m 0.55236,10.45916 -57.85555,5.1971 h -0.0789 v 3.00457 l 57.83977,-5.18086 0.0947,-0.0162 z m -0.55236,5.13214 -56.79818,5.09965 -0.58392,1.00693 -1.87802,3.26443 1.8938,3.26443 0.50501,0.87701 56.81396,-5.08341 0.59971,-1.03942 1.86223,-3.21571 -1.86223,-3.2157 z m 0.55236,10.45915 -57.85555,5.1971 h -0.0631 v 3.02081 l 9.98979,6.20404 0.22094,-0.9095 h 37.60769 l 0.22094,0.9095 9.87932,-6.20404 z m -43.71519,15.59129 5.88656,3.24819 0.52079,0.29234 v 0.61715 h 16.79168 v -0.61715 l 0.53658,-0.29234 5.87078,-3.24819 z"
           id="path1311-9-3-6-3-1-9-2-61" />
        <path
           style="fill:#000000;stroke:#000000;stroke-width:3.08058px;stroke-linecap:butt;stroke-linejoin:miter;stroke-opacity:1"
           d="m 278.16201,478.40278 c -0.89583,-5.24489 0.17006,-10.58498 0.30822,-15.91468 0.11215,-4.32626 -6.13762,-50.27289 7.23484,-36.40099 3.71553,3.85429 -4.65231,9.06429 -4.65231,9.06429 0,0 -6.06163,-2.74899 -6.75452,-3.96237 -2.57824,-4.51501 -0.72172,-3.95408 -3.79544,-8.25729 -2.01915,-4.24871 -4.53937,-4.26404 -5.86714,-8.42042 -1.8579,-2.32238 -9.10829,-11.48584 -10.05653,-13.38231 -0.11693,-0.23391 0,-0.52301 0,-0.78452 -0.27752,-0.83259 3.98847,5.9249 3.55304,5.16291 -1.79234,-3.1366 -9.0263,-13.78383 -11.03597,-16.79834 -4.16806,-6.2521 -7.57224,-13.01968 -11.67922,-19.18014 -0.77713,-1.1657 -0.15473,4.51359 -0.78386,3.35644 -0.72045,-1.32513 -7.13643,-13.43226 -3.90052,-9.31569 4.68438,5.95925 -0.105,-5.18163 -0.31115,-5.69699 0.40914,-2.03526 0.64115,1.23065 0,0 -1.3742,-5.56408 -4.43236,-4.12984 -5.64563,-7.5601 -0.94125,-2.82375 5.08433,-3.18154 3.98045,-5.94122 -0.29154,-0.72883 -1.41694,-0.92049 -1.66517,-1.66518 -0.2824,-0.84722 -1.00644,-6.62629 -0.83259,-7.4933 0.72659,-3.6237 1.89017,-7.15692 2.49776,-10.80246 0.36722,-2.20332 -1.0961,-7.08864 0,-9.22909 2.13805,-4.17516 2.78076,-13.64172 5.50239,-17.452 0,0 0.29952,13.73788 0,0 7.70396,-10.95701 0.71134,-8.39845 10.19001,-19.07568 8.53074,-9.60943 7.79812,-9.04129 8.53074,-9.60943 3.47085,-2.69158 6.92248,-2.98286 10.69946,-4.87135 1.41346,-0.70673 1.48084,-2.02037 3.28431,-2.46704 3.1541,-0.78117 -10.87379,4.61787 7.18063,-3.77742 9.84678,-4.57875 5.57349,2.56309 3.75025,1.22605 -4.57631,-3.35594 8.21426,-6.24521 10.2478,-6.75352 0.37593,-0.094 -2.24814,0.72426 -1.87201,0.63113 3.45597,-0.85571 -10.1648,3.29915 7.42889,-2.19999 12.98073,-4.05729 14.17554,1.61134 20.65729,0 0.8826,-0.21941 -18.62072,-0.59625 -17.72414,-0.74884 6.59407,-1.12224 36.17723,5.49523 42.19911,7.51941 2.05392,0.6904 2.99695,2.47831 4.98506,3.33036 2.92291,1.25267 4.81297,1.72216 7.49329,3.33035 0.92316,0.5539 2.18792,3.02049 2.49777,3.33036 1.14428,1.14428 2.89931,1.48685 4.16294,2.49777 3.688,2.95038 8.09992,5.90542 10.82367,9.99106 1.59824,2.39738 2.50149,5.03664 3.31501,7.44712 0.25107,0.74376 1.37268,0.93674 1.66518,1.66518 1.58829,3.95548 5.08287,6.70331 6.44757,10.76279 0.77732,2.31217 0.9705,4.35533 1.84184,6.53364 0.42496,1.06244 0.40759,2.26792 0.83259,3.33036 0.54396,1.35992 2.54954,2.67861 3.26886,4.02474 0.8219,1.53812 1.81933,4.28307 2.40396,6.08902 0.45928,1.41886 -0.65875,3.56025 0,4.87777 -1.55113,5.38384 -3.57275,10.72262 -3.45906,15.55314 4.8614,4.40432 1.07345,0.0418 0.93433,0.80458 -4.89908,26.86007 -12.28583,23.36243 -5.26068,22.80968 -9.15991,5.54484 -5.23531,-8.1658 4.5664,-4.87255 -1.83057,-26.68713 -1.64652,4.27597 -4.95987,6.37 -1.45708,0.92087 0,0 -3.08721,8.56673 0,0 6.08258,-27.69203 0,0 -17.09434,17.46799 -6.05698,8.77385 -8.06961,10.78648 -8.55064,8.55064 -16.79866,20.14971 -23.478,29.95307 -0.40057,0.58792 -2.14541,8.3399 -3.33035,10.69496 -0.41693,0.82862 0.30035,2.24689 0,3.13258 -2.57953,7.60976 -8.07768,11.85845 -6.19138,21.24288 -2.81094,20.48094 0.53326,8.87303 -1.03639,28.33693 -19.40533,-2.33945 -1.80347,-0.32561 -5.22385,-0.33554 -0.7447,0.24823 -1.0129,1.22848 -1.66518,1.66518 -2.13771,1.43119 -26.15114,0.83259 -30.80487,0.83259 -5.86763,0 -14.43661,1.58579 -19.34099,-1.9511 z"
           id="path1558-2-6-6-4-2-5-0"
           sodipodi:nodetypes="csscsccscssssscccsssssccssssssssssssssssssssssssccsccsccsssccccsscc" />
      </g>
      <g
         id="g8661-5-6-8-4-0-1-2-45"
         transform="matrix(0.0606025,0,0,0.04986731,119.90938,232.60895)">
        <path
           style="color:#000000;display:inline;overflow:visible;visibility:visible;fill:#060000;fill-opacity:1;fill-rule:nonzero;stroke:none;stroke-width:5.02063;stroke-linecap:butt;stroke-linejoin:miter;stroke-miterlimit:4;stroke-dasharray:none;stroke-dashoffset:0;stroke-opacity:1;marker:none"
           d="m 306.67947,246.77467 c -46.73813,0 -84.71593,39.08303 -84.71593,87.1813 0,24.04914 9.49351,45.85711 24.82454,61.63432 3.32605,3.42285 10.20431,13.06111 15.98682,22.93219 2.89125,4.93554 5.5468,9.97528 7.44894,14.37322 1.90214,4.39794 2.98273,8.2663 2.98273,10.23179 v 37.82512 2.56607 l 2.46194,-0.0162 2.03584,7.92557 v 5.08341 l 57.85555,-5.18085 0.12625,-0.0162 2.19365,-8.03926 2.27256,-0.0162 v -2.53359 -37.59774 c 0,-1.96549 1.0806,-5.83385 2.98273,-10.23179 1.90214,-4.39794 4.55769,-9.43768 7.44894,-14.37322 5.78251,-9.87109 12.66077,-19.50935 15.98682,-22.93219 15.33103,-15.7772 24.82455,-37.58518 24.82455,-61.63432 0,-48.09828 -37.97782,-87.18131 -84.71593,-87.18131 z m 0,5.08341 c 44.06032,0 79.77627,36.75533 79.77627,82.09789 0,22.67128 -8.93099,43.18315 -23.37263,58.04508 -4.11713,4.23693 -10.81082,13.76151 -16.74434,23.8904 -2.96677,5.06445 -5.70684,10.24068 -7.73301,14.92541 -2.02618,4.68474 -3.40884,8.77901 -3.40884,12.31063 v 35.06416 l -57.03491,0.21113 v -35.27529 c 0,-3.53162 -1.38266,-7.62589 -3.40883,-12.31063 -2.02618,-4.68473 -4.76625,-9.86097 -7.73302,-14.92541 -5.93352,-10.12889 -12.62721,-19.65347 -16.74433,-23.8904 -14.44165,-14.86193 -23.37264,-35.3738 -23.37264,-58.04508 1e-5,-45.34256 35.71594,-82.09789 79.77628,-82.09789 z m 28.42276,241.5838 -56.79818,5.09965 -0.5997,1.03942 -1.86224,3.23195 1.87802,3.23194 0.52079,0.9095 56.81396,-5.08342 0.59971,-1.03941 1.86223,-3.21571 -1.86223,-3.2157 z m 0.55236,10.45916 -57.85555,5.1971 h -0.0789 v 3.00457 l 57.83977,-5.18086 0.0947,-0.0162 z m -0.55236,5.13213 -56.79818,5.09966 -0.58392,1.00693 -1.87802,3.26443 1.87802,3.24819 0.52079,0.89325 56.81396,-5.08341 0.59971,-1.03942 1.86223,-3.21571 -1.86223,-3.2157 z m 0.55236,10.45916 -57.85555,5.1971 h -0.0789 v 3.00457 l 57.83977,-5.18086 0.0947,-0.0162 z m -0.55236,5.13214 -56.79818,5.09965 -0.58392,1.00693 -1.87802,3.26443 1.8938,3.26443 0.50501,0.87701 56.81396,-5.08341 0.59971,-1.03942 1.86223,-3.21571 -1.86223,-3.2157 z m 0.55236,10.45915 -57.85555,5.1971 h -0.0631 v 3.02081 l 9.98979,6.20404 0.22094,-0.9095 h 37.60769 l 0.22094,0.9095 9.87932,-6.20404 z m -43.71519,15.59129 5.88656,3.24819 0.52079,0.29234 v 0.61715 h 16.79168 v -0.61715 l 0.53658,-0.29234 5.87078,-3.24819 z"
           id="path1311-9-3-6-3-1-9-6-1-7" />
        <path
           style="fill:#000000;stroke:#000000;stroke-width:3.08058px;stroke-linecap:butt;stroke-linejoin:miter;stroke-opacity:1"
           d="m 278.16201,478.40278 c -0.89583,-5.24489 0.17006,-10.58498 0.30822,-15.91468 0.11215,-4.32626 -6.13762,-50.27289 7.23484,-36.40099 3.71553,3.85429 -4.65231,9.06429 -4.65231,9.06429 0,0 -6.06163,-2.74899 -6.75452,-3.96237 -2.57824,-4.51501 -0.72172,-3.95408 -3.79544,-8.25729 -2.01915,-4.24871 -4.53937,-4.26404 -5.86714,-8.42042 -1.8579,-2.32238 -9.10829,-11.48584 -10.05653,-13.38231 -0.11693,-0.23391 0,-0.52301 0,-0.78452 -0.27752,-0.83259 3.98847,5.9249 3.55304,5.16291 -1.79234,-3.1366 -9.0263,-13.78383 -11.03597,-16.79834 -4.16806,-6.2521 -7.57224,-13.01968 -11.67922,-19.18014 -0.77713,-1.1657 -0.15473,4.51359 -0.78386,3.35644 -0.72045,-1.32513 -7.13643,-13.43226 -3.90052,-9.31569 4.68438,5.95925 -0.105,-5.18163 -0.31115,-5.69699 0.40914,-2.03526 0.64115,1.23065 0,0 -1.3742,-5.56408 -4.43236,-4.12984 -5.64563,-7.5601 -0.94125,-2.82375 5.08433,-3.18154 3.98045,-5.94122 -0.29154,-0.72883 -1.41694,-0.92049 -1.66517,-1.66518 -0.2824,-0.84722 -1.00644,-6.62629 -0.83259,-7.4933 0.72659,-3.6237 1.89017,-7.15692 2.49776,-10.80246 0.36722,-2.20332 -1.0961,-7.08864 0,-9.22909 2.13805,-4.17516 2.78076,-13.64172 5.50239,-17.452 0,0 0.29952,13.73788 0,0 7.70396,-10.95701 0.71134,-8.39845 10.19001,-19.07568 8.53074,-9.60943 7.79812,-9.04129 8.53074,-9.60943 3.47085,-2.69158 6.92248,-2.98286 10.69946,-4.87135 1.41346,-0.70673 1.48084,-2.02037 3.28431,-2.46704 3.1541,-0.78117 -10.87379,4.61787 7.18063,-3.77742 9.84678,-4.57875 5.57349,2.56309 3.75025,1.22605 -4.57631,-3.35594 8.21426,-6.24521 10.2478,-6.75352 0.37593,-0.094 -2.24814,0.72426 -1.87201,0.63113 3.45597,-0.85571 -10.1648,3.29915 7.42889,-2.19999 12.98073,-4.05729 14.17554,1.61134 20.65729,0 0.8826,-0.21941 -18.62072,-0.59625 -17.72414,-0.74884 6.59407,-1.12224 36.17723,5.49523 42.19911,7.51941 2.05392,0.6904 2.99695,2.47831 4.98506,3.33036 2.92291,1.25267 4.81297,1.72216 7.49329,3.33035 0.92316,0.5539 2.18792,3.02049 2.49777,3.33036 1.14428,1.14428 2.89931,1.48685 4.16294,2.49777 3.688,2.95038 8.09992,5.90542 10.82367,9.99106 1.59824,2.39738 2.50149,5.03664 3.31501,7.44712 0.25107,0.74376 1.37268,0.93674 1.66518,1.66518 1.58829,3.95548 5.08287,6.70331 6.44757,10.76279 0.77732,2.31217 0.9705,4.35533 1.84184,6.53364 0.42496,1.06244 0.40759,2.26792 0.83259,3.33036 0.54396,1.35992 2.54954,2.67861 3.26886,4.02474 0.8219,1.53812 1.81933,4.28307 2.40396,6.08902 0.45928,1.41886 -0.65875,3.56025 0,4.87777 -1.55113,5.38384 -3.57275,10.72262 -3.45906,15.55314 4.8614,4.40432 1.07345,0.0418 0.93433,0.80458 -4.89908,26.86007 -12.28583,23.36243 -5.26068,22.80968 -9.15991,5.54484 -5.23531,-8.1658 4.5664,-4.87255 -1.83057,-26.68713 -1.64652,4.27597 -4.95987,6.37 -1.45708,0.92087 0,0 -3.08721,8.56673 0,0 6.08258,-27.69203 0,0 -17.09434,17.46799 -6.05698,8.77385 -8.06961,10.78648 -8.55064,8.55064 -16.79866,20.14971 -23.478,29.95307 -0.40057,0.58792 -2.14541,8.3399 -3.33035,10.69496 -0.41693,0.82862 0.30035,2.24689 0,3.13258 -2.57953,7.60976 -8.07768,11.85845 -6.19138,21.24288 -2.81094,20.48094 0.53326,8.87303 -1.03639,28.33693 -19.40533,-2.33945 -1.80347,-0.32561 -5.22385,-0.33554 -0.7447,0.24823 -1.0129,1.22848 -1.66518,1.66518 -2.13771,1.43119 -26.15114,0.83259 -30.80487,0.83259 -5.86763,0 -14.43661,1.58579 -19.34099,-1.9511 z"
           id="path1558-2-6-6-4-2-7-8-6"
           sodipodi:nodetypes="csscsccscssssscccsssssccssssssssssssssssssssssssccsccsccsssccccsscc" />
      </g>
    </g>
  </g>
</svg>
