<?xml version="1.0" encoding="UTF-8" standalone="no"?>
<svg xmlns="http://www.w3.org/2000/svg" version="1.1" viewBox="0 0 481 834">
   <polyline fill="none" points="35,652 35,72 85,72 85,82" stroke="rgb(0, 0, 0)" stroke-linecap="square" stroke-width="3.0"/>
   <polyline fill="none" points="135,652 135,72 185,72 185,82" stroke="rgb(0, 0, 0)" stroke-linecap="square" stroke-width="3.0"/>
   <polyline fill="none" points="85,52 85,72" stroke="rgb(0, 0, 0)" stroke-linecap="square" stroke-width="3.0"/>
   <polyline fill="none" points="185,52 185,72" stroke="rgb(0, 0, 0)" stroke-linecap="square" stroke-width="3.0"/>
   <polyline fill="none" points="85,112 85,652" stroke="rgb(0, 0, 0)" stroke-linecap="square" stroke-width="3.0"/>
   <polyline fill="none" points="5,352 235,352" stroke="rgb(0, 0, 0)" stroke-linecap="square" stroke-width="3.0"/>
   <polyline fill="none" points="185,112 185,652" stroke="rgb(0, 0, 0)" stroke-linecap="square" stroke-width="3.0"/>
   <polyline fill="none" points="5,142 235,142" stroke="rgb(0, 0, 0)" stroke-linecap="square" stroke-width="3.0"/>
   <polyline fill="none" points="5,212 235,212" stroke="rgb(0, 0, 0)" stroke-linecap="square" stroke-width="3.0"/>
   <polyline fill="none" points="5,282 235,282" stroke="rgb(0, 0, 0)" stroke-linecap="square" stroke-width="3.0"/>
   <polyline fill="none" points="5,422 235,422" stroke="rgb(0, 0, 0)" stroke-linecap="square" stroke-width="3.0"/>
   <polyline fill="none" points="5,492 235,492" stroke="rgb(0, 0, 0)" stroke-linecap="square" stroke-width="3.0"/>
   <polyline fill="none" points="5,562 235,562" stroke="rgb(0, 0, 0)" stroke-linecap="square" stroke-width="3.0"/>
   <polyline fill="none" points="5,632 235,632" stroke="rgb(0, 0, 0)" stroke-linecap="square" stroke-width="3.0"/>
   <polyline fill="none" points="265,222 475,222" stroke="rgb(0, 0, 0)" stroke-linecap="square" stroke-width="3.0"/>
   <polyline fill="none" points="265,362 475,362" stroke="rgb(0, 0, 0)" stroke-linecap="square" stroke-width="3.0"/>
   <polyline fill="none" points="265,502 475,502" stroke="rgb(0, 0, 0)" stroke-linecap="square" stroke-width="3.0"/>
   <polyline fill="none" points="265,642 475,642" stroke="rgb(0, 0, 0)" stroke-linecap="square" stroke-width="3.0"/>
   <polyline fill="none" points="265,292 475,292" stroke="rgb(0, 0, 0)" stroke-linecap="square" stroke-width="3.0"/>
   <polyline fill="none" points="265,432 475,432" stroke="rgb(0, 0, 0)" stroke-linecap="square" stroke-width="3.0"/>
   <polyline fill="none" points="265,572 475,572" stroke="rgb(0, 0, 0)" stroke-linecap="square" stroke-width="3.0"/>
   <polyline fill="none" points="265,152 475,152" stroke="rgb(0, 0, 0)" stroke-linecap="square" stroke-width="3.0"/>
   <polyline fill="none" points="305,742 305,792" stroke="rgb(0, 0, 0)" stroke-linecap="square" stroke-width="3.0"/>
   <polyline fill="none" points="455,742 455,792" stroke="rgb(0, 0, 0)" stroke-linecap="square" stroke-width="3.0"/>
   <polyline fill="none" points="355,742 355,792" stroke="rgb(0, 0, 0)" stroke-linecap="square" stroke-width="3.0"/>
   <polyline fill="none" points="405,742 405,792" stroke="rgb(0, 0, 0)" stroke-linecap="square" stroke-width="3.0"/>
   <ellipse cx="85.0" cy="72.0" fill="rgb(0, 0, 0)" rx="5.0" ry="5.0" stroke="none" stroke-width="3.0"/>
   <ellipse cx="185.0" cy="72.0" fill="rgb(0, 0, 0)" rx="5.0" ry="5.0" stroke="none" stroke-width="3.0"/>
   <path d="M250.0,447.0 A15.0,15.0 90.0 0,0 250.0,417.0" fill="none" stroke="rgb(0, 0, 0)" stroke-width="2.0"/>
   <polyline fill="none" points="250,417 236,417 236,447 250,447" stroke="rgb(0, 0, 0)" stroke-linecap="square" stroke-width="2.0"/>
   <path d="M250.0,517.0 A15.0,15.0 90.0 0,0 250.0,487.0" fill="none" stroke="rgb(0, 0, 0)" stroke-width="2.0"/>
   <polyline fill="none" points="250,487 236,487 236,517 250,517" stroke="rgb(0, 0, 0)" stroke-linecap="square" stroke-width="2.0"/>
   <ellipse cx="395.0" cy="221.0" fill="none" rx="7.5" ry="7.0" stroke="rgb(0, 0, 0)" stroke-width="1.0"/>
   <ellipse cx="445.0" cy="571.0" fill="none" rx="7.5" ry="7.0" stroke="rgb(0, 0, 0)" stroke-width="1.0"/>
   <path d="M250.0,587.0 A15.0,15.0 90.0 0,0 250.0,557.0" fill="none" stroke="rgb(0, 0, 0)" stroke-width="2.0"/>
   <polyline fill="none" points="250,557 236,557 236,587 250,587" stroke="rgb(0, 0, 0)" stroke-linecap="square" stroke-width="2.0"/>
   <ellipse cx="295.0" cy="431.0" fill="none" rx="7.5" ry="7.0" stroke="rgb(0, 0, 0)" stroke-width="1.0"/>
   <ellipse cx="395.0" cy="291.0" fill="none" rx="7.5" ry="7.0" stroke="rgb(0, 0, 0)" stroke-width="1.0"/>
   <ellipse cx="345.0" cy="571.0" fill="none" rx="7.5" ry="7.0" stroke="rgb(0, 0, 0)" stroke-width="1.0"/>
   <ellipse cx="395.0" cy="501.0" fill="none" rx="7.5" ry="7.0" stroke="rgb(0, 0, 0)" stroke-width="1.0"/>
   <path d="M250.0,657.0 A15.0,15.0 90.0 0,0 250.0,627.0" fill="none" stroke="rgb(0, 0, 0)" stroke-width="2.0"/>
   <polyline fill="none" points="250,627 236,627 236,657 250,657" stroke="rgb(0, 0, 0)" stroke-linecap="square" stroke-width="2.0"/>
   <ellipse cx="445.0" cy="151.0" fill="none" rx="7.5" ry="7.0" stroke="rgb(0, 0, 0)" stroke-width="1.0"/>
   <ellipse cx="395.0" cy="431.0" fill="none" rx="7.5" ry="7.0" stroke="rgb(0, 0, 0)" stroke-width="1.0"/>
   <ellipse cx="345.0" cy="291.0" fill="none" rx="7.5" ry="7.0" stroke="rgb(0, 0, 0)" stroke-width="1.0"/>
   <ellipse cx="395.0" cy="361.0" fill="none" rx="7.5" ry="7.0" stroke="rgb(0, 0, 0)" stroke-width="1.0"/>
   <path d="M250.0,307.0 A15.0,15.0 90.0 0,0 250.0,277.0" fill="none" stroke="rgb(0, 0, 0)" stroke-width="2.0"/>
   <polyline fill="none" points="250,277 236,277 236,307 250,307" stroke="rgb(0, 0, 0)" stroke-linecap="square" stroke-width="2.0"/>
   <ellipse cx="395.0" cy="151.0" fill="none" rx="7.5" ry="7.0" stroke="rgb(0, 0, 0)" stroke-width="1.0"/>
   <ellipse cx="295.0" cy="641.0" fill="none" rx="7.5" ry="7.0" stroke="rgb(0, 0, 0)" stroke-width="1.0"/>
   <ellipse cx="345.0" cy="221.0" fill="none" rx="7.5" ry="7.0" stroke="rgb(0, 0, 0)" stroke-width="1.0"/>
   <path d="M250.0,167.0 A15.0,15.0 90.0 0,0 250.0,137.0" fill="none" stroke="rgb(0, 0, 0)" stroke-width="2.0"/>
   <polyline fill="none" points="250,137 236,137 236,167 250,167" stroke="rgb(0, 0, 0)" stroke-linecap="square" stroke-width="2.0"/>
   <ellipse cx="295.0" cy="151.0" fill="none" rx="7.5" ry="7.0" stroke="rgb(0, 0, 0)" stroke-width="1.0"/>
   <ellipse cx="345.0" cy="361.0" fill="none" rx="7.5" ry="7.0" stroke="rgb(0, 0, 0)" stroke-width="1.0"/>
   <ellipse cx="445.0" cy="501.0" fill="none" rx="7.5" ry="7.0" stroke="rgb(0, 0, 0)" stroke-width="1.0"/>
   <ellipse cx="345.0" cy="151.0" fill="none" rx="7.5" ry="7.0" stroke="rgb(0, 0, 0)" stroke-width="1.0"/>
   <ellipse cx="395.0" cy="571.0" fill="none" rx="7.5" ry="7.0" stroke="rgb(0, 0, 0)" stroke-width="1.0"/>
   <ellipse cx="395.0" cy="641.0" fill="none" rx="7.5" ry="7.0" stroke="rgb(0, 0, 0)" stroke-width="1.0"/>
   <ellipse cx="445.0" cy="291.0" fill="none" rx="7.5" ry="7.0" stroke="rgb(0, 0, 0)" stroke-width="1.0"/>
   <ellipse cx="345.0" cy="641.0" fill="none" rx="7.5" ry="7.0" stroke="rgb(0, 0, 0)" stroke-width="1.0"/>
   <ellipse cx="345.0" cy="501.0" fill="none" rx="7.5" ry="7.0" stroke="rgb(0, 0, 0)" stroke-width="1.0"/>
   <ellipse cx="295.0" cy="291.0" fill="none" rx="7.5" ry="7.0" stroke="rgb(0, 0, 0)" stroke-width="1.0"/>
   <path d="M250.0,237.0 A15.0,15.0 90.0 0,0 250.0,207.0" fill="none" stroke="rgb(0, 0, 0)" stroke-width="2.0"/>
   <polyline fill="none" points="250,207 236,207 236,237 250,237" stroke="rgb(0, 0, 0)" stroke-linecap="square" stroke-width="2.0"/>
   <ellipse cx="295.0" cy="221.0" fill="none" rx="7.5" ry="7.0" stroke="rgb(0, 0, 0)" stroke-width="1.0"/>
   <ellipse cx="445.0" cy="221.0" fill="none" rx="7.5" ry="7.0" stroke="rgb(0, 0, 0)" stroke-width="1.0"/>
   <ellipse cx="445.0" cy="641.0" fill="none" rx="7.5" ry="7.0" stroke="rgb(0, 0, 0)" stroke-width="1.0"/>
   <ellipse cx="445.0" cy="361.0" fill="none" rx="7.5" ry="7.0" stroke="rgb(0, 0, 0)" stroke-width="1.0"/>
   <ellipse cx="295.0" cy="571.0" fill="none" rx="7.5" ry="7.0" stroke="rgb(0, 0, 0)" stroke-width="1.0"/>
   <ellipse cx="345.0" cy="431.0" fill="none" rx="7.5" ry="7.0" stroke="rgb(0, 0, 0)" stroke-width="1.0"/>
   <ellipse cx="445.0" cy="431.0" fill="none" rx="7.5" ry="7.0" stroke="rgb(0, 0, 0)" stroke-width="1.0"/>
   <ellipse cx="295.0" cy="361.0" fill="none" rx="7.5" ry="7.0" stroke="rgb(0, 0, 0)" stroke-width="1.0"/>
   <ellipse cx="295.0" cy="501.0" fill="none" rx="7.5" ry="7.0" stroke="rgb(0, 0, 0)" stroke-width="1.0"/>
   <path d="M250.0,377.0 A15.0,15.0 90.0 0,0 250.0,347.0" fill="none" stroke="rgb(0, 0, 0)" stroke-width="2.0"/>
   <polyline fill="none" points="250,347 236,347 236,377 250,377" stroke="rgb(0, 0, 0)" stroke-linecap="square" stroke-width="2.0"/>
   <polygon fill="none" points="85,102 92,83 78,83" stroke="rgb(0, 0, 0)" stroke-linecap="square" stroke-width="2.0"/>
   <ellipse fill="none" rx="4.5" ry="4.5" stroke="rgb(0, 0, 0)" stroke-width="2.0" transform="translate(85.0 107.0) rotate(90)"/>
   <ellipse cx="85.0" cy="112.0" fill="rgb(0, 0, 0)" rx="2.0" ry="2.0" stroke="none" stroke-width="2.0"/>
   <ellipse cx="85.0" cy="82.0" fill="rgb(0, 0, 0)" rx="2.0" ry="2.0" stroke="none" stroke-width="2.0"/>
   <polygon fill="none" points="185,102 192,83 178,83" stroke="rgb(0, 0, 0)" stroke-linecap="square" stroke-width="2.0"/>
   <ellipse fill="none" rx="4.5" ry="4.5" stroke="rgb(0, 0, 0)" stroke-width="2.0" transform="translate(185.0 107.0) rotate(90)"/>
   <ellipse cx="185.0" cy="112.0" fill="rgb(0, 0, 0)" rx="2.0" ry="2.0" stroke="none" stroke-width="2.0"/>
   <ellipse cx="185.0" cy="82.0" fill="rgb(0, 0, 0)" rx="2.0" ry="2.0" stroke="none" stroke-width="2.0"/>
   <text fill="rgb(0, 0, 0)" font-family="SansSerif" font-size="16" font-weight="bold" x="84.0" y="24.0">input</text>
   <text fill="rgb(0, 0, 0)" font-family="SansSerif" font-size="16" font-weight="bold" x="337.0" y="90.0">OR plane</text>
   <text fill="rgb(0, 0, 0)" font-family="SansSerif" font-size="16" font-weight="bold" x="64.0" y="697.0">AND plane</text>
   <polyline fill="none" points="295,132 295,712 295,714" stroke="rgb(0, 0, 0)" stroke-linecap="square" stroke-width="3.0"/>
   <path d=" M305.0,742.0 C320.0,732.0 320.0,732.0 320.0,712.0 C305.0,720.0 305.0,720.0 290.0,712.0 C290.0,732.0 290.0,732.0 305.0,742.0 Z" fill="none" stroke="rgb(0, 0, 0)" stroke-linecap="square" stroke-width="2.0"/>
   <polyline fill="none" points="345,132 345,712 345,714" stroke="rgb(0, 0, 0)" stroke-linecap="square" stroke-width="3.0"/>
   <path d=" M355.0,742.0 C370.0,732.0 370.0,732.0 370.0,712.0 C355.0,720.0 355.0,720.0 340.0,712.0 C340.0,732.0 340.0,732.0 355.0,742.0 Z" fill="none" stroke="rgb(0, 0, 0)" stroke-linecap="square" stroke-width="2.0"/>
   <polyline fill="none" points="445,132 445,712 445,714" stroke="rgb(0, 0, 0)" stroke-linecap="square" stroke-width="3.0"/>
   <path d=" M455.0,742.0 C470.0,732.0 470.0,732.0 470.0,712.0 C455.0,720.0 455.0,720.0 440.0,712.0 C440.0,732.0 440.0,732.0 455.0,742.0 Z" fill="none" stroke="rgb(0, 0, 0)" stroke-linecap="square" stroke-width="2.0"/>
   <polyline fill="none" points="395,132 395,712 395,714" stroke="rgb(0, 0, 0)" stroke-linecap="square" stroke-width="3.0"/>
   <path d=" M405.0,742.0 C420.0,732.0 420.0,732.0 420.0,712.0 C405.0,720.0 405.0,720.0 390.0,712.0 C390.0,732.0 390.0,732.0 405.0,742.0 Z" fill="none" stroke="rgb(0, 0, 0)" stroke-linecap="square" stroke-width="2.0"/>
   <text fill="rgb(0, 0, 0)" font-family="SansSerif" font-size="16" font-weight="bold" x="351.0" y="821.0">output</text>
   <ellipse cx="35.0" cy="281.0" fill="none" rx="7.5" ry="7.0" stroke="rgb(0, 0, 0)" stroke-width="1.0"/>
   <ellipse cx="85.0" cy="141.0" fill="none" rx="7.5" ry="7.0" stroke="rgb(0, 0, 0)" stroke-width="1.0"/>
   <ellipse cx="135.0" cy="631.0" fill="none" rx="7.5" ry="7.0" stroke="rgb(0, 0, 0)" stroke-width="1.0"/>
   <ellipse cx="35.0" cy="491.0" fill="none" rx="7.5" ry="7.0" stroke="rgb(0, 0, 0)" stroke-width="1.0"/>
   <ellipse cx="135.0" cy="351.0" fill="none" rx="7.5" ry="7.0" stroke="rgb(0, 0, 0)" stroke-width="1.0"/>
   <ellipse cx="85.0" cy="491.0" fill="none" rx="7.5" ry="7.0" stroke="rgb(0, 0, 0)" stroke-width="1.0"/>
   <ellipse cx="135.0" cy="211.0" fill="none" rx="7.5" ry="7.0" stroke="rgb(0, 0, 0)" stroke-width="1.0"/>
   <ellipse cx="85.0" cy="421.0" fill="none" rx="7.5" ry="7.0" stroke="rgb(0, 0, 0)" stroke-width="1.0"/>
   <ellipse cx="185.0" cy="211.0" fill="none" rx="7.5" ry="7.0" stroke="rgb(0, 0, 0)" stroke-width="1.0"/>
   <ellipse cx="135.0" cy="491.0" fill="none" rx="7.5" ry="7.0" stroke="rgb(0, 0, 0)" stroke-width="1.0"/>
   <ellipse cx="85.0" cy="211.0" fill="none" rx="7.5" ry="7.0" stroke="rgb(0, 0, 0)" stroke-width="1.0"/>
   <ellipse cx="185.0" cy="631.0" fill="none" rx="7.5" ry="7.0" stroke="rgb(0, 0, 0)" stroke-width="1.0"/>
   <ellipse cx="185.0" cy="491.0" fill="none" rx="7.5" ry="7.0" stroke="rgb(0, 0, 0)" stroke-width="1.0"/>
   <ellipse cx="185.0" cy="141.0" fill="none" rx="7.5" ry="7.0" stroke="rgb(0, 0, 0)" stroke-width="1.0"/>
   <ellipse cx="85.0" cy="351.0" fill="none" rx="7.5" ry="7.0" stroke="rgb(0, 0, 0)" stroke-width="1.0"/>
   <ellipse cx="185.0" cy="561.0" fill="none" rx="7.5" ry="7.0" stroke="rgb(0, 0, 0)" stroke-width="1.0"/>
   <ellipse cx="85.0" cy="281.0" fill="none" rx="7.5" ry="7.0" stroke="rgb(0, 0, 0)" stroke-width="1.0"/>
   <ellipse cx="135.0" cy="421.0" fill="none" rx="7.5" ry="7.0" stroke="rgb(0, 0, 0)" stroke-width="1.0"/>
   <ellipse cx="35.0" cy="421.0" fill="none" rx="7.5" ry="7.0" stroke="rgb(0, 0, 0)" stroke-width="1.0"/>
   <ellipse cx="35.0" cy="211.0" fill="none" rx="7.5" ry="7.0" stroke="rgb(0, 0, 0)" stroke-width="1.0"/>
   <ellipse cx="185.0" cy="281.0" fill="none" rx="7.5" ry="7.0" stroke="rgb(0, 0, 0)" stroke-width="1.0"/>
   <ellipse cx="135.0" cy="561.0" fill="none" rx="7.5" ry="7.0" stroke="rgb(0, 0, 0)" stroke-width="1.0"/>
   <ellipse cx="35.0" cy="141.0" fill="none" rx="7.5" ry="7.0" stroke="rgb(0, 0, 0)" stroke-width="1.0"/>
   <ellipse cx="35.0" cy="561.0" fill="none" rx="7.5" ry="7.0" stroke="rgb(0, 0, 0)" stroke-width="1.0"/>
   <ellipse cx="185.0" cy="351.0" fill="none" rx="7.5" ry="7.0" stroke="rgb(0, 0, 0)" stroke-width="1.0"/>
   <ellipse cx="135.0" cy="141.0" fill="none" rx="7.5" ry="7.0" stroke="rgb(0, 0, 0)" stroke-width="1.0"/>
   <ellipse cx="85.0" cy="631.0" fill="none" rx="7.5" ry="7.0" stroke="rgb(0, 0, 0)" stroke-width="1.0"/>
   <ellipse cx="135.0" cy="281.0" fill="none" rx="7.5" ry="7.0" stroke="rgb(0, 0, 0)" stroke-width="1.0"/>
   <ellipse cx="35.0" cy="351.0" fill="none" rx="7.5" ry="7.0" stroke="rgb(0, 0, 0)" stroke-width="1.0"/>
   <ellipse cx="35.0" cy="631.0" fill="none" rx="7.5" ry="7.0" stroke="rgb(0, 0, 0)" stroke-width="1.0"/>
   <ellipse cx="185.0" cy="421.0" fill="none" rx="7.5" ry="7.0" stroke="rgb(0, 0, 0)" stroke-width="1.0"/>
   <ellipse cx="85.0" cy="561.0" fill="none" rx="7.5" ry="7.0" stroke="rgb(0, 0, 0)" stroke-width="1.0"/>
</svg>
