<?xml version="1.0" encoding="UTF-8" standalone="no"?>
<svg xmlns="http://www.w3.org/2000/svg" version="1.1" viewBox="0 0 382 318">
   <polyline fill="none" points="96,193 96,203 156,203 156,213" stroke="rgb(0, 0, 0)" stroke-linecap="square" stroke-width="3.0"/>
   <polyline fill="none" points="336,83 356,83" stroke="rgb(0, 0, 0)" stroke-linecap="square" stroke-width="3.0"/>
   <polyline fill="none" points="176,273 176,283" stroke="rgb(0, 0, 0)" stroke-linecap="square" stroke-width="3.0"/>
   <polyline fill="none" points="26,63 76,63" stroke="rgb(0, 0, 0)" stroke-linecap="square" stroke-width="3.0"/>
   <polyline fill="none" points="206,33 206,63 216,63" stroke="rgb(0, 0, 0)" stroke-linecap="square" stroke-width="3.0"/>
   <polyline fill="none" points="256,103 256,133" stroke="rgb(0, 0, 0)" stroke-linecap="square" stroke-width="3.0"/>
   <polyline fill="none" points="196,213 196,203 236,203 236,193" stroke="rgb(0, 0, 0)" stroke-linecap="square" stroke-width="3.0"/>
   <polyline fill="none" points="116,103 116,133" stroke="rgb(0, 0, 0)" stroke-linecap="square" stroke-width="3.0"/>
   <ellipse cx="256.0" cy="103.0" fill="rgb(0, 0, 0)" rx="5.0" ry="5.0" stroke="none" stroke-width="3.0"/>
   <ellipse cx="216.0" cy="63.0" fill="rgb(0, 0, 0)" rx="5.0" ry="5.0" stroke="none" stroke-width="3.0"/>
   <ellipse cx="116.0" cy="103.0" fill="rgb(0, 0, 0)" rx="5.0" ry="5.0" stroke="none" stroke-width="3.0"/>
   <ellipse cx="76.0" cy="63.0" fill="rgb(0, 0, 0)" rx="5.0" ry="5.0" stroke="none" stroke-width="3.0"/>
   <path d="M71.0,158.0 A25.0,25.0 180.0 0,0 121.0,158.0" fill="none" stroke="rgb(0, 0, 0)" stroke-width="2.0"/>
   <polyline fill="none" points="121,158 121,134 71,134 71,158" stroke="rgb(0, 0, 0)" stroke-linecap="square" stroke-width="2.0"/>
   <ellipse fill="none" rx="4.5" ry="4.5" stroke="rgb(0, 0, 0)" stroke-width="2.0" transform="translate(96.0 188.0) rotate(90)"/>
   <path d="M151.0,238.0 A25.0,25.0 180.0 0,0 201.0,238.0" fill="none" stroke="rgb(0, 0, 0)" stroke-width="2.0"/>
   <polyline fill="none" points="201,238 201,214 151,214 151,238" stroke="rgb(0, 0, 0)" stroke-linecap="square" stroke-width="2.0"/>
   <ellipse fill="none" rx="4.5" ry="4.5" stroke="rgb(0, 0, 0)" stroke-width="2.0" transform="translate(176.0 268.0) rotate(90)"/>
   <polyline fill="none" points="76,133 76,63 136,63 138,63" stroke="rgb(0, 0, 0)" stroke-linecap="square" stroke-width="3.0"/>
   <polyline fill="none" points="26,103 116,103 136,103 138,103" stroke="rgb(0, 0, 0)" stroke-linecap="square" stroke-width="3.0"/>
   <path d=" M196.0,83.0 C176.0,58.0 176.0,58.0 146.0,58.0 C159.0,83.0 159.0,83.0 146.0,108.0 C176.0,108.0 176.0,108.0 196.0,83.0 Z" fill="none" stroke="rgb(0, 0, 0)" stroke-linecap="square" stroke-width="2.0"/>
   <path d=" M136.0,58.0 C149.0,83.0 149.0,83.0 136.0,108.0" fill="none" stroke="rgb(0, 0, 0)" stroke-linecap="square" stroke-width="2.0"/>
   <path d="M211.0,158.0 A25.0,25.0 180.0 0,0 261.0,158.0" fill="none" stroke="rgb(0, 0, 0)" stroke-width="2.0"/>
   <polyline fill="none" points="261,158 261,134 211,134 211,158" stroke="rgb(0, 0, 0)" stroke-linecap="square" stroke-width="2.0"/>
   <ellipse fill="none" rx="4.5" ry="4.5" stroke="rgb(0, 0, 0)" stroke-width="2.0" transform="translate(236.0 188.0) rotate(90)"/>
   <polyline fill="none" points="216,133 216,63 276,63 278,63" stroke="rgb(0, 0, 0)" stroke-linecap="square" stroke-width="3.0"/>
   <polyline fill="none" points="196,83 206,83 206,103 256,103 276,103 278,103" stroke="rgb(0, 0, 0)" stroke-linecap="square" stroke-width="3.0"/>
   <path d=" M336.0,83.0 C316.0,58.0 316.0,58.0 286.0,58.0 C299.0,83.0 299.0,83.0 286.0,108.0 C316.0,108.0 316.0,108.0 336.0,83.0 Z" fill="none" stroke="rgb(0, 0, 0)" stroke-linecap="square" stroke-width="2.0"/>
   <path d=" M276.0,58.0 C289.0,83.0 289.0,83.0 276.0,108.0" fill="none" stroke="rgb(0, 0, 0)" stroke-linecap="square" stroke-width="2.0"/>
   <text fill="rgb(0, 0, 0)" font-family="SansSerif" font-size="12" x="166.0" y="300.0">C</text>
   <text fill="rgb(0, 0, 0)" font-family="SansSerif" font-size="12" x="177.0" y="306.0">out</text>
   <text fill="rgb(0, 0, 0)" font-family="SansSerif" font-size="12" x="198.0" y="21.0">C</text>
   <text fill="rgb(0, 0, 0)" font-family="SansSerif" font-size="12" x="209.0" y="25.0">in</text>
   <text fill="rgb(0, 0, 0)" font-family="SansSerif" font-size="12" x="365.0" y="87.0">S</text>
   <text fill="rgb(0, 0, 0)" font-family="SansSerif" font-size="12" x="9.0" y="108.0">Y</text>
   <text fill="rgb(0, 0, 0)" font-family="SansSerif" font-size="12" x="9.0" y="65.0">X</text>
</svg>
