<?xml version="1.0" encoding="UTF-8" standalone="no"?>
<svg
   version="1.1"
   viewBox="0 0 320 190"
   id="svg172"
   sodipodi:docname="registerSymbol.svg"
   inkscape:version="1.1.2 (0a00cf5339, 2022-02-04)"
   xmlns:inkscape="http://www.inkscape.org/namespaces/inkscape"
   xmlns:sodipodi="http://sodipodi.sourceforge.net/DTD/sodipodi-0.dtd"
   xmlns="http://www.w3.org/2000/svg"
   xmlns:svg="http://www.w3.org/2000/svg">
  <defs
     id="defs176" />
  <sodipodi:namedview
     id="namedview174"
     pagecolor="#ffffff"
     bordercolor="#666666"
     borderopacity="1.0"
     inkscape:pageshadow="2"
     inkscape:pageopacity="0.0"
     inkscape:pagecheckerboard="0"
     showgrid="false"
     inkscape:zoom="4.18125"
     inkscape:cx="159.88042"
     inkscape:cy="95.067265"
     inkscape:window-width="2486"
     inkscape:window-height="1376"
     inkscape:window-x="74"
     inkscape:window-y="27"
     inkscape:window-maximized="1"
     inkscape:current-layer="svg172" />
  <polyline
     fill="none"
     points="95,75 145,75"
     stroke="rgb(0, 0, 0)"
     stroke-linecap="square"
     stroke-width="4.0"
     id="polyline2" />
  <polyline
     fill="none"
     points="145,115 145,175 65,175"
     stroke="rgb(0, 0, 0)"
     stroke-linecap="square"
     stroke-width="3.0"
     id="polyline4" />
  <polyline
     fill="none"
     points="205,75 245,75"
     stroke="rgb(0, 0, 0)"
     stroke-linecap="square"
     stroke-width="4.0"
     id="polyline6" />
  <polyline
     fill="none"
     points="45,85 75,85 89,85"
     stroke="rgb(0, 0, 0)"
     stroke-linecap="square"
     stroke-width="3.0"
     id="polyline8" />
  <polyline
     fill="none"
     points="45,95 75,95 89,95"
     stroke="rgb(0, 0, 0)"
     stroke-linecap="square"
     stroke-width="3.0"
     id="polyline10" />
  <polyline
     fill="none"
     points="45,105 75,105 89,105"
     stroke="rgb(0, 0, 0)"
     stroke-linecap="square"
     stroke-width="3.0"
     id="polyline12" />
  <polyline
     fill="none"
     points="45,115 75,115 89,115"
     stroke="rgb(0, 0, 0)"
     stroke-linecap="square"
     stroke-width="3.0"
     id="polyline14" />
  <polyline
     fill="none"
     points="89,114 89,81 94,76"
     stroke="rgb(0, 0, 0)"
     stroke-linecap="square"
     stroke-width="5.0"
     id="polyline16" />
  <ellipse
     cx="95.0"
     cy="75.0"
     fill="rgb(0, 0, 0)"
     rx="2.0"
     ry="2.0"
     stroke="none"
     stroke-width="5.0"
     id="ellipse26" />
  <ellipse
     cx="75.0"
     cy="85.0"
     fill="rgb(0, 0, 0)"
     rx="2.0"
     ry="2.0"
     stroke="none"
     stroke-width="5.0"
     id="ellipse28" />
  <ellipse
     cx="75.0"
     cy="95.0"
     fill="rgb(0, 0, 0)"
     rx="2.0"
     ry="2.0"
     stroke="none"
     stroke-width="5.0"
     id="ellipse30" />
  <ellipse
     cx="75.0"
     cy="105.0"
     fill="rgb(0, 0, 0)"
     rx="2.0"
     ry="2.0"
     stroke="none"
     stroke-width="5.0"
     id="ellipse32" />
  <ellipse
     cx="75.0"
     cy="115.0"
     fill="rgb(0, 0, 0)"
     rx="2.0"
     ry="2.0"
     stroke="none"
     stroke-width="5.0"
     id="ellipse34" />
  <polyline
     fill="none"
     points="295,15 265,15 265,35 251,35"
     stroke="rgb(0, 0, 0)"
     stroke-linecap="square"
     stroke-width="3.0"
     id="polyline36" />
  <polyline
     fill="none"
     points="295,45 265,45 251,45"
     stroke="rgb(0, 0, 0)"
     stroke-linecap="square"
     stroke-width="3.0"
     id="polyline38" />
  <polyline
     fill="none"
     points="295,75 285,75 285,55 265,55 251,55"
     stroke="rgb(0, 0, 0)"
     stroke-linecap="square"
     stroke-width="3.0"
     id="polyline40" />
  <polyline
     fill="none"
     points="295,115 265,115 265,65 251,65"
     stroke="rgb(0, 0, 0)"
     stroke-linecap="square"
     stroke-width="3.0"
     id="polyline42" />
  <polyline
     fill="none"
     points="251,36 251,69 246,74"
     stroke="rgb(0, 0, 0)"
     stroke-linecap="square"
     stroke-width="5.0"
     id="polyline44" />
  <ellipse
     cx="245.0"
     cy="75.0"
     fill="rgb(0, 0, 0)"
     rx="2.0"
     ry="2.0"
     stroke="none"
     stroke-width="5.0"
     id="ellipse54" />
  <ellipse
     cx="265.0"
     cy="35.0"
     fill="rgb(0, 0, 0)"
     rx="2.0"
     ry="2.0"
     stroke="none"
     stroke-width="5.0"
     id="ellipse56" />
  <ellipse
     cx="265.0"
     cy="45.0"
     fill="rgb(0, 0, 0)"
     rx="2.0"
     ry="2.0"
     stroke="none"
     stroke-width="5.0"
     id="ellipse58" />
  <ellipse
     cx="265.0"
     cy="55.0"
     fill="rgb(0, 0, 0)"
     rx="2.0"
     ry="2.0"
     stroke="none"
     stroke-width="5.0"
     id="ellipse60" />
  <ellipse
     cx="265.0"
     cy="65.0"
     fill="rgb(0, 0, 0)"
     rx="2.0"
     ry="2.0"
     stroke="none"
     stroke-width="5.0"
     id="ellipse62" />
  <polyline
     fill="none"
     points="155,65 194,65"
     stroke="rgb(0, 0, 0)"
     stroke-linecap="square"
     stroke-width="2.0"
     id="polyline64" />
  <polyline
     fill="none"
     points="195,65 195,124"
     stroke="rgb(0, 0, 0)"
     stroke-linecap="square"
     stroke-width="2.0"
     id="polyline66" />
  <polyline
     fill="none"
     points="195,125 156,125"
     stroke="rgb(0, 0, 0)"
     stroke-linecap="square"
     stroke-width="2.0"
     id="polyline68" />
  <polyline
     fill="none"
     points="155,125 155,66"
     stroke="rgb(0, 0, 0)"
     stroke-linecap="square"
     stroke-width="2.0"
     id="polyline70" />
  <polyline
     fill="none"
     points="195,70 200,70 200,130 160,130 160,125"
     stroke="rgb(0, 0, 0)"
     stroke-linecap="square"
     stroke-width="2.0"
     id="polyline72" />
  <polyline
     fill="none"
     points="200,75 205,75 205,135 165,135 165,130"
     stroke="rgb(0, 0, 0)"
     stroke-linecap="square"
     stroke-width="2.0"
     id="polyline74" />
  <polyline
     fill="none"
     points="145,75 153,75"
     stroke="rgb(0, 0, 0)"
     stroke-linecap="square"
     stroke-width="5.0"
     id="polyline76" />
  <polyline
     fill="none"
     points="197,75 205,75"
     stroke="rgb(0, 0, 0)"
     stroke-linecap="square"
     stroke-width="5.0"
     id="polyline78" />
  <text
     fill="rgb(0, 0, 0)"
     font-family="SansSerif"
     font-size="12"
     x="159.0"
     y="79.0"
     id="text80">D</text>
  <text
     fill="rgb(0, 0, 0)"
     font-family="SansSerif"
     font-size="12"
     x="182.0"
     y="79.0"
     id="text82">Q</text>
  <polyline
     fill="none"
     points="175,126 175,135"
     stroke="rgb(0, 0, 0)"
     stroke-linecap="square"
     stroke-width="2.0"
     id="polyline84" />
  <text
     fill="rgb(0, 0, 0)"
     font-family="SansSerif"
     font-size="12"
     x="158.0"
     y="99.0"
     id="text88">WE</text>
  <polyline
     fill="none"
     points="145,95 154,95"
     stroke="rgb(0, 0, 0)"
     stroke-linecap="square"
     stroke-width="2.0"
     id="polyline90" />
  <polyline
     fill="none"
     points="156,111 163,115 156,119"
     stroke="rgb(0, 0, 0)"
     stroke-linecap="square"
     stroke-width="2.0"
     id="polyline92" />
  <polyline
     fill="none"
     points="145,115 154,115"
     stroke="rgb(0, 0, 0)"
     stroke-linecap="square"
     stroke-width="2.0"
     id="polyline94" />
  <ellipse
     cx="145.0"
     cy="75.0"
     fill="rgb(0, 0, 0)"
     rx="2.0"
     ry="2.0"
     stroke="none"
     stroke-width="1.0"
     id="ellipse96" />
  <ellipse
     cx="205.0"
     cy="75.0"
     fill="rgb(0, 0, 0)"
     rx="2.0"
     ry="2.0"
     stroke="none"
     stroke-width="1.0"
     id="ellipse98" />
  <ellipse
     cx="175.0"
     cy="135.0"
     fill="rgb(0, 0, 0)"
     rx="2.0"
     ry="2.0"
     stroke="none"
     stroke-width="1.0"
     id="ellipse100" />
  <ellipse
     cx="145.0"
     cy="95.0"
     fill="rgb(0, 0, 0)"
     rx="2.0"
     ry="2.0"
     stroke="none"
     stroke-width="1.0"
     id="ellipse102" />
  <ellipse
     cx="145.0"
     cy="115.0"
     fill="rgb(0, 0, 0)"
     rx="2.0"
     ry="2.0"
     stroke="none"
     stroke-width="1.0"
     id="ellipse104" />
  <rect
     fill="rgb(64, 64, 64)"
     height="48"
     stroke="none"
     stroke-linecap="square"
     stroke-width="1.0"
     width="38"
     x="6"
     y="76"
     id="rect106" />
  <rect
     fill="rgb(255, 255, 255)"
     height="6"
     stroke="none"
     stroke-linecap="square"
     stroke-width="1.0"
     width="20"
     x="9"
     y="82"
     id="rect108" />
  <text
     fill="rgb(255, 255, 255)"
     font-family="SansSerif"
     font-size="12"
     transform="rotate(90.0,31.0,80.0)"
     x="31.0"
     y="80.0"
     id="text110">1</text>
  <rect
     fill="rgb(255, 255, 255)"
     height="6"
     stroke="none"
     stroke-linecap="square"
     stroke-width="1.0"
     width="20"
     x="9"
     y="92"
     id="rect112" />
  <text
     fill="rgb(255, 255, 255)"
     font-family="SansSerif"
     font-size="12"
     transform="rotate(90.0,31.0,90.0)"
     x="31.0"
     y="90.0"
     id="text114">2</text>
  <rect
     fill="rgb(255, 255, 255)"
     height="6"
     stroke="none"
     stroke-linecap="square"
     stroke-width="1.0"
     width="20"
     x="9"
     y="102"
     id="rect116" />
  <text
     fill="rgb(255, 255, 255)"
     font-family="SansSerif"
     font-size="12"
     transform="rotate(90.0,31.0,100.0)"
     x="31.0"
     y="100.0"
     id="text118">3</text>
  <rect
     fill="rgb(255, 255, 255)"
     height="6"
     stroke="none"
     stroke-linecap="square"
     stroke-width="1.0"
     width="20"
     x="9"
     y="112"
     id="rect120" />
  <text
     fill="rgb(255, 255, 255)"
     font-family="SansSerif"
     font-size="12"
     transform="rotate(90.0,31.0,110.0)"
     x="31.0"
     y="110.0"
     id="text122">4</text>
  <rect
     fill="rgb(128, 128, 128)"
     height="4"
     stroke="none"
     stroke-linecap="square"
     stroke-width="1.0"
     width="9"
     x="10"
     y="83"
     id="rect124" />
  <rect
     fill="rgb(128, 128, 128)"
     height="4"
     stroke="none"
     stroke-linecap="square"
     stroke-width="1.0"
     width="9"
     x="10"
     y="93"
     id="rect126" />
  <rect
     fill="rgb(128, 128, 128)"
     height="4"
     stroke="none"
     stroke-linecap="square"
     stroke-width="1.0"
     width="9"
     x="10"
     y="103"
     id="rect128" />
  <rect
     fill="rgb(128, 128, 128)"
     height="4"
     stroke="none"
     stroke-linecap="square"
     stroke-width="1.0"
     width="9"
     x="10"
     y="113"
     id="rect130" />
  <ellipse
     cx="45.0"
     cy="85.0"
     fill="rgb(0, 0, 0)"
     rx="2.0"
     ry="2.0"
     stroke="none"
     stroke-width="1.0"
     id="ellipse132" />
  <ellipse
     cx="45.0"
     cy="95.0"
     fill="rgb(0, 0, 0)"
     rx="2.0"
     ry="2.0"
     stroke="none"
     stroke-width="1.0"
     id="ellipse134" />
  <ellipse
     cx="45.0"
     cy="105.0"
     fill="rgb(0, 0, 0)"
     rx="2.0"
     ry="2.0"
     stroke="none"
     stroke-width="1.0"
     id="ellipse136" />
  <ellipse
     cx="45.0"
     cy="115.0"
     fill="rgb(0, 0, 0)"
     rx="2.0"
     ry="2.0"
     stroke="none"
     stroke-width="1.0"
     id="ellipse138" />
  <polygon
     fill="rgb(178, 178, 178)"
     points="45,165 62,165 65,168 65,185 48,185 45,182"
     stroke="none"
     stroke-linecap="square"
     stroke-width="1.0"
     id="polygon140" />
  <rect
     fill="rgb(255, 255, 255)"
     height="17"
     stroke="none"
     stroke-linecap="square"
     stroke-width="1.0"
     width="17"
     x="45"
     y="165"
     id="rect142" />
  <polyline
     fill="none"
     points="45,165 61,165"
     stroke="rgb(0, 0, 0)"
     stroke-linecap="square"
     stroke-width="1.0"
     id="polyline144" />
  <polyline
     fill="none"
     points="62,165 62,181"
     stroke="rgb(0, 0, 0)"
     stroke-linecap="square"
     stroke-width="1.0"
     id="polyline146" />
  <polyline
     fill="none"
     points="45,182 45,166"
     stroke="rgb(0, 0, 0)"
     stroke-linecap="square"
     stroke-width="1.0"
     id="polyline148" />
  <polyline
     fill="none"
     points="46,182 62,182 65,185"
     stroke="rgb(0, 0, 0)"
     stroke-linecap="square"
     stroke-width="1.0"
     id="polyline150" />
  <polygon
     fill="none"
     points="45,165 62,165 65,168 65,185 48,185 45,182"
     stroke="rgb(0, 0, 0)"
     stroke-linecap="square"
     stroke-width="1.0"
     id="polygon152" />
  <ellipse
     cx="65.0"
     cy="175.0"
     fill="rgb(0, 0, 0)"
     rx="2.0"
     ry="2.0"
     stroke="none"
     stroke-width="1.0"
     id="ellipse154" />
  <ellipse
     cx="305.0"
     cy="15.0"
     fill="none"
     rx="9.0"
     ry="9.0"
     stroke="rgb(0, 0, 0)"
     stroke-width="2.0"
     id="ellipse156" />
  <ellipse
     cx="295.0"
     cy="15.0"
     fill="rgb(0, 0, 0)"
     rx="2.0"
     ry="2.0"
     stroke="none"
     stroke-width="1.0"
     id="ellipse158" />
  <ellipse
     cx="305.0"
     cy="45.0"
     fill="none"
     rx="9.0"
     ry="9.0"
     stroke="rgb(0, 0, 0)"
     stroke-width="2.0"
     id="ellipse160" />
  <ellipse
     cx="295.0"
     cy="45.0"
     fill="rgb(0, 0, 0)"
     rx="2.0"
     ry="2.0"
     stroke="none"
     stroke-width="1.0"
     id="ellipse162" />
  <ellipse
     cx="305.0"
     cy="75.0"
     fill="none"
     rx="9.0"
     ry="9.0"
     stroke="rgb(0, 0, 0)"
     stroke-width="2.0"
     id="ellipse164" />
  <ellipse
     cx="295.0"
     cy="75.0"
     fill="rgb(0, 0, 0)"
     rx="2.0"
     ry="2.0"
     stroke="none"
     stroke-width="1.0"
     id="ellipse166" />
  <ellipse
     cx="305.0"
     cy="115.0"
     fill="none"
     rx="9.0"
     ry="9.0"
     stroke="rgb(0, 0, 0)"
     stroke-width="2.0"
     id="ellipse168" />
  <ellipse
     cx="295.0"
     cy="115.0"
     fill="rgb(0, 0, 0)"
     rx="2.0"
     ry="2.0"
     stroke="none"
     stroke-width="1.0"
     id="ellipse170" />
</svg>
