<?xml version="1.0" encoding="UTF-8" standalone="no"?>
<svg
   version="1.1"
   viewBox="0 0 165 149"
   id="svg52"
   sodipodi:docname="adder_block.svg"
   inkscape:version="1.1.2 (0a00cf5339, 2022-02-04)"
   xmlns:inkscape="http://www.inkscape.org/namespaces/inkscape"
   xmlns:sodipodi="http://sodipodi.sourceforge.net/DTD/sodipodi-0.dtd"
   xmlns="http://www.w3.org/2000/svg"
   xmlns:svg="http://www.w3.org/2000/svg">
  <defs
     id="defs56" />
  <sodipodi:namedview
     id="namedview54"
     pagecolor="#ffffff"
     bordercolor="#666666"
     borderopacity="1.0"
     inkscape:pageshadow="2"
     inkscape:pageopacity="0.0"
     inkscape:pagecheckerboard="0"
     showgrid="false"
     inkscape:zoom="5.8590604"
     inkscape:cx="82.521764"
     inkscape:cy="74.5"
     inkscape:window-width="2486"
     inkscape:window-height="1376"
     inkscape:window-x="74"
     inkscape:window-y="27"
     inkscape:window-maximized="1"
     inkscape:current-layer="svg52" />
  <polyline
     fill="none"
     points="90,37 90,57"
     stroke="rgb(0, 0, 0)"
     stroke-linecap="square"
     stroke-width="3.0"
     id="polyline2" />
  <polyline
     fill="none"
     points="90,97 90,117"
     stroke="rgb(0, 0, 0)"
     stroke-linecap="square"
     stroke-width="3.0"
     id="polyline4" />
  <polyline
     fill="none"
     points="110,77 140,77"
     stroke="rgb(0, 0, 0)"
     stroke-linecap="square"
     stroke-width="3.0"
     id="polyline6" />
  <polyline
     fill="none"
     points="30,67 70,67"
     stroke="rgb(0, 0, 0)"
     stroke-linecap="square"
     stroke-width="3.0"
     id="polyline8" />
  <polyline
     fill="none"
     points="30,87 70,87"
     stroke="rgb(0, 0, 0)"
     stroke-linecap="square"
     stroke-width="3.0"
     id="polyline10" />
  <polyline
     fill="none"
     points="70,57 109,57"
     stroke="rgb(0, 0, 0)"
     stroke-linecap="square"
     stroke-width="2.0"
     id="polyline12" />
  <polyline
     fill="none"
     points="110,57 110,96"
     stroke="rgb(0, 0, 0)"
     stroke-linecap="square"
     stroke-width="2.0"
     id="polyline14" />
  <polyline
     fill="none"
     points="110,97 71,97"
     stroke="rgb(0, 0, 0)"
     stroke-linecap="square"
     stroke-width="2.0"
     id="polyline16" />
  <polyline
     fill="none"
     points="70,97 70,58"
     stroke="rgb(0, 0, 0)"
     stroke-linecap="square"
     stroke-width="2.0"
     id="polyline18" />
  <ellipse
     cx="70.0"
     cy="67.0"
     fill="rgb(0, 0, 0)"
     rx="2.0"
     ry="2.0"
     stroke="none"
     stroke-width="1.0"
     id="ellipse20" />
  <ellipse
     cx="70.0"
     cy="87.0"
     fill="rgb(0, 0, 0)"
     rx="2.0"
     ry="2.0"
     stroke="none"
     stroke-width="1.0"
     id="ellipse22" />
  <ellipse
     cx="110.0"
     cy="77.0"
     fill="rgb(0, 0, 0)"
     rx="2.0"
     ry="2.0"
     stroke="none"
     stroke-width="1.0"
     id="ellipse24" />
  <ellipse
     cx="90.0"
     cy="57.0"
     fill="rgb(0, 0, 0)"
     rx="2.0"
     ry="2.0"
     stroke="none"
     stroke-width="1.0"
     id="ellipse26" />
  <ellipse
     cx="90.0"
     cy="97.0"
     fill="rgb(0, 0, 0)"
     rx="2.0"
     ry="2.0"
     stroke="none"
     stroke-width="1.0"
     id="ellipse30" />
  <polyline
     fill="none"
     points="95,77 105,77"
     stroke="rgb(0, 0, 0)"
     stroke-linecap="square"
     stroke-width="2.0"
     id="polyline34" />
  <polyline
     fill="none"
     points="100,72 100,82"
     stroke="rgb(0, 0, 0)"
     stroke-linecap="square"
     stroke-width="2.0"
     id="polyline36" />
  <text
     fill="rgb(0, 0, 0)"
     font-family="SansSerif"
     font-size="12"
     x="9.0"
     y="63.0"
     id="text38">X</text>
  <text
     fill="rgb(0, 0, 0)"
     font-family="SansSerif"
     font-size="12"
     x="9.0"
     y="89.0"
     id="text40">Y</text>
  <text
     fill="rgb(0, 0, 0)"
     font-family="SansSerif"
     font-size="12"
     x="82.0"
     y="21.0"
     id="text42">C</text>
  <text
     fill="rgb(0, 0, 0)"
     font-family="SansSerif"
     font-size="12"
     x="83.0"
     y="132.0"
     id="text44">C</text>
  <text
     fill="rgb(0, 0, 0)"
     font-family="SansSerif"
     font-size="12"
     x="93.0"
     y="28.0"
     id="text46">in</text>
  <text
     fill="rgb(0, 0, 0)"
     font-family="SansSerif"
     font-size="12"
     x="91.0"
     y="137.0"
     id="text48">out</text>
  <text
     fill="rgb(0, 0, 0)"
     font-family="SansSerif"
     font-size="12"
     x="148.0"
     y="80.0"
     id="text50">S</text>
</svg>
