<?xml version="1.0" encoding="UTF-8" standalone="no"?>
<svg
   width="100%"
   height="100%"
   viewBox="-7950 -3900 21120 10560"
   version="1.1"
   id="svg528"
   sodipodi:docname="Comparison of Compact Disc, Digital Versatile Disc, High-Definition_Density Digital Versatile Disc and Blu-ray Disc.svg"
   inkscape:version="1.1.2 (0a00cf5339, 2022-02-04)"
   xmlns:inkscape="http://www.inkscape.org/namespaces/inkscape"
   xmlns:sodipodi="http://sodipodi.sourceforge.net/DTD/sodipodi-0.dtd"
   xmlns:xlink="http://www.w3.org/1999/xlink"
   xmlns="http://www.w3.org/2000/svg"
   xmlns:svg="http://www.w3.org/2000/svg">
  <sodipodi:namedview
     id="namedview530"
     pagecolor="#ffffff"
     bordercolor="#666666"
     borderopacity="1.0"
     inkscape:pageshadow="2"
     inkscape:pageopacity="0.0"
     inkscape:pagecheckerboard="0"
     showgrid="false"
     inkscape:snap-text-baseline="false"
     inkscape:zoom="0.063352273"
     inkscape:cx="10694.17"
     inkscape:cy="5485.2018"
     inkscape:window-width="2486"
     inkscape:window-height="1376"
     inkscape:window-x="74"
     inkscape:window-y="27"
     inkscape:window-maximized="1"
     inkscape:current-layer="svg528" />
  <title
     id="title2">Comparison of Compact Disc, Digital Versatile Disc, High-Definition/Density Digital Versatile Disc and Blu-ray Disc</title>
  <desc
     id="desc4">Comparison of various characteristics of a Compact Disc, and single-layer Digital Versatile Disc, High-Definition/Density Digital Versatile Disc and Blu-ray Disc, by CMG Lee. Dimensions indicated are track pitch (p), pit width (w) and minimum length (l), and laser spot size (⌀) and wavelength (λ). For comparison with analogue media, the pitch of the spiral of a 240-groove-per-inch long-playing record and a Laserdisc are 106 μm (66 times the CD track pitch) and 4.6 μm (2.9 times), respectively.[http://www.mindspring.com/~laserguru/popsci.htm] The tip of a 0.7-mil stylus has a diameter of 18 μm (11 times that of the CD laser spot). Data is from [http://www.myce.com/review/pioneer-bdr-205-blu-ray-drive-review-22946/DVD-Blu-Ray-Reading-Performance-9/], [http://www.seminarpaper.com/2012/01/seminar-report-on-terabyte-disc-huge.html], [http://www.media.utah.edu/dvdworkshop/pdf/1F_DVD_vsCD.pdf] and [http://www.hardwaresecrets.com/article/Blu-Ray-vs-HD-DVD/415/2]. The Airy disk profile is based on [http://darekk.com/kalkulator/airy-disk-05.gif] with rings darkened by a factor of 5 for clarity.</desc>
  <defs
     id="defs188">
    <rect
       x="14786.969"
       y="-854.32473"
       width="76.037346"
       height="30.414842"
       id="rect45023" />
    <rect
       x="6651.3216"
       y="-367.99796"
       width="121.16513"
       height="47.35426"
       id="rect30617" />
    <linearGradient
       id="grad_slab"
       x1="0%"
       y1="0%"
       x2="100%"
       y2="100%">
      <stop
         offset="0%"
         stop-color="#66ccff"
         id="stop6" />
      <stop
         offset="25%"
         stop-color="#99ffff"
         id="stop8" />
      <stop
         offset="50%"
         stop-color="#66ccff"
         id="stop10" />
      <stop
         offset="75%"
         stop-color="#99ffff"
         id="stop12" />
      <stop
         offset="100%"
         stop-color="#66ccff"
         id="stop14" />
    </linearGradient>
    <linearGradient
       id="grad_beam_cd"
       x1="-1710.2631"
       y1="87.705802"
       x2="-1710.2631"
       y2="3508.2321"
       gradientTransform="matrix(0.87705802,0,0,1.1401754,-5000,3700)"
       gradientUnits="userSpaceOnUse">
      <stop
         offset="0%"
         stop-color="#666666"
         stop-opacity="0.5"
         id="stop17" />
      <stop
         offset="100%"
         stop-color="#666666"
         stop-opacity="0"
         id="stop19" />
    </linearGradient>
    <linearGradient
       id="grad_beam_dvd"
       x1="-1596.8719"
       y1="563.60186"
       x2="-1596.8719"
       y2="3757.3457"
       gradientTransform="matrix(0.93933644,0,0,1.0645813,0,3700)"
       gradientUnits="userSpaceOnUse">
      <stop
         offset="0%"
         stop-color="#ff0000"
         stop-opacity="0.5"
         id="stop22" />
      <stop
         offset="100%"
         stop-color="#ff0000"
         stop-opacity="0"
         id="stop24" />
    </linearGradient>
    <linearGradient
       id="grad_beam_bd"
       x1="0%"
       y1="0%"
       x2="0%"
       y2="100%">
      <stop
         offset="0%"
         stop-color="#6600ff"
         stop-opacity="0.5"
         id="stop27" />
      <stop
         offset="100%"
         stop-color="#6600ff"
         stop-opacity="0"
         id="stop29" />
    </linearGradient>
    <radialGradient
       id="grad_airy_cd"
       cx="0"
       cy="0"
       r="8000"
       fx="0"
       fy="0"
       gradientUnits="userSpaceOnUse">
      <stop
         offset="0%"
         stop-color="#666666"
         stop-opacity="1"
         id="stop32" />
      <stop
         offset="10%"
         stop-color="#666666"
         stop-opacity="0"
         id="stop34" />
      <stop
         offset="14%"
         stop-color="#666666"
         stop-opacity="0.095"
         id="stop36" />
      <stop
         offset="19%"
         stop-color="#666666"
         stop-opacity="0"
         id="stop38" />
      <stop
         offset="22%"
         stop-color="#666666"
         stop-opacity="0.035"
         id="stop40" />
      <stop
         offset="30%"
         stop-color="#666666"
         stop-opacity="0"
         id="stop42" />
      <stop
         offset="35%"
         stop-color="#666666"
         stop-opacity="0.015"
         id="stop44" />
      <stop
         offset="40%"
         stop-color="#666666"
         stop-opacity="0"
         id="stop46" />
    </radialGradient>
    <radialGradient
       id="grad_airy_dvd"
       cx="0"
       cy="0"
       r="5500"
       fx="0"
       fy="0"
       gradientUnits="userSpaceOnUse">
      <stop
         offset="0%"
         stop-color="#ff0000"
         stop-opacity="1"
         id="stop49" />
      <stop
         offset="10%"
         stop-color="#ff0000"
         stop-opacity="0"
         id="stop51" />
      <stop
         offset="14%"
         stop-color="#ff0000"
         stop-opacity="0.095"
         id="stop53" />
      <stop
         offset="19%"
         stop-color="#ff0000"
         stop-opacity="0"
         id="stop55" />
      <stop
         offset="22%"
         stop-color="#ff0000"
         stop-opacity="0.035"
         id="stop57" />
      <stop
         offset="30%"
         stop-color="#ff0000"
         stop-opacity="0"
         id="stop59" />
      <stop
         offset="35%"
         stop-color="#ff0000"
         stop-opacity="0.015"
         id="stop61" />
      <stop
         offset="40%"
         stop-color="#ff0000"
         stop-opacity="0"
         id="stop63" />
    </radialGradient>
    <radialGradient
       id="grad_airy_bd"
       cx="50%"
       cy="50%"
       r="50%"
       fx="50%"
       fy="50%">
      <stop
         offset="0%"
         stop-color="#6600ff"
         stop-opacity="1"
         id="stop66" />
      <stop
         offset="10%"
         stop-color="#6600ff"
         stop-opacity="0"
         id="stop68" />
      <stop
         offset="14%"
         stop-color="#6600ff"
         stop-opacity="0.095"
         id="stop70" />
      <stop
         offset="19%"
         stop-color="#6600ff"
         stop-opacity="0"
         id="stop72" />
      <stop
         offset="22%"
         stop-color="#6600ff"
         stop-opacity="0.035"
         id="stop74" />
      <stop
         offset="30%"
         stop-color="#6600ff"
         stop-opacity="0"
         id="stop76" />
      <stop
         offset="35%"
         stop-color="#6600ff"
         stop-opacity="0.015"
         id="stop78" />
      <stop
         offset="40%"
         stop-color="#6600ff"
         stop-opacity="0"
         id="stop80" />
    </radialGradient>
    <path
       id="lens"
       transform="translate(0,150)"
       d="M -2000 0 Q 0 -500 2000 0 Q 0 500 -2000 0"
       stroke="#99ffff"
       stroke-width="50"
       fill="url(#grad_slab)" />
    <path
       id="slab"
       d="M -1500 0 C -1700 500 -1300 500 -1500 1000 H 1500 C 1700 500 1300 500 1500 0 Z"
       stroke="none" />
    <rect
       id="box_big"
       x="-1500"
       y="-2100"
       width="3000"
       height="3000"
       rx="200"
       ry="200"
       stroke="#666666"
       stroke-width="40"
       fill="#ffffff" />
    <rect
       id="box_small"
       x="-100"
       y="-100"
       width="200"
       height="200"
       fill="none" />
    <clipPath
       id="clip_box_big">
      <use
         xlink:href="#box_big"
         id="use87" />
    </clipPath>
    <path
       id="wave1"
       d="M -1000 -1000 C -635 -1000  -365 1000  0 1000 S 635 -1000  1000 -1000"
       stroke-width="100"
       fill="none" />
    <g
       id="wave5"
       transform="scale(-0.5)">
      <use
         xlink:href="#wave1"
         transform="translate(-4000,0)"
         id="use91" />
      <use
         xlink:href="#wave1"
         transform="translate(-2000,0)"
         id="use93" />
      <use
         xlink:href="#wave1"
         id="use95" />
      <use
         xlink:href="#wave1"
         transform="translate(2000,0)"
         id="use97" />
      <use
         xlink:href="#wave1"
         transform="translate(4000,0)"
         id="use99" />
    </g>
    <rect
       id="pit_dot"
       x="25"
       y="-50"
       width="100"
       height="100"
       rx="50"
       ry="50"
       stroke-opacity="0.1"
       stroke-width="20"
       fill="#999999" />
    <rect
       id="pit_dash"
       x="25"
       y="-50"
       width="300"
       height="100"
       rx="50"
       ry="50"
       stroke-opacity="0.1"
       stroke-width="20"
       fill="#999999" />
    <g
       id="pits_a">
      <use
         xlink:href="#pit_dot"
         id="use104" />
      <use
         xlink:href="#pit_dash"
         transform="translate(200,0)"
         id="use106" />
    </g>
    <g
       id="pits_b">
      <use
         xlink:href="#pits_d"
         id="use109" />
      <use
         xlink:href="#pit_dot"
         transform="translate(800,0)"
         id="use111" />
    </g>
    <g
       id="pits_c">
      <use
         xlink:href="#pit_dash"
         id="use114" />
      <use
         xlink:href="#pits_r"
         transform="translate(400,0)"
         id="use116" />
    </g>
    <g
       id="pits_d">
      <use
         xlink:href="#pit_dash"
         id="use119" />
      <use
         xlink:href="#pit_dot"
         transform="translate(400,0)"
         id="use121" />
      <use
         xlink:href="#pit_dot"
         transform="translate(600,0)"
         id="use123" />
    </g>
    <g
       id="pits_h">
      <use
         xlink:href="#pit_dot"
         id="use126" />
      <use
         xlink:href="#pit_dot"
         transform="translate(200,0)"
         id="use128" />
      <use
         xlink:href="#pit_dot"
         transform="translate(400,0)"
         id="use130" />
      <use
         xlink:href="#pit_dot"
         transform="translate(600,0)"
         id="use132" />
    </g>
    <g
       id="pits_l">
      <use
         xlink:href="#pits_r"
         id="use135" />
      <use
         xlink:href="#pit_dot"
         transform="translate(800,0)"
         id="use137" />
    </g>
    <g
       id="pits_r">
      <use
         xlink:href="#pits_a"
         id="use140" />
      <use
         xlink:href="#pit_dot"
         transform="translate(600,0)"
         id="use142" />
    </g>
    <g
       id="pits_u">
      <use
         xlink:href="#pit_dot"
         id="use145" />
      <use
         xlink:href="#pits_a"
         transform="translate(200,0)"
         id="use147" />
    </g>
    <g
       id="pits_v">
      <use
         xlink:href="#pit_dot"
         id="use150" />
      <use
         xlink:href="#pit_dot"
         transform="translate(200,0)"
         id="use152" />
      <use
         xlink:href="#pits_a"
         transform="translate(400,0)"
         id="use154" />
    </g>
    <g
       id="pits_y">
      <use
         xlink:href="#pit_dash"
         id="use157" />
      <use
         xlink:href="#pits_a"
         transform="translate(400,0)"
         id="use159" />
      <use
         xlink:href="#pit_dash"
         transform="translate(1000,0)"
         id="use161" />
    </g>
    <g
       id="pits_hddvd">
      <use
         xlink:href="#pits_h"
         transform="translate(    0,   0) scale(2,2)"
         id="use164" />
      <use
         xlink:href="#pits_d"
         transform="translate(  400, 400) scale(2,2)"
         id="use166" />
      <use
         xlink:href="#pits_d"
         transform="translate( -600, 800) scale(2,2)"
         id="use168" />
      <use
         xlink:href="#pits_v"
         transform="translate(-1000,1200) scale(2,2)"
         id="use170" />
      <use
         xlink:href="#pits_d"
         transform="translate( -150,1600) scale(2,2)"
         id="use172" />
    </g>
    <g
       id="pits_bd">
      <use
         xlink:href="#pits_b"
         transform="translate(    0,   0) scale(1.5,1.3)"
         id="use175" />
      <use
         xlink:href="#pits_l"
         transform="translate( 1700,   0) scale(1.5,1.3)"
         id="use177" />
      <use
         xlink:href="#pits_u"
         transform="translate( 3400,   0) scale(1.5,1.3)"
         id="use179" />
      <use
         xlink:href="#pits_r"
         transform="translate( 4800,   0) scale(1.5,1.3)"
         id="use181" />
      <use
         xlink:href="#pits_a"
         transform="translate( 6200,   0) scale(1.5,1.3)"
         id="use183" />
      <use
         xlink:href="#pits_y"
         transform="translate( 7300,   0) scale(1.5,1.3)"
         id="use185" />
    </g>
    <linearGradient
       inkscape:collect="always"
       xlink:href="#grad_slab"
       id="linearGradient532"
       x1="-882.53471"
       y1="0"
       x2="882.53471"
       y2="1765.0694"
       gradientTransform="scale(1.7650694,0.56654996)"
       gradientUnits="userSpaceOnUse" />
    <linearGradient
       inkscape:collect="always"
       xlink:href="#grad_slab"
       id="linearGradient534"
       x1="-882.53471"
       y1="0"
       x2="882.53471"
       y2="1765.0694"
       gradientTransform="scale(1.7650694,0.56654996)"
       gradientUnits="userSpaceOnUse" />
    <linearGradient
       inkscape:collect="always"
       xlink:href="#grad_slab"
       id="linearGradient536"
       x1="-882.53471"
       y1="0"
       x2="882.53471"
       y2="1765.0694"
       gradientTransform="scale(1.7650694,0.56654996)"
       gradientUnits="userSpaceOnUse" />
    <linearGradient
       inkscape:collect="always"
       xlink:href="#grad_slab"
       id="linearGradient538"
       x1="-882.53471"
       y1="0"
       x2="882.53471"
       y2="1765.0694"
       gradientTransform="scale(1.7650694,0.56654996)"
       gradientUnits="userSpaceOnUse" />
    <linearGradient
       inkscape:collect="always"
       xlink:href="#grad_slab"
       id="linearGradient540"
       x1="-882.53471"
       y1="0"
       x2="882.53471"
       y2="1765.0694"
       gradientTransform="scale(1.7650694,0.56654996)"
       gradientUnits="userSpaceOnUse" />
    <linearGradient
       inkscape:collect="always"
       xlink:href="#grad_slab"
       id="linearGradient542"
       x1="-882.53471"
       y1="0"
       x2="882.53471"
       y2="1765.0694"
       gradientTransform="scale(1.7650694,0.56654996)"
       gradientUnits="userSpaceOnUse" />
    <linearGradient
       inkscape:collect="always"
       xlink:href="#grad_beam_bd"
       id="linearGradient544"
       x1="-1596.8719"
       y1="563.60186"
       x2="-1596.8719"
       y2="3757.3457"
       gradientTransform="matrix(0.93933644,0,0,1.0645813,5000,3700)"
       gradientUnits="userSpaceOnUse" />
    <radialGradient
       inkscape:collect="always"
       xlink:href="#grad_airy_bd"
       id="radialGradient546"
       cx="0"
       cy="0"
       fx="0"
       fy="0"
       r="3100"
       gradientUnits="userSpaceOnUse" />
    <linearGradient
       inkscape:collect="always"
       xlink:href="#grad_slab"
       id="linearGradient548"
       x1="-882.53471"
       y1="0"
       x2="882.53471"
       y2="1765.0694"
       gradientTransform="scale(1.7650694,0.56654996)"
       gradientUnits="userSpaceOnUse" />
    <linearGradient
       inkscape:collect="always"
       xlink:href="#grad_slab"
       id="linearGradient550"
       x1="-882.53471"
       y1="0"
       x2="882.53471"
       y2="1765.0694"
       gradientTransform="scale(1.7650694,0.56654996)"
       gradientUnits="userSpaceOnUse" />
    <linearGradient
       inkscape:collect="always"
       xlink:href="#grad_beam_bd"
       id="linearGradient552"
       x1="-1474.7881"
       y1="1118.8048"
       x2="-1474.7881"
       y2="4068.381"
       gradientTransform="matrix(1.0170953,0,0,0.98319208,10000,3700)"
       gradientUnits="userSpaceOnUse" />
    <radialGradient
       inkscape:collect="always"
       xlink:href="#grad_airy_bd"
       id="radialGradient554"
       cx="0"
       cy="0"
       fx="0"
       fy="0"
       r="2400"
       gradientUnits="userSpaceOnUse" />
  </defs>
  <circle
     cx="-360.51358"
     cy="370.92917"
     r="99999"
     fill="#ffffff"
     id="circle190" />
  <use
     xlink:href="#slab"
     transform="matrix(-1,0,0,0.1,-5000,3600)"
     fill="#00cc00"
     id="use194"
     x="0"
     y="0"
     width="100%"
     height="100%"
     style="font-size:400px;font-family:sans-serif;letter-spacing:-20;text-anchor:middle;stroke:#000000;stroke-width:20;stroke-linejoin:round" />
  <use
     xlink:href="#slab"
     transform="matrix(1,0,0,0.1,-5000,3700)"
     fill="url(#grad_slab)"
     id="use200"
     style="font-size:400px;font-family:sans-serif;letter-spacing:-20;text-anchor:middle;fill:url(#linearGradient532);stroke:#000000;stroke-width:20;stroke-linejoin:round"
     x="0"
     y="0"
     width="100%"
     height="100%" />
  <text
     x="-3300"
     y="4500"
     text-anchor="start"
     stroke="none"
     id="text202"
     style="font-size:400px;font-family:sans-serif;letter-spacing:-20;fill:#000000;stroke-width:20;stroke-linejoin:round">1.1 mm</text>
  <path
     d="m -3500,3800 h 100 v 1100 h -100"
     fill="none"
     id="path204"
     style="font-size:400px;font-family:sans-serif;letter-spacing:-20;text-anchor:middle;stroke:#000000;stroke-width:20;stroke-linejoin:round" />
  <use
     xlink:href="#slab"
     transform="matrix(1,0,0,1.1,-5000,3800)"
     fill="url(#grad_slab)"
     id="use206"
     style="font-size:400px;font-family:sans-serif;letter-spacing:-20;text-anchor:middle;fill:url(#linearGradient534);stroke:#000000;stroke-width:20;stroke-linejoin:round"
     x="0"
     y="0"
     width="100%"
     height="100%" />
  <use
     xlink:href="#lens"
     transform="translate(-5000,5700)"
     id="use210"
     x="0"
     y="0"
     width="100%"
     height="100%"
     style="font-size:400px;font-family:sans-serif;letter-spacing:-20;text-anchor:middle;fill:#000000;stroke:#000000;stroke-width:20;stroke-linejoin:round" />
  <path
     d="M -6500,7700 V 6000 l 100,-300 1400,-1900 1400,1900 100,300 v 1700"
     stroke="none"
     fill="url(#grad_beam_cd)"
     id="path212"
     style="font-size:400px;font-family:sans-serif;letter-spacing:-20;text-anchor:middle;fill:url(#grad_beam_cd);stroke-width:20;stroke-linejoin:round" />
  <g
     clip-path="url(#clip_box_big)"
     id="g224"
     transform="translate(-5000)"
     style="font-size:400px;font-family:sans-serif;letter-spacing:-20;text-anchor:middle;fill:#000000;stroke:#000000;stroke-width:20;stroke-linejoin:round">
    <use
       xlink:href="#box_big"
       id="use216"
       x="0"
       y="0"
       width="100%"
       height="100%" />
    <use
       xlink:href="#pits_c"
       transform="matrix(8,0,0,6,-3800,-1600)"
       id="use218"
       x="0"
       y="0"
       width="100%"
       height="100%" />
    <use
       xlink:href="#pits_d"
       transform="matrix(8,0,0,6,-3000,0)"
       id="use220"
       x="0"
       y="0"
       width="100%"
       height="100%" />
    <circle
       cx="0"
       cy="0"
       r="8000"
       stroke="none"
       fill="url(#grad_airy_cd)"
       id="circle222"
       style="fill:url(#grad_airy_cd)" />
  </g>
  <text
     x="-5000"
     y="-2350"
     stroke="none"
     id="text230"
     style="font-size:400px;font-family:sans-serif;letter-spacing:-20;text-anchor:middle;fill:#000000;stroke-width:20;stroke-linejoin:round"><tspan
       id="tspan226">l</tspan><!-- <tspan font-size="300">min</tspan> --><tspan
       id="tspan228"> = 800 nm</tspan></text>
  <text
     x="-5423.9902"
     y="-2987.2688"
     stroke="none"
     id="text230-3"
     style="font-size:659.213px;font-family:sans-serif;letter-spacing:-32.9607;text-anchor:middle;fill:#000000;stroke-width:32.9607;stroke-linejoin:round"
     transform="scale(0.91290228,1.0954075)">CD<!-- <tspan font-size="300">min</tspan> --></text>
  <text
     x="-216.89708"
     y="-3000.4551"
     stroke="none"
     id="text230-3-5"
     style="font-size:659.213px;font-family:sans-serif;letter-spacing:-32.9607;text-anchor:middle;fill:#000000;stroke-width:32.9607;stroke-linejoin:round"
     transform="scale(0.91290228,1.0954075)">DVD<!-- <tspan font-size="300">min</tspan> --></text>
  <text
     x="5310.5845"
     y="-2996.6543"
     stroke="none"
     id="text230-3-5-3"
     style="font-size:659.213px;font-family:sans-serif;letter-spacing:-32.9607;text-anchor:middle;fill:#000000;stroke-width:32.9607;stroke-linejoin:round"
     transform="scale(0.91290228,1.0954075)">HD DVD<!-- <tspan font-size="300">min</tspan> --></text>
  <text
     x="10760.441"
     y="-2990.9966"
     stroke="none"
     id="text230-3-5-3-5"
     style="font-size:659.213px;font-family:sans-serif;letter-spacing:-32.9607;text-anchor:middle;fill:#000000;stroke-width:32.9607;stroke-linejoin:round"
     transform="scale(0.91290228,1.0954075)">Blu-ray<!-- <tspan font-size="300">min</tspan> --></text>
  <path
     d="m -5400,-1800 v -400 h 800 v 400"
     fill="none"
     id="path232"
     style="font-size:400px;font-family:sans-serif;letter-spacing:-20;text-anchor:middle;stroke:#000000;stroke-width:20;stroke-linejoin:round" />
  <g
     transform="translate(-5000,1800)"
     id="g266"
     style="font-size:400px;font-family:sans-serif;letter-spacing:-20;text-anchor:middle;fill:#000000;stroke:#000000;stroke-width:20;stroke-linejoin:round">
    <use
       xlink:href="#wave5"
       transform="scale(0.78,1)"
       stroke="#666666"
       id="use260"
       x="0"
       y="0"
       width="100%"
       height="100%" />
    <path
       d="M -390,600 V 800 H 390 V 600"
       stroke="#666666"
       fill="none"
       id="path262" />
    <text
       x="0"
       y="1250"
       stroke="none"
       id="text264">λ = 780 nm</text>
  </g>
  <use
     xlink:href="#slab"
     transform="matrix(-1,0,0,0.1,0,3600)"
     fill="#00cc00"
     id="use272"
     x="0"
     y="0"
     width="100%"
     height="100%"
     style="font-size:400px;font-family:sans-serif;letter-spacing:-20;text-anchor:middle;stroke:#000000;stroke-width:20;stroke-linejoin:round" />
  <use
     xlink:href="#slab"
     transform="matrix(1,0,0,0.6,0,3700)"
     fill="url(#grad_slab)"
     id="use278"
     style="font-size:400px;font-family:sans-serif;letter-spacing:-20;text-anchor:middle;fill:url(#linearGradient536);stroke:#000000;stroke-width:20;stroke-linejoin:round"
     x="0"
     y="0"
     width="100%"
     height="100%" />
  <text
     x="1700"
     y="4700"
     text-anchor="start"
     stroke="none"
     id="text280"
     style="font-size:400px;font-family:sans-serif;letter-spacing:-20;fill:#000000;stroke-width:20;stroke-linejoin:round">0.6 mm</text>
  <path
     d="m 1500,4300 h 100 v 600 h -100"
     fill="none"
     id="path282"
     style="font-size:400px;font-family:sans-serif;letter-spacing:-20;text-anchor:middle;stroke:#000000;stroke-width:20;stroke-linejoin:round" />
  <use
     xlink:href="#slab"
     transform="matrix(1,0,0,0.6,0,4300)"
     fill="url(#grad_slab)"
     id="use284"
     style="font-size:400px;font-family:sans-serif;letter-spacing:-20;text-anchor:middle;fill:url(#linearGradient538);stroke:#000000;stroke-width:20;stroke-linejoin:round"
     x="0"
     y="0"
     width="100%"
     height="100%" />
  <use
     xlink:href="#slab"
     transform="matrix(1,0,0,-0.02,0,4300)"
     fill="#000000"
     id="use286"
     x="0"
     y="0"
     width="100%"
     height="100%"
     style="font-size:400px;font-family:sans-serif;letter-spacing:-20;text-anchor:middle;stroke:#000000;stroke-width:20;stroke-linejoin:round" />
  <use
     xlink:href="#lens"
     transform="translate(0,5700)"
     id="use288"
     x="0"
     y="0"
     width="100%"
     height="100%"
     style="font-size:400px;font-family:sans-serif;letter-spacing:-20;text-anchor:middle;fill:#000000;stroke:#000000;stroke-width:20;stroke-linejoin:round" />
  <path
     d="M -1500,7700 V 6000 l 100,-300 1400,-1400 1400,1400 100,300 v 1700"
     stroke="none"
     fill="url(#grad_beam_dvd)"
     id="path290"
     style="font-size:400px;font-family:sans-serif;letter-spacing:-20;text-anchor:middle;fill:url(#grad_beam_dvd);stroke-width:20;stroke-linejoin:round" />
  <g
     clip-path="url(#clip_box_big)"
     id="g306"
     style="font-size:400px;font-family:sans-serif;letter-spacing:-20;text-anchor:middle;fill:#000000;stroke:#000000;stroke-width:20;stroke-linejoin:round">
    <use
       xlink:href="#box_big"
       id="use294"
       x="0"
       y="0"
       width="100%"
       height="100%" />
    <use
       xlink:href="#pits_d"
       transform="matrix(4,0,0,3.2,-1500,-1480)"
       id="use296"
       x="0"
       y="0"
       width="100%"
       height="100%" />
    <use
       xlink:href="#pits_v"
       transform="matrix(4,0,0,3.2,-1600,-740)"
       id="use298"
       x="0"
       y="0"
       width="100%"
       height="100%" />
    <use
       xlink:href="#pits_d"
       transform="matrix(4,0,0,3.2,-1400,0)"
       id="use300"
       x="0"
       y="0"
       width="100%"
       height="100%" />
    <use
       xlink:href="#pits_v"
       transform="matrix(4,0,0,3.2,-2300,740)"
       id="use302"
       x="0"
       y="0"
       width="100%"
       height="100%" />
    <circle
       cx="0"
       cy="0"
       r="5500"
       stroke="none"
       fill="url(#grad_airy_dvd)"
       id="circle304"
       style="fill:url(#grad_airy_dvd)" />
  </g>
  <text
     x="0"
     y="-2350"
     stroke="none"
     id="text312"
     style="font-size:400px;font-family:sans-serif;letter-spacing:-20;text-anchor:middle;fill:#000000;stroke-width:20;stroke-linejoin:round"><tspan
       id="tspan308">l</tspan><!-- <tspan font-size="300">min</tspan> --><tspan
       id="tspan310"> = 400 nm</tspan></text>
  <path
     d="m 200,-1600 v -600 h 400 v 600"
     fill="none"
     id="path314"
     style="font-size:400px;font-family:sans-serif;letter-spacing:-20;text-anchor:middle;stroke:#000000;stroke-width:20;stroke-linejoin:round" />
  <g
     transform="translate(0,1800)"
     id="g348"
     style="font-size:400px;font-family:sans-serif;letter-spacing:-20;text-anchor:middle;fill:#000000;stroke:#000000;stroke-width:20;stroke-linejoin:round">
    <use
       xlink:href="#wave5"
       transform="scale(0.65,1)"
       stroke="#ff0000"
       id="use342"
       x="0"
       y="0"
       width="100%"
       height="100%" />
    <path
       d="M -330,600 V 800 H 330 V 600"
       stroke="#ff0000"
       fill="none"
       id="path344" />
    <text
       x="0"
       y="1250"
       stroke="none"
       id="text346">λ = 650 nm</text>
  </g>
  <text
     x="5000"
     y="-3000"
     font-size="1000px"
     stroke="none"
     id="text352"
     style="font-family:sans-serif;letter-spacing:-20;text-anchor:middle;fill:#000000;stroke-width:20;stroke-linejoin:round" />
  <use
     xlink:href="#slab"
     transform="matrix(-1,0,0,0.1,5000,3600)"
     fill="#00cc00"
     id="use354"
     x="0"
     y="0"
     width="100%"
     height="100%"
     style="font-size:400px;font-family:sans-serif;letter-spacing:-20;text-anchor:middle;stroke:#000000;stroke-width:20;stroke-linejoin:round" />
  <use
     xlink:href="#slab"
     transform="matrix(1,0,0,0.6,5000,3700)"
     fill="url(#grad_slab)"
     id="use360"
     style="font-size:400px;font-family:sans-serif;letter-spacing:-20;text-anchor:middle;fill:url(#linearGradient540);stroke:#000000;stroke-width:20;stroke-linejoin:round"
     x="0"
     y="0"
     width="100%"
     height="100%" />
  <text
     x="6700"
     y="4700"
     text-anchor="start"
     stroke="none"
     id="text362"
     style="font-size:400px;font-family:sans-serif;letter-spacing:-20;fill:#000000;stroke-width:20;stroke-linejoin:round">0.6 mm</text>
  <path
     d="m 6500,4300 h 100 v 600 h -100"
     fill="none"
     id="path364"
     style="font-size:400px;font-family:sans-serif;letter-spacing:-20;text-anchor:middle;stroke:#000000;stroke-width:20;stroke-linejoin:round" />
  <use
     xlink:href="#slab"
     transform="matrix(1,0,0,0.6,5000,4300)"
     fill="url(#grad_slab)"
     id="use366"
     style="font-size:400px;font-family:sans-serif;letter-spacing:-20;text-anchor:middle;fill:url(#linearGradient542);stroke:#000000;stroke-width:20;stroke-linejoin:round"
     x="0"
     y="0"
     width="100%"
     height="100%" />
  <use
     xlink:href="#slab"
     transform="matrix(1,0,0,-0.02,5000,4300)"
     fill="#000000"
     id="use368"
     x="0"
     y="0"
     width="100%"
     height="100%"
     style="font-size:400px;font-family:sans-serif;letter-spacing:-20;text-anchor:middle;stroke:#000000;stroke-width:20;stroke-linejoin:round" />
  <use
     xlink:href="#lens"
     transform="translate(5000,5700)"
     id="use370"
     x="0"
     y="0"
     width="100%"
     height="100%"
     style="font-size:400px;font-family:sans-serif;letter-spacing:-20;text-anchor:middle;fill:#000000;stroke:#000000;stroke-width:20;stroke-linejoin:round" />
  <path
     d="M 3500,7700 V 6000 l 100,-300 1400,-1400 1400,1400 100,300 v 1700"
     stroke="none"
     fill="url(#grad_beam_bd)"
     id="path372"
     style="font-size:400px;font-family:sans-serif;letter-spacing:-20;text-anchor:middle;fill:url(#linearGradient544);stroke-width:20;stroke-linejoin:round" />
  <g
     clip-path="url(#clip_box_big)"
     id="g388"
     transform="translate(5000)"
     style="font-size:400px;font-family:sans-serif;letter-spacing:-20;text-anchor:middle;fill:#000000;stroke:#000000;stroke-width:20;stroke-linejoin:round">
    <use
       xlink:href="#box_big"
       id="use376"
       x="0"
       y="0"
       width="100%"
       height="100%" />
    <use
       xlink:href="#pits_hddvd"
       transform="translate(-1350,-2000)"
       id="use378"
       x="0"
       y="0"
       width="100%"
       height="100%" />
    <use
       xlink:href="#pits_hddvd"
       transform="translate(600,-2000)"
       id="use380"
       x="0"
       y="0"
       width="100%"
       height="100%" />
    <use
       xlink:href="#pits_hddvd"
       transform="translate(-1800)"
       id="use382"
       x="0"
       y="0"
       width="100%"
       height="100%" />
    <use
       xlink:href="#pits_hddvd"
       transform="translate(350)"
       id="use384"
       x="0"
       y="0"
       width="100%"
       height="100%" />
    <circle
       cx="0"
       cy="0"
       r="3100"
       stroke="none"
       fill="url(#grad_airy_bd)"
       id="circle386"
       style="fill:url(#radialGradient546)" />
  </g>
  <text
     x="5000"
     y="-2350"
     stroke="none"
     id="text394"
     style="font-size:400px;font-family:sans-serif;letter-spacing:-20;text-anchor:middle;fill:#000000;stroke-width:20;stroke-linejoin:round"><tspan
       id="tspan390">l</tspan><!-- <tspan font-size="300">min</tspan> --><tspan
       id="tspan392"> = 200 nm</tspan></text>
  <path
     d="m 4900,-1800 v -400 h 200 v 400"
     fill="none"
     id="path396"
     style="font-size:400px;font-family:sans-serif;letter-spacing:-20;text-anchor:middle;stroke:#000000;stroke-width:20;stroke-linejoin:round" />
  <g
     transform="translate(5000,1800)"
     id="g430"
     style="font-size:400px;font-family:sans-serif;letter-spacing:-20;text-anchor:middle;fill:#000000;stroke:#000000;stroke-width:20;stroke-linejoin:round">
    <use
       xlink:href="#wave5"
       transform="scale(0.405,1)"
       stroke="#6600ff"
       id="use424"
       x="0"
       y="0"
       width="100%"
       height="100%" />
    <path
       d="m -202.5,600 v 200 h 405 V 600"
       stroke="#6600ff"
       fill="none"
       id="path426" />
    <text
       x="0"
       y="1250"
       stroke="none"
       id="text428">λ = 405 nm</text>
  </g>
  <text
     x="10000"
     y="-3000"
     font-size="1000px"
     stroke="none"
     id="text434"
     style="font-family:sans-serif;letter-spacing:-20;text-anchor:middle;fill:#000000;stroke-width:20;stroke-linejoin:round" />
  <use
     xlink:href="#slab"
     transform="matrix(-1,0,0,0.1,10000,3600)"
     fill="#00cc00"
     id="use436"
     x="0"
     y="0"
     width="100%"
     height="100%"
     style="font-size:400px;font-family:sans-serif;letter-spacing:-20;text-anchor:middle;stroke:#000000;stroke-width:20;stroke-linejoin:round" />
  <use
     xlink:href="#slab"
     transform="matrix(1,0,0,1.1,10000,3700)"
     fill="url(#grad_slab)"
     id="use442"
     style="font-size:400px;font-family:sans-serif;letter-spacing:-20;text-anchor:middle;fill:url(#linearGradient548);stroke:#000000;stroke-width:20;stroke-linejoin:round"
     x="0"
     y="0"
     width="100%"
     height="100%" />
  <text
     x="11700"
     y="5000"
     text-anchor="start"
     stroke="none"
     id="text444"
     style="font-size:400px;font-family:sans-serif;letter-spacing:-20;fill:#000000;stroke-width:20;stroke-linejoin:round">0.1 mm</text>
  <path
     d="m 11500,4800 h 100 v 100 h -100"
     fill="none"
     id="path446"
     style="font-size:400px;font-family:sans-serif;letter-spacing:-20;text-anchor:middle;stroke:#000000;stroke-width:20;stroke-linejoin:round" />
  <use
     xlink:href="#slab"
     transform="matrix(1,0,0,0.1,10000,4800)"
     fill="url(#grad_slab)"
     id="use448"
     style="font-size:400px;font-family:sans-serif;letter-spacing:-20;text-anchor:middle;fill:url(#linearGradient550);stroke:#000000;stroke-width:20;stroke-linejoin:round"
     x="0"
     y="0"
     width="100%"
     height="100%" />
  <use
     xlink:href="#slab"
     transform="matrix(1,0,0,-0.02,10000,4800)"
     fill="#000000"
     id="use450"
     x="0"
     y="0"
     width="100%"
     height="100%"
     style="font-size:400px;font-family:sans-serif;letter-spacing:-20;text-anchor:middle;stroke:#000000;stroke-width:20;stroke-linejoin:round" />
  <use
     xlink:href="#lens"
     transform="translate(10000,5700)"
     id="use452"
     x="0"
     y="0"
     width="100%"
     height="100%"
     style="font-size:400px;font-family:sans-serif;letter-spacing:-20;text-anchor:middle;fill:#000000;stroke:#000000;stroke-width:20;stroke-linejoin:round" />
  <path
     d="M 8500,7700 V 6000 l 100,-300 1400,-900 1400,900 100,300 v 1700"
     stroke="none"
     fill="url(#grad_beam_bd)"
     id="path454"
     style="font-size:400px;font-family:sans-serif;letter-spacing:-20;text-anchor:middle;fill:url(#linearGradient552);stroke-width:20;stroke-linejoin:round" />
  <g
     clip-path="url(#clip_box_big)"
     id="g480"
     transform="translate(10000)"
     style="font-size:400px;font-family:sans-serif;letter-spacing:-20;text-anchor:middle;fill:#000000;stroke:#000000;stroke-width:20;stroke-linejoin:round">
    <use
       xlink:href="#box_big"
       id="use458"
       x="0"
       y="0"
       width="100%"
       height="100%" />
    <use
       xlink:href="#pits_bd"
       transform="translate(-1140,-1920)"
       id="use460"
       x="0"
       y="0"
       width="100%"
       height="100%" />
    <use
       xlink:href="#pits_bd"
       transform="translate(-2170,-1600)"
       id="use462"
       x="0"
       y="0"
       width="100%"
       height="100%" />
    <use
       xlink:href="#pits_bd"
       transform="translate(-3100,-1280)"
       id="use464"
       x="0"
       y="0"
       width="100%"
       height="100%" />
    <use
       xlink:href="#pits_bd"
       transform="translate(-5500,-960)"
       id="use466"
       x="0"
       y="0"
       width="100%"
       height="100%" />
    <use
       xlink:href="#pits_bd"
       transform="translate(-6300,-640)"
       id="use468"
       x="0"
       y="0"
       width="100%"
       height="100%" />
    <use
       xlink:href="#pits_bd"
       transform="translate(-8000,-320)"
       id="use470"
       x="0"
       y="0"
       width="100%"
       height="100%" />
    <use
       xlink:href="#pits_bd"
       transform="translate(-1580)"
       id="use472"
       x="0"
       y="0"
       width="100%"
       height="100%" />
    <use
       xlink:href="#pits_bd"
       transform="translate(-2170,320)"
       id="use474"
       x="0"
       y="0"
       width="100%"
       height="100%" />
    <use
       xlink:href="#pits_bd"
       transform="translate(-3100,640)"
       id="use476"
       x="0"
       y="0"
       width="100%"
       height="100%" />
    <circle
       cx="0"
       cy="0"
       r="2400"
       stroke="none"
       fill="url(#grad_airy_bd)"
       id="circle478"
       style="fill:url(#radialGradient554)" />
  </g>
  <text
     x="10000"
     y="-2350"
     stroke="none"
     id="text486"
     style="font-size:400px;font-family:sans-serif;letter-spacing:-20;text-anchor:middle;fill:#000000;stroke-width:20;stroke-linejoin:round"><tspan
       id="tspan482">l</tspan><!-- <tspan font-size="300">min</tspan> --><tspan
       id="tspan484"> = 150 nm</tspan></text>
  <path
     d="m 10100,-1800 v -400 h 150 v 400"
     fill="none"
     id="path488"
     style="font-size:400px;font-family:sans-serif;letter-spacing:-20;text-anchor:middle;stroke:#000000;stroke-width:20;stroke-linejoin:round" />
  <g
     transform="translate(10000,1800)"
     id="g522"
     style="font-size:400px;font-family:sans-serif;letter-spacing:-20;text-anchor:middle;fill:#000000;stroke:#000000;stroke-width:20;stroke-linejoin:round">
    <use
       xlink:href="#wave5"
       transform="scale(0.405,1)"
       stroke="#6600ff"
       id="use516"
       x="0"
       y="0"
       width="100%"
       height="100%" />
    <path
       d="m -202.5,600 v 200 h 405 V 600"
       stroke="#6600ff"
       fill="none"
       id="path518" />
    <text
       x="0"
       y="1250"
       stroke="none"
       id="text520">λ = 405 nm</text>
  </g>
  <text
     xml:space="preserve"
     transform="translate(-7950,-3900)"
     id="text30615"
     style="line-height:1.25;font-family:sans-serif;font-size:5.33333333px;white-space:pre;shape-inside:url(#rect30617)" />
  <text
     xml:space="preserve"
     transform="translate(-7950,-3900)"
     id="text45021"
     style="line-height:1.25;font-family:sans-serif;font-size:5.33333333px;white-space:pre;shape-inside:url(#rect45023)" />
</svg>
