<?xml version="1.0" encoding="UTF-8" standalone="no"?>
<svg xmlns="http://www.w3.org/2000/svg" version="1.1" viewBox="0 0 1071 161">
   <polyline fill="none" points="5,25 45,25 45,105 65,105" stroke="rgb(255, 123, 0)" stroke-linecap="square" stroke-width="3.0"/>
   <polyline fill="none" points="855,125 855,105 855,85 855,45 1055,45" stroke="rgb(255, 123, 0)" stroke-linecap="square" stroke-width="3.0"/>
   <polyline fill="none" points="305,5 565,5 565,85 605,85" stroke="rgb(255, 123, 0)" stroke-linecap="square" stroke-width="3.0"/>
   <polyline fill="none" points="55,45 55,125 65,125" stroke="rgb(255, 123, 0)" stroke-linecap="square" stroke-width="3.0"/>
   <polyline fill="none" points="845,25 575,25 575,105 605,105" stroke="rgb(255, 123, 0)" stroke-linecap="square" stroke-width="3.0"/>
   <polyline fill="none" points="5,5 35,5" stroke="rgb(255, 123, 0)" stroke-linecap="square" stroke-width="3.0"/>
   <polyline fill="none" points="1055,5 835,5 835,85 855,85" stroke="rgb(255, 123, 0)" stroke-linecap="square" stroke-width="3.0"/>
   <polyline fill="none" points="65,85 35,85 35,5 305,5 305,85 335,85" stroke="rgb(255, 123, 0)" stroke-linecap="square" stroke-width="3.0"/>
   <polyline fill="none" points="45,25 315,25 315,105 335,105" stroke="rgb(255, 123, 0)" stroke-linecap="square" stroke-width="3.0"/>
   <polyline fill="none" points="5,45 55,45 325,45 325,125 335,125" stroke="rgb(255, 123, 0)" stroke-linecap="square" stroke-width="3.0"/>
   <polyline fill="none" points="1055,25 845,25 845,105 855,105" stroke="rgb(255, 123, 0)" stroke-linecap="square" stroke-width="3.0"/>
   <polyline fill="none" points="565,5 835,5" stroke="rgb(255, 123, 0)" stroke-linecap="square" stroke-width="3.0"/>
   <polyline fill="none" points="585,45 855,45" stroke="rgb(255, 123, 0)" stroke-linecap="square" stroke-width="3.0"/>
   <polyline fill="none" points="315,25 575,25" stroke="rgb(255, 123, 0)" stroke-linecap="square" stroke-width="3.0"/>
   <polyline fill="none" points="325,45 585,45 585,125 605,125 615,125" stroke="rgb(255, 123, 0)" stroke-linecap="square" stroke-width="3.0"/>
   <ellipse cx="565.0" cy="5.0" fill="rgb(255, 123, 0)" rx="5.0" ry="5.0" stroke="none" stroke-width="3.0"/>
   <ellipse cx="855.0" cy="105.0" fill="rgb(255, 123, 0)" rx="5.0" ry="5.0" stroke="none" stroke-width="3.0"/>
   <ellipse cx="305.0" cy="5.0" fill="rgb(255, 123, 0)" rx="5.0" ry="5.0" stroke="none" stroke-width="3.0"/>
   <ellipse cx="585.0" cy="45.0" fill="rgb(255, 123, 0)" rx="5.0" ry="5.0" stroke="none" stroke-width="3.0"/>
   <ellipse cx="325.0" cy="45.0" fill="rgb(255, 123, 0)" rx="5.0" ry="5.0" stroke="none" stroke-width="3.0"/>
   <ellipse cx="45.0" cy="25.0" fill="rgb(255, 123, 0)" rx="5.0" ry="5.0" stroke="none" stroke-width="3.0"/>
   <ellipse cx="835.0" cy="5.0" fill="rgb(255, 123, 0)" rx="5.0" ry="5.0" stroke="none" stroke-width="3.0"/>
   <ellipse cx="855.0" cy="45.0" fill="rgb(255, 123, 0)" rx="5.0" ry="5.0" stroke="none" stroke-width="3.0"/>
   <ellipse cx="575.0" cy="25.0" fill="rgb(255, 123, 0)" rx="5.0" ry="5.0" stroke="none" stroke-width="3.0"/>
   <ellipse cx="315.0" cy="25.0" fill="rgb(255, 123, 0)" rx="5.0" ry="5.0" stroke="none" stroke-width="3.0"/>
   <ellipse cx="605.0" cy="125.0" fill="rgb(255, 123, 0)" rx="5.0" ry="5.0" stroke="none" stroke-width="3.0"/>
   <ellipse cx="35.0" cy="5.0" fill="rgb(255, 123, 0)" rx="5.0" ry="5.0" stroke="none" stroke-width="3.0"/>
   <ellipse cx="55.0" cy="45.0" fill="rgb(255, 123, 0)" rx="5.0" ry="5.0" stroke="none" stroke-width="3.0"/>
   <ellipse cx="855.0" cy="85.0" fill="rgb(255, 123, 0)" rx="5.0" ry="5.0" stroke="none" stroke-width="3.0"/>
   <ellipse cx="845.0" cy="25.0" fill="rgb(255, 123, 0)" rx="5.0" ry="5.0" stroke="none" stroke-width="3.0"/>
   <rect fill="rgb(0, 0, 0)" height="3" stroke="none" stroke-linecap="square" stroke-width="1.0" width="10" x="65" y="84"/>
   <text fill="rgb(64, 64, 64)" font-family="Courier 10 Pitch" font-size="12" x="80.0" y="89.0">c</text>
   <rect fill="rgb(0, 0, 0)" height="4" stroke="none" stroke-linecap="square" stroke-width="1.0" width="10" x="65" y="103"/>
   <text fill="rgb(64, 64, 64)" font-family="Courier 10 Pitch" font-size="12" x="80.0" y="109.0">A</text>
   <rect fill="rgb(0, 0, 0)" height="4" stroke="none" stroke-linecap="square" stroke-width="1.0" width="10" x="65" y="123"/>
   <text fill="rgb(64, 64, 64)" font-family="Courier 10 Pitch" font-size="12" x="80.0" y="129.0">D</text>
   <rect fill="rgb(0, 0, 0)" height="20" stroke="none" stroke-linecap="square" stroke-width="1.0" width="200" x="75" y="135"/>
   <polyline fill="none" points="75,75 274,75" stroke="rgb(0, 0, 0)" stroke-linecap="square" stroke-width="2.0"/>
   <polyline fill="none" points="275,75 275,154" stroke="rgb(0, 0, 0)" stroke-linecap="square" stroke-width="2.0"/>
   <polyline fill="none" points="275,155 76,155" stroke="rgb(0, 0, 0)" stroke-linecap="square" stroke-width="2.0"/>
   <polyline fill="none" points="75,155 75,76" stroke="rgb(0, 0, 0)" stroke-linecap="square" stroke-width="2.0"/>
   <text fill="rgb(255, 255, 255)" font-family="Courier 10 Pitch" font-size="14" font-weight="bold" x="163.0" y="149.0">CPU</text>
   <ellipse cx="65.0" cy="85.0" fill="rgb(0, 0, 0)" rx="2.0" ry="2.0" stroke="none" stroke-width="1.0"/>
   <ellipse cx="65.0" cy="105.0" fill="rgb(0, 0, 0)" rx="2.0" ry="2.0" stroke="none" stroke-width="1.0"/>
   <ellipse cx="65.0" cy="125.0" fill="rgb(0, 0, 0)" rx="2.0" ry="2.0" stroke="none" stroke-width="1.0"/>
   <rect fill="rgb(0, 0, 0)" height="3" stroke="none" stroke-linecap="square" stroke-width="1.0" width="10" x="335" y="84"/>
   <text fill="rgb(64, 64, 64)" font-family="Courier 10 Pitch" font-size="12" x="350.0" y="89.0">c</text>
   <rect fill="rgb(0, 0, 0)" height="4" stroke="none" stroke-linecap="square" stroke-width="1.0" width="10" x="335" y="103"/>
   <text fill="rgb(64, 64, 64)" font-family="Courier 10 Pitch" font-size="12" x="350.0" y="109.0">A</text>
   <rect fill="rgb(0, 0, 0)" height="4" stroke="none" stroke-linecap="square" stroke-width="1.0" width="10" x="335" y="123"/>
   <text fill="rgb(64, 64, 64)" font-family="Courier 10 Pitch" font-size="12" x="350.0" y="129.0">D</text>
   <rect fill="rgb(0, 0, 0)" height="20" stroke="none" stroke-linecap="square" stroke-width="1.0" width="200" x="345" y="135"/>
   <polyline fill="none" points="345,75 544,75" stroke="rgb(0, 0, 0)" stroke-linecap="square" stroke-width="2.0"/>
   <polyline fill="none" points="545,75 545,154" stroke="rgb(0, 0, 0)" stroke-linecap="square" stroke-width="2.0"/>
   <polyline fill="none" points="545,155 346,155" stroke="rgb(0, 0, 0)" stroke-linecap="square" stroke-width="2.0"/>
   <polyline fill="none" points="345,155 345,76" stroke="rgb(0, 0, 0)" stroke-linecap="square" stroke-width="2.0"/>
   <text fill="rgb(255, 255, 255)" font-family="Courier 10 Pitch" font-size="14" font-weight="bold" x="429.0" y="149.0">RAM1</text>
   <ellipse cx="335.0" cy="85.0" fill="rgb(0, 0, 0)" rx="2.0" ry="2.0" stroke="none" stroke-width="1.0"/>
   <ellipse cx="335.0" cy="105.0" fill="rgb(0, 0, 0)" rx="2.0" ry="2.0" stroke="none" stroke-width="1.0"/>
   <ellipse cx="335.0" cy="125.0" fill="rgb(0, 0, 0)" rx="2.0" ry="2.0" stroke="none" stroke-width="1.0"/>
   <rect fill="rgb(0, 0, 0)" height="3" stroke="none" stroke-linecap="square" stroke-width="1.0" width="10" x="605" y="84"/>
   <text fill="rgb(64, 64, 64)" font-family="Courier 10 Pitch" font-size="12" x="620.0" y="89.0">c</text>
   <rect fill="rgb(0, 0, 0)" height="4" stroke="none" stroke-linecap="square" stroke-width="1.0" width="10" x="605" y="103"/>
   <text fill="rgb(64, 64, 64)" font-family="Courier 10 Pitch" font-size="12" x="620.0" y="109.0">A</text>
   <rect fill="rgb(0, 0, 0)" height="4" stroke="none" stroke-linecap="square" stroke-width="1.0" width="10" x="605" y="123"/>
   <text fill="rgb(64, 64, 64)" font-family="Courier 10 Pitch" font-size="12" x="620.0" y="129.0">D</text>
   <rect fill="rgb(0, 0, 0)" height="20" stroke="none" stroke-linecap="square" stroke-width="1.0" width="200" x="615" y="135"/>
   <polyline fill="none" points="615,75 814,75" stroke="rgb(0, 0, 0)" stroke-linecap="square" stroke-width="2.0"/>
   <polyline fill="none" points="815,75 815,154" stroke="rgb(0, 0, 0)" stroke-linecap="square" stroke-width="2.0"/>
   <polyline fill="none" points="815,155 616,155" stroke="rgb(0, 0, 0)" stroke-linecap="square" stroke-width="2.0"/>
   <polyline fill="none" points="615,155 615,76" stroke="rgb(0, 0, 0)" stroke-linecap="square" stroke-width="2.0"/>
   <text fill="rgb(255, 255, 255)" font-family="Courier 10 Pitch" font-size="14" font-weight="bold" x="699.0" y="149.0">RAM2</text>
   <ellipse cx="605.0" cy="85.0" fill="rgb(0, 0, 0)" rx="2.0" ry="2.0" stroke="none" stroke-width="1.0"/>
   <ellipse cx="605.0" cy="105.0" fill="rgb(0, 0, 0)" rx="2.0" ry="2.0" stroke="none" stroke-width="1.0"/>
   <ellipse cx="605.0" cy="125.0" fill="rgb(0, 0, 0)" rx="2.0" ry="2.0" stroke="none" stroke-width="1.0"/>
   <rect fill="rgb(0, 0, 0)" height="3" stroke="none" stroke-linecap="square" stroke-width="1.0" width="10" x="855" y="84"/>
   <text fill="rgb(64, 64, 64)" font-family="Courier 10 Pitch" font-size="12" x="870.0" y="89.0">c</text>
   <rect fill="rgb(0, 0, 0)" height="4" stroke="none" stroke-linecap="square" stroke-width="1.0" width="10" x="855" y="103"/>
   <text fill="rgb(64, 64, 64)" font-family="Courier 10 Pitch" font-size="12" x="870.0" y="109.0">A</text>
   <rect fill="rgb(0, 0, 0)" height="4" stroke="none" stroke-linecap="square" stroke-width="1.0" width="10" x="855" y="123"/>
   <text fill="rgb(64, 64, 64)" font-family="Courier 10 Pitch" font-size="12" x="870.0" y="129.0">D</text>
   <rect fill="rgb(0, 0, 0)" height="20" stroke="none" stroke-linecap="square" stroke-width="1.0" width="200" x="865" y="135"/>
   <polyline fill="none" points="865,75 1064,75" stroke="rgb(0, 0, 0)" stroke-linecap="square" stroke-width="2.0"/>
   <polyline fill="none" points="1065,75 1065,154" stroke="rgb(0, 0, 0)" stroke-linecap="square" stroke-width="2.0"/>
   <polyline fill="none" points="1065,155 866,155" stroke="rgb(0, 0, 0)" stroke-linecap="square" stroke-width="2.0"/>
   <polyline fill="none" points="865,155 865,76" stroke="rgb(0, 0, 0)" stroke-linecap="square" stroke-width="2.0"/>
   <text fill="rgb(255, 255, 255)" font-family="Courier 10 Pitch" font-size="14" font-weight="bold" x="949.0" y="149.0">ROM1</text>
   <ellipse cx="855.0" cy="85.0" fill="rgb(0, 0, 0)" rx="2.0" ry="2.0" stroke="none" stroke-width="1.0"/>
   <ellipse cx="855.0" cy="105.0" fill="rgb(0, 0, 0)" rx="2.0" ry="2.0" stroke="none" stroke-width="1.0"/>
   <ellipse cx="855.0" cy="125.0" fill="rgb(0, 0, 0)" rx="2.0" ry="2.0" stroke="none" stroke-width="1.0"/>
</svg>
