<?xml version="1.0" encoding="UTF-8" standalone="no"?>
<svg
   version="1.1"
   viewBox="0 0 258 243"
   id="svg146"
   sodipodi:docname="adder_3bit.svg"
   inkscape:version="1.1.2 (0a00cf5339, 2022-02-04)"
   xmlns:inkscape="http://www.inkscape.org/namespaces/inkscape"
   xmlns:sodipodi="http://sodipodi.sourceforge.net/DTD/sodipodi-0.dtd"
   xmlns="http://www.w3.org/2000/svg"
   xmlns:svg="http://www.w3.org/2000/svg">
  <defs
     id="defs150" />
  <sodipodi:namedview
     id="namedview148"
     pagecolor="#ffffff"
     bordercolor="#666666"
     borderopacity="1.0"
     inkscape:pageshadow="2"
     inkscape:pageopacity="0.0"
     inkscape:pagecheckerboard="0"
     showgrid="false"
     inkscape:zoom="3.5925926"
     inkscape:cx="129.01546"
     inkscape:cy="121.5"
     inkscape:window-width="2486"
     inkscape:window-height="1376"
     inkscape:window-x="74"
     inkscape:window-y="27"
     inkscape:window-maximized="1"
     inkscape:current-layer="svg146" />
  <polyline
     fill="none"
     points="196,56 226,56"
     stroke="rgb(0, 0, 0)"
     stroke-linecap="square"
     stroke-width="3.0"
     id="polyline2" />
  <polyline
     fill="none"
     points="196,116 226,116"
     stroke="rgb(0, 0, 0)"
     stroke-linecap="square"
     stroke-width="3.0"
     id="polyline4" />
  <polyline
     fill="none"
     points="196,176 226,176"
     stroke="rgb(0, 0, 0)"
     stroke-linecap="square"
     stroke-width="3.0"
     id="polyline6" />
  <polyline
     fill="none"
     points="96,46 156,46"
     stroke="rgb(0, 0, 0)"
     stroke-linecap="square"
     stroke-width="3.0"
     id="polyline8" />
  <polyline
     fill="none"
     points="96,106 156,106"
     stroke="rgb(0, 0, 0)"
     stroke-linecap="square"
     stroke-width="3.0"
     id="polyline10" />
  <polyline
     fill="none"
     points="96,166 156,166"
     stroke="rgb(0, 0, 0)"
     stroke-linecap="square"
     stroke-width="3.0"
     id="polyline12" />
  <polyline
     fill="none"
     points="176,26 176,36"
     stroke="rgb(0, 0, 0)"
     stroke-linecap="square"
     stroke-width="3.0"
     id="polyline14" />
  <polyline
     fill="none"
     points="36,66 156,66"
     stroke="rgb(0, 0, 0)"
     stroke-linecap="square"
     stroke-width="3.0"
     id="polyline16" />
  <polyline
     fill="none"
     points="36,126 156,126"
     stroke="rgb(0, 0, 0)"
     stroke-linecap="square"
     stroke-width="3.0"
     id="polyline18" />
  <polyline
     fill="none"
     points="36,186 156,186"
     stroke="rgb(0, 0, 0)"
     stroke-linecap="square"
     stroke-width="3.0"
     id="polyline20" />
  <polyline
     fill="none"
     points="176,76 176,96"
     stroke="rgb(0, 0, 0)"
     stroke-linecap="square"
     stroke-width="3.0"
     id="polyline22" />
  <polyline
     fill="none"
     points="176,136 176,156"
     stroke="rgb(0, 0, 0)"
     stroke-linecap="square"
     stroke-width="3.0"
     id="polyline24" />
  <polyline
     fill="none"
     points="176,196 176,216"
     stroke="rgb(0, 0, 0)"
     stroke-linecap="square"
     stroke-width="3.0"
     id="polyline26" />
  <polyline
     fill="none"
     points="156,36 195,36"
     stroke="rgb(0, 0, 0)"
     stroke-linecap="square"
     stroke-width="2.0"
     id="polyline28" />
  <polyline
     fill="none"
     points="196,36 196,75"
     stroke="rgb(0, 0, 0)"
     stroke-linecap="square"
     stroke-width="2.0"
     id="polyline30" />
  <polyline
     fill="none"
     points="196,76 157,76"
     stroke="rgb(0, 0, 0)"
     stroke-linecap="square"
     stroke-width="2.0"
     id="polyline32" />
  <polyline
     fill="none"
     points="156,76 156,37"
     stroke="rgb(0, 0, 0)"
     stroke-linecap="square"
     stroke-width="2.0"
     id="polyline34" />
  <ellipse
     cx="156.0"
     cy="46.0"
     fill="rgb(0, 0, 0)"
     rx="2.0"
     ry="2.0"
     stroke="none"
     stroke-width="1.0"
     id="ellipse36" />
  <ellipse
     cx="156.0"
     cy="66.0"
     fill="rgb(0, 0, 0)"
     rx="2.0"
     ry="2.0"
     stroke="none"
     stroke-width="1.0"
     id="ellipse38" />
  <ellipse
     cx="196.0"
     cy="56.0"
     fill="rgb(0, 0, 0)"
     rx="2.0"
     ry="2.0"
     stroke="none"
     stroke-width="1.0"
     id="ellipse40" />
  <ellipse
     cx="176.0"
     cy="36.0"
     fill="rgb(0, 0, 0)"
     rx="2.0"
     ry="2.0"
     stroke="none"
     stroke-width="1.0"
     id="ellipse42" />
  <ellipse
     cx="176.0"
     cy="76.0"
     fill="rgb(0, 0, 0)"
     rx="2.0"
     ry="2.0"
     stroke="none"
     stroke-width="1.0"
     id="ellipse46" />
  <polyline
     fill="none"
     points="181,56 191,56"
     stroke="rgb(0, 0, 0)"
     stroke-linecap="square"
     stroke-width="2.0"
     id="polyline50" />
  <polyline
     fill="none"
     points="186,51 186,61"
     stroke="rgb(0, 0, 0)"
     stroke-linecap="square"
     stroke-width="2.0"
     id="polyline52" />
  <polyline
     fill="none"
     points="156,96 195,96"
     stroke="rgb(0, 0, 0)"
     stroke-linecap="square"
     stroke-width="2.0"
     id="polyline54" />
  <polyline
     fill="none"
     points="196,96 196,135"
     stroke="rgb(0, 0, 0)"
     stroke-linecap="square"
     stroke-width="2.0"
     id="polyline56" />
  <polyline
     fill="none"
     points="196,136 157,136"
     stroke="rgb(0, 0, 0)"
     stroke-linecap="square"
     stroke-width="2.0"
     id="polyline58" />
  <polyline
     fill="none"
     points="156,136 156,97"
     stroke="rgb(0, 0, 0)"
     stroke-linecap="square"
     stroke-width="2.0"
     id="polyline60" />
  <ellipse
     cx="156.0"
     cy="106.0"
     fill="rgb(0, 0, 0)"
     rx="2.0"
     ry="2.0"
     stroke="none"
     stroke-width="1.0"
     id="ellipse62" />
  <ellipse
     cx="156.0"
     cy="126.0"
     fill="rgb(0, 0, 0)"
     rx="2.0"
     ry="2.0"
     stroke="none"
     stroke-width="1.0"
     id="ellipse64" />
  <ellipse
     cx="196.0"
     cy="116.0"
     fill="rgb(0, 0, 0)"
     rx="2.0"
     ry="2.0"
     stroke="none"
     stroke-width="1.0"
     id="ellipse66" />
  <ellipse
     cx="176.0"
     cy="96.0"
     fill="rgb(0, 0, 0)"
     rx="2.0"
     ry="2.0"
     stroke="none"
     stroke-width="1.0"
     id="ellipse68" />
  <ellipse
     cx="176.0"
     cy="136.0"
     fill="rgb(0, 0, 0)"
     rx="2.0"
     ry="2.0"
     stroke="none"
     stroke-width="1.0"
     id="ellipse72" />
  <polyline
     fill="none"
     points="181,116 191,116"
     stroke="rgb(0, 0, 0)"
     stroke-linecap="square"
     stroke-width="2.0"
     id="polyline76" />
  <polyline
     fill="none"
     points="186,111 186,121"
     stroke="rgb(0, 0, 0)"
     stroke-linecap="square"
     stroke-width="2.0"
     id="polyline78" />
  <polyline
     fill="none"
     points="156,156 195,156"
     stroke="rgb(0, 0, 0)"
     stroke-linecap="square"
     stroke-width="2.0"
     id="polyline80" />
  <polyline
     fill="none"
     points="196,156 196,195"
     stroke="rgb(0, 0, 0)"
     stroke-linecap="square"
     stroke-width="2.0"
     id="polyline82" />
  <polyline
     fill="none"
     points="196,196 157,196"
     stroke="rgb(0, 0, 0)"
     stroke-linecap="square"
     stroke-width="2.0"
     id="polyline84" />
  <polyline
     fill="none"
     points="156,196 156,157"
     stroke="rgb(0, 0, 0)"
     stroke-linecap="square"
     stroke-width="2.0"
     id="polyline86" />
  <ellipse
     cx="156.0"
     cy="166.0"
     fill="rgb(0, 0, 0)"
     rx="2.0"
     ry="2.0"
     stroke="none"
     stroke-width="1.0"
     id="ellipse88" />
  <ellipse
     cx="156.0"
     cy="186.0"
     fill="rgb(0, 0, 0)"
     rx="2.0"
     ry="2.0"
     stroke="none"
     stroke-width="1.0"
     id="ellipse90" />
  <ellipse
     cx="196.0"
     cy="176.0"
     fill="rgb(0, 0, 0)"
     rx="2.0"
     ry="2.0"
     stroke="none"
     stroke-width="1.0"
     id="ellipse92" />
  <ellipse
     cx="176.0"
     cy="156.0"
     fill="rgb(0, 0, 0)"
     rx="2.0"
     ry="2.0"
     stroke="none"
     stroke-width="1.0"
     id="ellipse94" />
  <ellipse
     cx="176.0"
     cy="196.0"
     fill="rgb(0, 0, 0)"
     rx="2.0"
     ry="2.0"
     stroke="none"
     stroke-width="1.0"
     id="ellipse98" />
  <polyline
     fill="none"
     points="181,176 191,176"
     stroke="rgb(0, 0, 0)"
     stroke-linecap="square"
     stroke-width="2.0"
     id="polyline102" />
  <polyline
     fill="none"
     points="186,171 186,181"
     stroke="rgb(0, 0, 0)"
     stroke-linecap="square"
     stroke-width="2.0"
     id="polyline104" />
  <text
     fill="rgb(0, 0, 0)"
     font-family="SansSerif"
     font-size="12"
     x="73.0"
     y="107.0"
     id="text106">Y</text>
  <text
     fill="rgb(0, 0, 0)"
     font-family="SansSerif"
     font-size="12"
     x="74.0"
     y="42.0"
     id="text108">Y</text>
  <text
     fill="rgb(0, 0, 0)"
     font-family="SansSerif"
     font-size="12"
     x="75.0"
     y="168.0"
     id="text110">Y</text>
  <text
     fill="rgb(0, 0, 0)"
     font-family="SansSerif"
     font-size="12"
     x="78.0"
     y="113.0"
     id="text112">1</text>
  <text
     fill="rgb(0, 0, 0)"
     font-family="SansSerif"
     font-size="12"
     x="79.0"
     y="51.0"
     id="text114">0</text>
  <text
     fill="rgb(0, 0, 0)"
     font-family="SansSerif"
     font-size="12"
     x="79.0"
     y="175.0"
     id="text116">2</text>
  <text
     fill="rgb(0, 0, 0)"
     font-family="SansSerif"
     font-size="12"
     x="146.0"
     y="231.0"
     id="text118">overflow</text>
  <text
     fill="rgb(0, 0, 0)"
     font-family="SansSerif"
     font-size="12"
     x="171.0"
     y="21.0"
     id="text120">0</text>
  <text
     fill="rgb(0, 0, 0)"
     font-family="SansSerif"
     font-size="12"
     x="234.0"
     y="59.0"
     id="text122">Z</text>
  <text
     fill="rgb(0, 0, 0)"
     font-family="SansSerif"
     font-size="12"
     x="234.0"
     y="122.0"
     id="text124">Z</text>
  <text
     fill="rgb(0, 0, 0)"
     font-family="SansSerif"
     font-size="12"
     x="234.0"
     y="183.0"
     id="text126">Z</text>
  <text
     fill="rgb(0, 0, 0)"
     font-family="SansSerif"
     font-size="12"
     x="240.0"
     y="133.0"
     id="text128">1</text>
  <text
     fill="rgb(0, 0, 0)"
     font-family="SansSerif"
     font-size="12"
     x="241.0"
     y="66.0"
     id="text130">0</text>
  <text
     fill="rgb(0, 0, 0)"
     font-family="SansSerif"
     font-size="12"
     x="241.0"
     y="192.0"
     id="text132">2</text>
  <text
     fill="rgb(0, 0, 0)"
     font-family="SansSerif"
     font-size="12"
     x="9.0"
     y="64.0"
     id="text134">X</text>
  <text
     fill="rgb(0, 0, 0)"
     font-family="SansSerif"
     font-size="12"
     x="9.0"
     y="188.0"
     id="text136">X</text>
  <text
     fill="rgb(0, 0, 0)"
     font-family="SansSerif"
     font-size="12"
     x="10.0"
     y="123.0"
     id="text138">X</text>
  <text
     fill="rgb(0, 0, 0)"
     font-family="SansSerif"
     font-size="12"
     x="15.0"
     y="71.0"
     id="text140">0</text>
  <text
     fill="rgb(0, 0, 0)"
     font-family="SansSerif"
     font-size="12"
     x="15.0"
     y="134.0"
     id="text142">1</text>
  <text
     fill="rgb(0, 0, 0)"
     font-family="SansSerif"
     font-size="12"
     x="15.0"
     y="197.0"
     id="text144">2</text>
</svg>
