<?xml version="1.0" encoding="UTF-8" standalone="no"?>
<svg
   version="1.1"
   viewBox="0 0 1137 550"
   id="svg406"
   sodipodi:docname="controlUnit1.svg"
   inkscape:version="1.1.2 (0a00cf5339, 2022-02-04)"
   xmlns:inkscape="http://www.inkscape.org/namespaces/inkscape"
   xmlns:sodipodi="http://sodipodi.sourceforge.net/DTD/sodipodi-0.dtd"
   xmlns="http://www.w3.org/2000/svg"
   xmlns:svg="http://www.w3.org/2000/svg">
  <defs
     id="defs410" />
  <sodipodi:namedview
     id="namedview408"
     pagecolor="#ffffff"
     bordercolor="#666666"
     borderopacity="1.0"
     inkscape:pageshadow="2"
     inkscape:pageopacity="0.0"
     inkscape:pagecheckerboard="0"
     showgrid="false"
     inkscape:zoom="1.176781"
     inkscape:cx="568.07511"
     inkscape:cy="274.90247"
     inkscape:window-width="2486"
     inkscape:window-height="1376"
     inkscape:window-x="74"
     inkscape:window-y="27"
     inkscape:window-maximized="1"
     inkscape:current-layer="svg406" />
  <polyline
     fill="none"
     points="395,135 415,135"
     stroke="rgb(0, 0, 0)"
     stroke-linecap="square"
     stroke-width="3.0"
     id="polyline2" />
  <polyline
     fill="none"
     points="395,155 415,155"
     stroke="rgb(0, 0, 0)"
     stroke-linecap="square"
     stroke-width="3.0"
     id="polyline4" />
  <polyline
     fill="none"
     points="115,425 125,425 145,425"
     stroke="rgb(0, 0, 0)"
     stroke-linecap="square"
     stroke-width="3.0"
     id="polyline6" />
  <polyline
     fill="none"
     points="695,125 705,125"
     stroke="rgb(0, 0, 0)"
     stroke-linecap="square"
     stroke-width="4.0"
     id="polyline8" />
  <polyline
     fill="none"
     points="695,385 705,385"
     stroke="rgb(0, 0, 0)"
     stroke-linecap="square"
     stroke-width="4.0"
     id="polyline10" />
  <polyline
     fill="none"
     points="975,165 1015,165"
     stroke="rgb(0, 0, 0)"
     stroke-linecap="square"
     stroke-width="4.0"
     id="polyline12" />
  <polyline
     fill="none"
     points="195,505 195,495 505,495"
     stroke="rgb(0, 0, 0)"
     stroke-linecap="square"
     stroke-width="3.0"
     id="polyline14" />
  <polyline
     fill="none"
     points="735,135 925,135 925,145"
     stroke="rgb(0, 0, 0)"
     stroke-linecap="square"
     stroke-width="4.0"
     id="polyline16" />
  <polyline
     fill="none"
     points="505,455 445,455 445,255 485,255 485,315 515,315"
     stroke="rgb(0, 0, 0)"
     stroke-linecap="square"
     stroke-width="3.0"
     id="polyline18" />
  <polyline
     fill="none"
     points="735,25 775,25"
     stroke="rgb(0, 0, 0)"
     stroke-linecap="square"
     stroke-width="4.0"
     id="polyline20" />
  <polyline
     fill="none"
     points="735,285 775,285"
     stroke="rgb(0, 0, 0)"
     stroke-linecap="square"
     stroke-width="4.0"
     id="polyline22" />
  <polyline
     fill="none"
     points="395,175 445,175 445,255"
     stroke="rgb(0, 0, 0)"
     stroke-linecap="square"
     stroke-width="3.0"
     id="polyline24" />
  <polyline
     fill="none"
     points="735,395 905,395 905,185 925,185"
     stroke="rgb(0, 0, 0)"
     stroke-linecap="square"
     stroke-width="4.0"
     id="polyline26" />
  <polyline
     fill="none"
     points="25,425 55,425"
     stroke="rgb(0, 0, 0)"
     stroke-linecap="square"
     stroke-width="3.0"
     id="polyline28" />
  <polyline
     fill="none"
     points="395,125 415,125"
     stroke="rgb(0, 0, 0)"
     stroke-linecap="square"
     stroke-width="3.0"
     id="polyline30" />
  <polyline
     fill="none"
     points="395,145 415,145"
     stroke="rgb(0, 0, 0)"
     stroke-linecap="square"
     stroke-width="3.0"
     id="polyline32" />
  <polyline
     fill="none"
     points="395,165 415,165"
     stroke="rgb(0, 0, 0)"
     stroke-linecap="square"
     stroke-width="3.0"
     id="polyline34" />
  <polyline
     fill="none"
     points="185,505 185,475 395,475 395,355 515,355"
     stroke="rgb(0, 0, 0)"
     stroke-linecap="square"
     stroke-width="3.0"
     id="polyline36" />
  <polyline
     fill="none"
     points="205,425 215,425"
     stroke="rgb(0, 0, 0)"
     stroke-linecap="square"
     stroke-width="3.0"
     id="polyline38" />
  <polyline
     fill="none"
     points="695,15 705,15"
     stroke="rgb(0, 0, 0)"
     stroke-linecap="square"
     stroke-width="4.0"
     id="polyline40" />
  <polyline
     fill="none"
     points="695,275 705,275"
     stroke="rgb(0, 0, 0)"
     stroke-linecap="square"
     stroke-width="4.0"
     id="polyline42" />
  <polyline
     fill="none"
     points="375,185 375,305 365,305"
     stroke="rgb(0, 0, 0)"
     stroke-linecap="square"
     stroke-width="4.0"
     id="polyline44" />
  <ellipse
     cx="215.0"
     cy="425.0"
     fill="rgb(0, 0, 0)"
     rx="5.0"
     ry="5.0"
     stroke="none"
     stroke-width="4.0"
     id="ellipse46" />
  <ellipse
     cx="125.0"
     cy="425.0"
     fill="rgb(0, 0, 0)"
     rx="5.0"
     ry="5.0"
     stroke="none"
     stroke-width="4.0"
     id="ellipse48" />
  <ellipse
     cx="445.0"
     cy="255.0"
     fill="rgb(0, 0, 0)"
     rx="5.0"
     ry="5.0"
     stroke="none"
     stroke-width="4.0"
     id="ellipse50" />
  <polyline
     fill="none"
     points="1019,165 1016,165"
     stroke="rgb(0, 0, 0)"
     stroke-linecap="square"
     stroke-width="4.0"
     id="polyline52" />
  <polygon
     fill="none"
     points="1031,156 1021,165 1031,174 1105,174 1105,156"
     stroke="rgb(0, 0, 0)"
     stroke-linecap="square"
     stroke-width="2.0"
     id="polygon54" />
  <text
     fill="rgb(0, 0, 0)"
     font-family="Monospaced"
     font-size="12"
     x="1053.0"
     y="171.0"
     id="text56">x32</text>
  <text
     fill="rgb(0, 0, 0)"
     font-family="Monospaced"
     font-size="16"
     font-weight="bold"
     x="1107.0"
     y="172.0"
     id="text58">SO</text>
  <ellipse
     cx="1015.0"
     cy="165.0"
     fill="rgb(0, 0, 0)"
     rx="2.0"
     ry="2.0"
     stroke="none"
     stroke-width="2.0"
     id="ellipse60" />
  <polyline
     fill="none"
     points="359,334 359,311 364,306"
     stroke="rgb(0, 0, 0)"
     stroke-linecap="square"
     stroke-width="5.0"
     id="polyline62" />
  <text
     fill="rgb(0, 0, 0)"
     font-family="SansSerif"
     font-size="7"
     x="352.0"
     y="312.0"
     id="text64">0</text>
  <text
     fill="rgb(0, 0, 0)"
     font-family="SansSerif"
     font-size="7"
     x="352.0"
     y="322.0"
     id="text66">1</text>
  <text
     fill="rgb(0, 0, 0)"
     font-family="SansSerif"
     font-size="7"
     x="352.0"
     y="332.0"
     id="text68">2</text>
  <ellipse
     cx="365.0"
     cy="305.0"
     fill="rgb(0, 0, 0)"
     rx="2.0"
     ry="2.0"
     stroke="none"
     stroke-width="5.0"
     id="ellipse70" />
  <ellipse
     cx="345.0"
     cy="315.0"
     fill="rgb(0, 0, 0)"
     rx="2.0"
     ry="2.0"
     stroke="none"
     stroke-width="5.0"
     id="ellipse72" />
  <ellipse
     cx="345.0"
     cy="325.0"
     fill="rgb(0, 0, 0)"
     rx="2.0"
     ry="2.0"
     stroke="none"
     stroke-width="5.0"
     id="ellipse74" />
  <ellipse
     cx="345.0"
     cy="335.0"
     fill="rgb(0, 0, 0)"
     rx="2.0"
     ry="2.0"
     stroke="none"
     stroke-width="5.0"
     id="ellipse76" />
  <polyline
     fill="none"
     points="652,35 655,35 705,35"
     stroke="rgb(0, 0, 0)"
     stroke-linecap="square"
     stroke-width="4.0"
     id="polyline78" />
  <polygon
     fill="none"
     points="640,44 650,35 640,26 566,26 566,44"
     stroke="rgb(0, 0, 0)"
     stroke-linecap="square"
     stroke-width="2.0"
     id="polygon80" />
  <text
     fill="rgb(0, 0, 0)"
     font-family="Monospaced"
     font-size="12"
     x="593.0"
     y="41.0"
     id="text82">x32</text>
  <ellipse
     cx="655.0"
     cy="35.0"
     fill="rgb(0, 0, 0)"
     rx="2.0"
     ry="2.0"
     stroke="none"
     stroke-width="2.0"
     id="ellipse84" />
  <polyline
     fill="none"
     points="652,145 655,145 705,145"
     stroke="rgb(0, 0, 0)"
     stroke-linecap="square"
     stroke-width="4.0"
     id="polyline86" />
  <polygon
     fill="none"
     points="640,154 650,145 640,136 566,136 566,154"
     stroke="rgb(0, 0, 0)"
     stroke-linecap="square"
     stroke-width="2.0"
     id="polygon88" />
  <text
     fill="rgb(0, 0, 0)"
     font-family="Monospaced"
     font-size="12"
     x="593.0"
     y="151.0"
     id="text90">x32</text>
  <ellipse
     cx="655.0"
     cy="145.0"
     fill="rgb(0, 0, 0)"
     rx="2.0"
     ry="2.0"
     stroke="none"
     stroke-width="2.0"
     id="ellipse92" />
  <polyline
     fill="none"
     points="652,295 655,295 705,295"
     stroke="rgb(0, 0, 0)"
     stroke-linecap="square"
     stroke-width="4.0"
     id="polyline94" />
  <polygon
     fill="none"
     points="640,304 650,295 640,286 566,286 566,304"
     stroke="rgb(0, 0, 0)"
     stroke-linecap="square"
     stroke-width="2.0"
     id="polygon96" />
  <text
     fill="rgb(0, 0, 0)"
     font-family="Monospaced"
     font-size="12"
     x="593.0"
     y="301.0"
     id="text98">x32</text>
  <ellipse
     cx="655.0"
     cy="295.0"
     fill="rgb(0, 0, 0)"
     rx="2.0"
     ry="2.0"
     stroke="none"
     stroke-width="2.0"
     id="ellipse100" />
  <polyline
     fill="none"
     points="652,405 655,405 705,405"
     stroke="rgb(0, 0, 0)"
     stroke-linecap="square"
     stroke-width="4.0"
     id="polyline102" />
  <polygon
     fill="none"
     points="640,414 650,405 640,396 566,396 566,414"
     stroke="rgb(0, 0, 0)"
     stroke-linecap="square"
     stroke-width="2.0"
     id="polygon104" />
  <text
     fill="rgb(0, 0, 0)"
     font-family="Monospaced"
     font-size="12"
     x="593.0"
     y="411.0"
     id="text106">x32</text>
  <ellipse
     cx="655.0"
     cy="405.0"
     fill="rgb(0, 0, 0)"
     rx="2.0"
     ry="2.0"
     stroke="none"
     stroke-width="2.0"
     id="ellipse108" />
  <text
     fill="rgb(0, 0, 0)"
     font-family="Monospaced"
     font-size="12"
     x="635.0"
     y="19.0"
     id="text110">00000000</text>
  <ellipse
     cx="695.0"
     cy="15.0"
     fill="rgb(0, 0, 0)"
     rx="2.0"
     ry="2.0"
     stroke="none"
     stroke-width="1.0"
     id="ellipse112" />
  <text
     fill="rgb(0, 0, 0)"
     font-family="Monospaced"
     font-size="12"
     x="635.0"
     y="129.0"
     id="text114">00000000</text>
  <ellipse
     cx="695.0"
     cy="125.0"
     fill="rgb(0, 0, 0)"
     rx="2.0"
     ry="2.0"
     stroke="none"
     stroke-width="1.0"
     id="ellipse116" />
  <text
     fill="rgb(0, 0, 0)"
     font-family="Monospaced"
     font-size="12"
     x="635.0"
     y="279.0"
     id="text118">00000000</text>
  <ellipse
     cx="695.0"
     cy="275.0"
     fill="rgb(0, 0, 0)"
     rx="2.0"
     ry="2.0"
     stroke="none"
     stroke-width="1.0"
     id="ellipse120" />
  <text
     fill="rgb(0, 0, 0)"
     font-family="Monospaced"
     font-size="12"
     x="635.0"
     y="389.0"
     id="text122">00000000</text>
  <ellipse
     cx="695.0"
     cy="385.0"
     fill="rgb(0, 0, 0)"
     rx="2.0"
     ry="2.0"
     stroke="none"
     stroke-width="1.0"
     id="ellipse124" />
  <polyline
     fill="none"
     points="779,25 776,25"
     stroke="rgb(0, 0, 0)"
     stroke-linecap="square"
     stroke-width="4.0"
     id="polyline126" />
  <polygon
     fill="none"
     points="791,16 781,25 791,34 865,34 865,16"
     stroke="rgb(0, 0, 0)"
     stroke-linecap="square"
     stroke-width="2.0"
     id="polygon128" />
  <text
     fill="rgb(0, 0, 0)"
     font-family="Monospaced"
     font-size="12"
     x="813.0"
     y="31.0"
     id="text130">x32</text>
  <ellipse
     cx="775.0"
     cy="25.0"
     fill="rgb(0, 0, 0)"
     rx="2.0"
     ry="2.0"
     stroke="none"
     stroke-width="2.0"
     id="ellipse132" />
  <polyline
     fill="none"
     points="779,285 776,285"
     stroke="rgb(0, 0, 0)"
     stroke-linecap="square"
     stroke-width="4.0"
     id="polyline134" />
  <polygon
     fill="none"
     points="791,276 781,285 791,294 865,294 865,276"
     stroke="rgb(0, 0, 0)"
     stroke-linecap="square"
     stroke-width="2.0"
     id="polygon136" />
  <text
     fill="rgb(0, 0, 0)"
     font-family="Monospaced"
     font-size="12"
     x="813.0"
     y="291.0"
     id="text138">x32</text>
  <ellipse
     cx="775.0"
     cy="285.0"
     fill="rgb(0, 0, 0)"
     rx="2.0"
     ry="2.0"
     stroke="none"
     stroke-width="2.0"
     id="ellipse140" />
  <polyline
     fill="none"
     points="925,145 927,145"
     stroke="rgb(0, 0, 0)"
     stroke-linecap="square"
     stroke-width="3.0"
     id="polyline142" />
  <polyline
     fill="none"
     points="925,185 927,185"
     stroke="rgb(0, 0, 0)"
     stroke-linecap="square"
     stroke-width="3.0"
     id="polyline144" />
  <path
     d=" M975.0,165.0 C955.0,140.0 955.0,140.0 925.0,140.0 C938.0,165.0 938.0,165.0 925.0,190.0 C955.0,190.0 955.0,190.0 975.0,165.0 Z"
     fill="none"
     stroke="rgb(0, 0, 0)"
     stroke-linecap="square"
     stroke-width="2.0"
     id="path146" />
  <path
     d="M530.0,500.0 A25.0,25.0 90.0 0,0 530.0,450.0"
     fill="none"
     stroke="rgb(0, 0, 0)"
     stroke-width="2.0"
     id="path148" />
  <polyline
     fill="none"
     points="530,450 506,450 506,500 530,500"
     stroke="rgb(0, 0, 0)"
     stroke-linecap="square"
     stroke-width="2.0"
     id="polyline150" />
  <path
     d="M540.0,360.0 A25.0,25.0 90.0 0,0 540.0,310.0"
     fill="none"
     stroke="rgb(0, 0, 0)"
     stroke-width="2.0"
     id="path152" />
  <polyline
     fill="none"
     points="540,310 516,310 516,360 540,360"
     stroke="rgb(0, 0, 0)"
     stroke-linecap="square"
     stroke-width="2.0"
     id="polyline154" />
  <polyline
     fill="none"
     points="365,185 365,181"
     stroke="rgb(0, 0, 0)"
     stroke-linecap="square"
     stroke-width="3.0"
     id="polyline156" />
  <ellipse
     cx="375.0"
     cy="179.0"
     fill="rgb(192, 192, 192)"
     rx="3.0"
     ry="3.0"
     stroke="none"
     stroke-width="1.0"
     id="ellipse158" />
  <polygon
     fill="none"
     points="355,115 395,95 395,195 355,175"
     stroke="rgb(0, 0, 0)"
     stroke-linecap="square"
     stroke-width="2.0"
     id="polygon162" />
  <text
     fill="rgb(0, 0, 0)"
     font-family="SansSerif"
     font-size="12"
     x="359.0"
     y="151.0"
     id="text164">Decd</text>
  <ellipse
     cx="395.0"
     cy="115.0"
     fill="rgb(0, 0, 0)"
     rx="2.0"
     ry="2.0"
     stroke="none"
     stroke-width="2.0"
     id="ellipse168" />
  <ellipse
     cx="395.0"
     cy="125.0"
     fill="rgb(0, 0, 0)"
     rx="2.0"
     ry="2.0"
     stroke="none"
     stroke-width="2.0"
     id="ellipse170" />
  <ellipse
     cx="395.0"
     cy="135.0"
     fill="rgb(0, 0, 0)"
     rx="2.0"
     ry="2.0"
     stroke="none"
     stroke-width="2.0"
     id="ellipse172" />
  <ellipse
     cx="395.0"
     cy="145.0"
     fill="rgb(0, 0, 0)"
     rx="2.0"
     ry="2.0"
     stroke="none"
     stroke-width="2.0"
     id="ellipse174" />
  <ellipse
     cx="395.0"
     cy="155.0"
     fill="rgb(0, 0, 0)"
     rx="2.0"
     ry="2.0"
     stroke="none"
     stroke-width="2.0"
     id="ellipse176" />
  <ellipse
     cx="395.0"
     cy="165.0"
     fill="rgb(0, 0, 0)"
     rx="2.0"
     ry="2.0"
     stroke="none"
     stroke-width="2.0"
     id="ellipse178" />
  <ellipse
     cx="395.0"
     cy="175.0"
     fill="rgb(0, 0, 0)"
     rx="2.0"
     ry="2.0"
     stroke="none"
     stroke-width="2.0"
     id="ellipse180" />
  <ellipse
     cx="375.0"
     cy="185.0"
     fill="rgb(0, 0, 0)"
     rx="2.0"
     ry="2.0"
     stroke="none"
     stroke-width="2.0"
     id="ellipse182" />
  <ellipse
     cx="365.0"
     cy="185.0"
     fill="rgb(0, 0, 0)"
     rx="2.0"
     ry="2.0"
     stroke="none"
     stroke-width="2.0"
     id="ellipse184" />
  <polyline
     fill="none"
     points="715,41 715,45 715,65 495,65 495,105 395,105"
     stroke="rgb(0, 0, 0)"
     stroke-linecap="square"
     stroke-width="3.0"
     id="polyline186" />
  <ellipse
     cx="715.0"
     cy="37.0"
     fill="rgb(192, 192, 192)"
     rx="3.0"
     ry="3.0"
     stroke="none"
     stroke-width="1.0"
     id="ellipse188" />
  <polygon
     fill="none"
     points="705,5 735,15 735,35 705,45"
     stroke="rgb(0, 0, 0)"
     stroke-linecap="square"
     stroke-width="2.0"
     id="polygon192" />
  <text
     fill="rgb(0, 0, 0)"
     font-family="SansSerif"
     font-size="12"
     x="707.0"
     y="31.0"
     id="text194">MUX</text>
  <ellipse
     cx="705.0"
     cy="15.0"
     fill="rgb(0, 0, 0)"
     rx="2.0"
     ry="2.0"
     stroke="none"
     stroke-width="2.0"
     id="ellipse196" />
  <ellipse
     cx="705.0"
     cy="35.0"
     fill="rgb(0, 0, 0)"
     rx="2.0"
     ry="2.0"
     stroke="none"
     stroke-width="2.0"
     id="ellipse198" />
  <ellipse
     cx="715.0"
     cy="45.0"
     fill="rgb(0, 0, 0)"
     rx="2.0"
     ry="2.0"
     stroke="none"
     stroke-width="2.0"
     id="ellipse200" />
  <ellipse
     cx="735.0"
     cy="25.0"
     fill="rgb(0, 0, 0)"
     rx="2.0"
     ry="2.0"
     stroke="none"
     stroke-width="2.0"
     id="ellipse202" />
  <polyline
     fill="none"
     points="715,151 715,155 715,195 495,195 495,115 395,115"
     stroke="rgb(0, 0, 0)"
     stroke-linecap="square"
     stroke-width="3.0"
     id="polyline204" />
  <ellipse
     cx="715.0"
     cy="147.0"
     fill="rgb(192, 192, 192)"
     rx="3.0"
     ry="3.0"
     stroke="none"
     stroke-width="1.0"
     id="ellipse206" />
  <polygon
     fill="none"
     points="705,115 735,125 735,145 705,155"
     stroke="rgb(0, 0, 0)"
     stroke-linecap="square"
     stroke-width="2.0"
     id="polygon210" />
  <text
     fill="rgb(0, 0, 0)"
     font-family="SansSerif"
     font-size="12"
     x="707.0"
     y="141.0"
     id="text212">MUX</text>
  <ellipse
     cx="705.0"
     cy="125.0"
     fill="rgb(0, 0, 0)"
     rx="2.0"
     ry="2.0"
     stroke="none"
     stroke-width="2.0"
     id="ellipse214" />
  <ellipse
     cx="705.0"
     cy="145.0"
     fill="rgb(0, 0, 0)"
     rx="2.0"
     ry="2.0"
     stroke="none"
     stroke-width="2.0"
     id="ellipse216" />
  <ellipse
     cx="715.0"
     cy="155.0"
     fill="rgb(0, 0, 0)"
     rx="2.0"
     ry="2.0"
     stroke="none"
     stroke-width="2.0"
     id="ellipse218" />
  <ellipse
     cx="735.0"
     cy="135.0"
     fill="rgb(0, 0, 0)"
     rx="2.0"
     ry="2.0"
     stroke="none"
     stroke-width="2.0"
     id="ellipse220" />
  <polyline
     fill="none"
     points="715,301 715,305 715,335 565,335"
     stroke="rgb(0, 0, 0)"
     stroke-linecap="square"
     stroke-width="3.0"
     id="polyline222" />
  <ellipse
     cx="715.0"
     cy="297.0"
     fill="rgb(192, 192, 192)"
     rx="3.0"
     ry="3.0"
     stroke="none"
     stroke-width="1.0"
     id="ellipse224" />
  <polygon
     fill="none"
     points="705,265 735,275 735,295 705,305"
     stroke="rgb(0, 0, 0)"
     stroke-linecap="square"
     stroke-width="2.0"
     id="polygon228" />
  <text
     fill="rgb(0, 0, 0)"
     font-family="SansSerif"
     font-size="12"
     x="707.0"
     y="291.0"
     id="text230">MUX</text>
  <ellipse
     cx="705.0"
     cy="275.0"
     fill="rgb(0, 0, 0)"
     rx="2.0"
     ry="2.0"
     stroke="none"
     stroke-width="2.0"
     id="ellipse232" />
  <ellipse
     cx="705.0"
     cy="295.0"
     fill="rgb(0, 0, 0)"
     rx="2.0"
     ry="2.0"
     stroke="none"
     stroke-width="2.0"
     id="ellipse234" />
  <ellipse
     cx="715.0"
     cy="305.0"
     fill="rgb(0, 0, 0)"
     rx="2.0"
     ry="2.0"
     stroke="none"
     stroke-width="2.0"
     id="ellipse236" />
  <ellipse
     cx="735.0"
     cy="285.0"
     fill="rgb(0, 0, 0)"
     rx="2.0"
     ry="2.0"
     stroke="none"
     stroke-width="2.0"
     id="ellipse238" />
  <polyline
     fill="none"
     points="715,411 715,415 715,475 555,475"
     stroke="rgb(0, 0, 0)"
     stroke-linecap="square"
     stroke-width="3.0"
     id="polyline240" />
  <ellipse
     cx="715.0"
     cy="407.0"
     fill="rgb(192, 192, 192)"
     rx="3.0"
     ry="3.0"
     stroke="none"
     stroke-width="1.0"
     id="ellipse242" />
  <polygon
     fill="none"
     points="705,375 735,385 735,405 705,415"
     stroke="rgb(0, 0, 0)"
     stroke-linecap="square"
     stroke-width="2.0"
     id="polygon246" />
  <text
     fill="rgb(0, 0, 0)"
     font-family="SansSerif"
     font-size="12"
     x="707.0"
     y="401.0"
     id="text248">MUX</text>
  <ellipse
     cx="705.0"
     cy="405.0"
     fill="rgb(0, 0, 0)"
     rx="2.0"
     ry="2.0"
     stroke="none"
     stroke-width="2.0"
     id="ellipse252" />
  <ellipse
     cx="715.0"
     cy="415.0"
     fill="rgb(0, 0, 0)"
     rx="2.0"
     ry="2.0"
     stroke="none"
     stroke-width="2.0"
     id="ellipse254" />
  <ellipse
     cx="735.0"
     cy="395.0"
     fill="rgb(0, 0, 0)"
     rx="2.0"
     ry="2.0"
     stroke="none"
     stroke-width="2.0"
     id="ellipse256" />
  <polyline
     fill="none"
     points="65,375 104,375"
     stroke="rgb(0, 0, 0)"
     stroke-linecap="square"
     stroke-width="2.0"
     id="polyline258" />
  <polyline
     fill="none"
     points="105,375 105,434"
     stroke="rgb(0, 0, 0)"
     stroke-linecap="square"
     stroke-width="2.0"
     id="polyline260" />
  <polyline
     fill="none"
     points="105,435 66,435"
     stroke="rgb(0, 0, 0)"
     stroke-linecap="square"
     stroke-width="2.0"
     id="polyline262" />
  <polyline
     fill="none"
     points="65,435 65,376"
     stroke="rgb(0, 0, 0)"
     stroke-linecap="square"
     stroke-width="2.0"
     id="polyline264" />
  <polyline
     fill="none"
     points="125,425 125,365 55,365 55,385 64,385"
     stroke="rgb(0, 0, 0)"
     stroke-linecap="square"
     stroke-width="3.0"
     id="polyline274" />
  <ellipse
     cx="55.0"
     cy="385.0"
     fill="rgb(0, 0, 0)"
     rx="2.0"
     ry="2.0"
     stroke="none"
     stroke-width="3.0"
     id="ellipse276" />
  <text
     fill="rgb(0, 0, 0)"
     font-family="SansSerif"
     font-size="12"
     x="69.0"
     y="389.0"
     id="text278">D</text>
  <polyline
     fill="none"
     points="66,421 73,425 66,429"
     stroke="rgb(0, 0, 0)"
     stroke-linecap="square"
     stroke-width="2.0"
     id="polyline280" />
  <polyline
     fill="none"
     points="55,425 64,425"
     stroke="rgb(0, 0, 0)"
     stroke-linecap="square"
     stroke-width="2.0"
     id="polyline282" />
  <ellipse
     cx="55.0"
     cy="425.0"
     fill="rgb(0, 0, 0)"
     rx="2.0"
     ry="2.0"
     stroke="none"
     stroke-width="2.0"
     id="ellipse284" />
  <polyline
     fill="none"
     points="106,385 115,385 115,315 345,315 359,315"
     stroke="rgb(0, 0, 0)"
     stroke-linecap="square"
     stroke-width="3.0"
     id="polyline286" />
  <text
     fill="rgb(0, 0, 0)"
     font-family="SansSerif"
     font-size="12"
     x="92.0"
     y="389.0"
     id="text288">Q</text>
  <ellipse
     cx="115.0"
     cy="385.0"
     fill="rgb(0, 0, 0)"
     rx="2.0"
     ry="2.0"
     stroke="none"
     stroke-width="3.0"
     id="ellipse290" />
  <ellipse
     cx="110.0"
     cy="425.0"
     fill="none"
     rx="5.0"
     ry="5.0"
     stroke="rgb(0, 0, 0)"
     stroke-width="2.0"
     id="ellipse292" />
  <ellipse
     cx="115.0"
     cy="425.0"
     fill="rgb(0, 0, 0)"
     rx="2.0"
     ry="2.0"
     stroke="none"
     stroke-width="2.0"
     id="ellipse294" />
  <polyline
     fill="none"
     points="155,375 194,375"
     stroke="rgb(0, 0, 0)"
     stroke-linecap="square"
     stroke-width="2.0"
     id="polyline296" />
  <polyline
     fill="none"
     points="195,375 195,434"
     stroke="rgb(0, 0, 0)"
     stroke-linecap="square"
     stroke-width="2.0"
     id="polyline298" />
  <polyline
     fill="none"
     points="195,435 156,435"
     stroke="rgb(0, 0, 0)"
     stroke-linecap="square"
     stroke-width="2.0"
     id="polyline300" />
  <polyline
     fill="none"
     points="155,435 155,376"
     stroke="rgb(0, 0, 0)"
     stroke-linecap="square"
     stroke-width="2.0"
     id="polyline302" />
  <polyline
     fill="none"
     points="225,425 215,425 215,365 145,365 145,385 154,385"
     stroke="rgb(0, 0, 0)"
     stroke-linecap="square"
     stroke-width="3.0"
     id="polyline312" />
  <ellipse
     cx="145.0"
     cy="385.0"
     fill="rgb(0, 0, 0)"
     rx="2.0"
     ry="2.0"
     stroke="none"
     stroke-width="3.0"
     id="ellipse314" />
  <text
     fill="rgb(0, 0, 0)"
     font-family="SansSerif"
     font-size="12"
     x="159.0"
     y="389.0"
     id="text316">D</text>
  <polyline
     fill="none"
     points="156,421 163,425 156,429"
     stroke="rgb(0, 0, 0)"
     stroke-linecap="square"
     stroke-width="2.0"
     id="polyline318" />
  <polyline
     fill="none"
     points="145,425 154,425"
     stroke="rgb(0, 0, 0)"
     stroke-linecap="square"
     stroke-width="2.0"
     id="polyline320" />
  <ellipse
     cx="145.0"
     cy="425.0"
     fill="rgb(0, 0, 0)"
     rx="2.0"
     ry="2.0"
     stroke="none"
     stroke-width="2.0"
     id="ellipse322" />
  <polyline
     fill="none"
     points="196,385 205,385 205,325 345,325 359,325"
     stroke="rgb(0, 0, 0)"
     stroke-linecap="square"
     stroke-width="3.0"
     id="polyline324" />
  <text
     fill="rgb(0, 0, 0)"
     font-family="SansSerif"
     font-size="12"
     x="182.0"
     y="389.0"
     id="text326">Q</text>
  <ellipse
     cx="205.0"
     cy="385.0"
     fill="rgb(0, 0, 0)"
     rx="2.0"
     ry="2.0"
     stroke="none"
     stroke-width="3.0"
     id="ellipse328" />
  <ellipse
     cx="200.0"
     cy="425.0"
     fill="none"
     rx="5.0"
     ry="5.0"
     stroke="rgb(0, 0, 0)"
     stroke-width="2.0"
     id="ellipse330" />
  <ellipse
     cx="205.0"
     cy="425.0"
     fill="rgb(0, 0, 0)"
     rx="2.0"
     ry="2.0"
     stroke="none"
     stroke-width="2.0"
     id="ellipse332" />
  <polyline
     fill="none"
     points="235,375 274,375"
     stroke="rgb(0, 0, 0)"
     stroke-linecap="square"
     stroke-width="2.0"
     id="polyline334" />
  <polyline
     fill="none"
     points="275,375 275,434"
     stroke="rgb(0, 0, 0)"
     stroke-linecap="square"
     stroke-width="2.0"
     id="polyline336" />
  <polyline
     fill="none"
     points="275,435 236,435"
     stroke="rgb(0, 0, 0)"
     stroke-linecap="square"
     stroke-width="2.0"
     id="polyline338" />
  <polyline
     fill="none"
     points="235,435 235,376"
     stroke="rgb(0, 0, 0)"
     stroke-linecap="square"
     stroke-width="2.0"
     id="polyline340" />
  <polyline
     fill="none"
     points="285,425 295,425 295,365 225,365 225,385 234,385"
     stroke="rgb(0, 0, 0)"
     stroke-linecap="square"
     stroke-width="3.0"
     id="polyline350" />
  <ellipse
     cx="225.0"
     cy="385.0"
     fill="rgb(0, 0, 0)"
     rx="2.0"
     ry="2.0"
     stroke="none"
     stroke-width="3.0"
     id="ellipse352" />
  <text
     fill="rgb(0, 0, 0)"
     font-family="SansSerif"
     font-size="12"
     x="239.0"
     y="389.0"
     id="text354">D</text>
  <polyline
     fill="none"
     points="236,421 243,425 236,429"
     stroke="rgb(0, 0, 0)"
     stroke-linecap="square"
     stroke-width="2.0"
     id="polyline356" />
  <polyline
     fill="none"
     points="225,425 234,425"
     stroke="rgb(0, 0, 0)"
     stroke-linecap="square"
     stroke-width="2.0"
     id="polyline358" />
  <ellipse
     cx="225.0"
     cy="425.0"
     fill="rgb(0, 0, 0)"
     rx="2.0"
     ry="2.0"
     stroke="none"
     stroke-width="2.0"
     id="ellipse360" />
  <polyline
     fill="none"
     points="276,385 285,385 285,335 345,335 359,335"
     stroke="rgb(0, 0, 0)"
     stroke-linecap="square"
     stroke-width="3.0"
     id="polyline362" />
  <text
     fill="rgb(0, 0, 0)"
     font-family="SansSerif"
     font-size="12"
     x="262.0"
     y="389.0"
     id="text364">Q</text>
  <ellipse
     cx="285.0"
     cy="385.0"
     fill="rgb(0, 0, 0)"
     rx="2.0"
     ry="2.0"
     stroke="none"
     stroke-width="3.0"
     id="ellipse366" />
  <ellipse
     cx="280.0"
     cy="425.0"
     fill="none"
     rx="5.0"
     ry="5.0"
     stroke="rgb(0, 0, 0)"
     stroke-width="2.0"
     id="ellipse368" />
  <ellipse
     cx="285.0"
     cy="425.0"
     fill="rgb(0, 0, 0)"
     rx="2.0"
     ry="2.0"
     stroke="none"
     stroke-width="2.0"
     id="ellipse370" />
  <polygon
     fill="rgb(178, 178, 178)"
     points="5,415 22,415 25,418 25,435 8,435 5,432"
     stroke="none"
     stroke-linecap="square"
     stroke-width="1.0"
     id="polygon372" />
  <rect
     fill="rgb(255, 255, 255)"
     height="17"
     stroke="none"
     stroke-linecap="square"
     stroke-width="1.0"
     width="17"
     x="5"
     y="415"
     id="rect374" />
  <polyline
     fill="none"
     points="5,415 21,415"
     stroke="rgb(0, 0, 0)"
     stroke-linecap="square"
     stroke-width="1.0"
     id="polyline376" />
  <polyline
     fill="none"
     points="22,415 22,431"
     stroke="rgb(0, 0, 0)"
     stroke-linecap="square"
     stroke-width="1.0"
     id="polyline378" />
  <polyline
     fill="none"
     points="5,432 5,416"
     stroke="rgb(0, 0, 0)"
     stroke-linecap="square"
     stroke-width="1.0"
     id="polyline380" />
  <polyline
     fill="none"
     points="6,432 22,432 25,435"
     stroke="rgb(0, 0, 0)"
     stroke-linecap="square"
     stroke-width="1.0"
     id="polyline382" />
  <polygon
     fill="none"
     points="5,415 22,415 25,418 25,435 8,435 5,432"
     stroke="rgb(0, 0, 0)"
     stroke-linecap="square"
     stroke-width="1.0"
     id="polygon384" />
  <ellipse
     cx="25.0"
     cy="425.0"
     fill="rgb(0, 0, 0)"
     rx="2.0"
     ry="2.0"
     stroke="none"
     stroke-width="1.0"
     id="ellipse386" />
  <rect
     fill="rgb(64, 64, 64)"
     height="38"
     stroke="none"
     stroke-linecap="square"
     stroke-width="1.0"
     width="28"
     x="176"
     y="506"
     id="rect388" />
  <rect
     fill="rgb(255, 255, 255)"
     height="20"
     stroke="none"
     stroke-linecap="square"
     stroke-width="1.0"
     width="6"
     x="182"
     y="521"
     id="rect390" />
  <text
     fill="rgb(255, 255, 255)"
     font-family="SansSerif"
     font-size="12"
     x="180.0"
     y="519.0"
     id="text392">1</text>
  <rect
     fill="rgb(255, 255, 255)"
     height="20"
     stroke="none"
     stroke-linecap="square"
     stroke-width="1.0"
     width="6"
     x="192"
     y="521"
     id="rect394" />
  <text
     fill="rgb(255, 255, 255)"
     font-family="SansSerif"
     font-size="12"
     x="190.0"
     y="519.0"
     id="text396">2</text>
  <rect
     fill="rgb(128, 128, 128)"
     height="9"
     stroke="none"
     stroke-linecap="square"
     stroke-width="1.0"
     width="4"
     x="183"
     y="531"
     id="rect398" />
  <rect
     fill="rgb(128, 128, 128)"
     height="9"
     stroke="none"
     stroke-linecap="square"
     stroke-width="1.0"
     width="4"
     x="193"
     y="531"
     id="rect400" />
  <ellipse
     cx="185.0"
     cy="505.0"
     fill="rgb(0, 0, 0)"
     rx="2.0"
     ry="2.0"
     stroke="none"
     stroke-width="1.0"
     id="ellipse402" />
  <ellipse
     cx="195.0"
     cy="505.0"
     fill="rgb(0, 0, 0)"
     rx="2.0"
     ry="2.0"
     stroke="none"
     stroke-width="1.0"
     id="ellipse404" />
</svg>
