<?xml version="1.0" encoding="UTF-8" standalone="no"?>
<svg xmlns="http://www.w3.org/2000/svg" version="1.1" viewBox="0 0 490 288">
   <ellipse cx="185.0" cy="133.0" fill="rgb(0, 0, 0)" rx="2.0" ry="2.0" stroke="none" stroke-width="1.0"/>
   <ellipse cx="205.0" cy="133.0" fill="rgb(0, 0, 0)" rx="2.0" ry="2.0" stroke="none" stroke-width="1.0"/>
   <ellipse cx="225.0" cy="133.0" fill="rgb(0, 0, 0)" rx="2.0" ry="2.0" stroke="none" stroke-width="1.0"/>
   <ellipse cx="245.0" cy="133.0" fill="rgb(0, 0, 0)" rx="2.0" ry="2.0" stroke="none" stroke-width="1.0"/>
   <ellipse cx="265.0" cy="133.0" fill="rgb(0, 0, 0)" rx="2.0" ry="2.0" stroke="none" stroke-width="1.0"/>
   <ellipse cx="285.0" cy="133.0" fill="rgb(0, 0, 0)" rx="2.0" ry="2.0" stroke="none" stroke-width="1.0"/>
   <ellipse cx="305.0" cy="73.0" fill="rgb(0, 0, 0)" rx="2.0" ry="2.0" stroke="none" stroke-width="1.0"/>
   <ellipse cx="285.0" cy="73.0" fill="rgb(0, 0, 0)" rx="2.0" ry="2.0" stroke="none" stroke-width="1.0"/>
   <ellipse cx="265.0" cy="73.0" fill="rgb(0, 0, 0)" rx="2.0" ry="2.0" stroke="none" stroke-width="1.0"/>
   <ellipse cx="245.0" cy="73.0" fill="rgb(0, 0, 0)" rx="2.0" ry="2.0" stroke="none" stroke-width="1.0"/>
   <ellipse cx="225.0" cy="73.0" fill="rgb(0, 0, 0)" rx="2.0" ry="2.0" stroke="none" stroke-width="1.0"/>
   <ellipse cx="205.0" cy="73.0" fill="rgb(0, 0, 0)" rx="2.0" ry="2.0" stroke="none" stroke-width="1.0"/>
   <polyline fill="none" points="180,73 189,73" stroke="rgb(0, 0, 0)" stroke-linecap="square" stroke-width="1.0"/>
   <polyline fill="none" points="190,73 190,79" stroke="rgb(0, 0, 0)" stroke-linecap="square" stroke-width="1.0"/>
   <polyline fill="none" points="190,80 181,80" stroke="rgb(0, 0, 0)" stroke-linecap="square" stroke-width="1.0"/>
   <polyline fill="none" points="180,80 180,74" stroke="rgb(0, 0, 0)" stroke-linecap="square" stroke-width="1.0"/>
   <polyline fill="none" points="200,73 209,73" stroke="rgb(0, 0, 0)" stroke-linecap="square" stroke-width="1.0"/>
   <polyline fill="none" points="210,73 210,79" stroke="rgb(0, 0, 0)" stroke-linecap="square" stroke-width="1.0"/>
   <polyline fill="none" points="210,80 201,80" stroke="rgb(0, 0, 0)" stroke-linecap="square" stroke-width="1.0"/>
   <polyline fill="none" points="200,80 200,74" stroke="rgb(0, 0, 0)" stroke-linecap="square" stroke-width="1.0"/>
   <polyline fill="none" points="220,73 229,73" stroke="rgb(0, 0, 0)" stroke-linecap="square" stroke-width="1.0"/>
   <polyline fill="none" points="230,73 230,79" stroke="rgb(0, 0, 0)" stroke-linecap="square" stroke-width="1.0"/>
   <polyline fill="none" points="230,80 221,80" stroke="rgb(0, 0, 0)" stroke-linecap="square" stroke-width="1.0"/>
   <polyline fill="none" points="220,80 220,74" stroke="rgb(0, 0, 0)" stroke-linecap="square" stroke-width="1.0"/>
   <polyline fill="none" points="240,73 249,73" stroke="rgb(0, 0, 0)" stroke-linecap="square" stroke-width="1.0"/>
   <polyline fill="none" points="250,73 250,79" stroke="rgb(0, 0, 0)" stroke-linecap="square" stroke-width="1.0"/>
   <polyline fill="none" points="250,80 241,80" stroke="rgb(0, 0, 0)" stroke-linecap="square" stroke-width="1.0"/>
   <polyline fill="none" points="240,80 240,74" stroke="rgb(0, 0, 0)" stroke-linecap="square" stroke-width="1.0"/>
   <polyline fill="none" points="260,73 269,73" stroke="rgb(0, 0, 0)" stroke-linecap="square" stroke-width="1.0"/>
   <polyline fill="none" points="270,73 270,79" stroke="rgb(0, 0, 0)" stroke-linecap="square" stroke-width="1.0"/>
   <polyline fill="none" points="270,80 261,80" stroke="rgb(0, 0, 0)" stroke-linecap="square" stroke-width="1.0"/>
   <polyline fill="none" points="260,80 260,74" stroke="rgb(0, 0, 0)" stroke-linecap="square" stroke-width="1.0"/>
   <polyline fill="none" points="280,73 289,73" stroke="rgb(0, 0, 0)" stroke-linecap="square" stroke-width="1.0"/>
   <polyline fill="none" points="290,73 290,79" stroke="rgb(0, 0, 0)" stroke-linecap="square" stroke-width="1.0"/>
   <polyline fill="none" points="290,80 281,80" stroke="rgb(0, 0, 0)" stroke-linecap="square" stroke-width="1.0"/>
   <polyline fill="none" points="280,80 280,74" stroke="rgb(0, 0, 0)" stroke-linecap="square" stroke-width="1.0"/>
   <polyline fill="none" points="300,73 309,73" stroke="rgb(0, 0, 0)" stroke-linecap="square" stroke-width="1.0"/>
   <polyline fill="none" points="310,73 310,79" stroke="rgb(0, 0, 0)" stroke-linecap="square" stroke-width="1.0"/>
   <polyline fill="none" points="310,80 301,80" stroke="rgb(0, 0, 0)" stroke-linecap="square" stroke-width="1.0"/>
   <polyline fill="none" points="300,80 300,74" stroke="rgb(0, 0, 0)" stroke-linecap="square" stroke-width="1.0"/>
   <polyline fill="none" points="180,126 189,126" stroke="rgb(0, 0, 0)" stroke-linecap="square" stroke-width="1.0"/>
   <polyline fill="none" points="190,126 190,132" stroke="rgb(0, 0, 0)" stroke-linecap="square" stroke-width="1.0"/>
   <polyline fill="none" points="190,133 181,133" stroke="rgb(0, 0, 0)" stroke-linecap="square" stroke-width="1.0"/>
   <polyline fill="none" points="180,133 180,127" stroke="rgb(0, 0, 0)" stroke-linecap="square" stroke-width="1.0"/>
   <polyline fill="none" points="200,126 209,126" stroke="rgb(0, 0, 0)" stroke-linecap="square" stroke-width="1.0"/>
   <polyline fill="none" points="210,126 210,132" stroke="rgb(0, 0, 0)" stroke-linecap="square" stroke-width="1.0"/>
   <polyline fill="none" points="210,133 201,133" stroke="rgb(0, 0, 0)" stroke-linecap="square" stroke-width="1.0"/>
   <polyline fill="none" points="200,133 200,127" stroke="rgb(0, 0, 0)" stroke-linecap="square" stroke-width="1.0"/>
   <polyline fill="none" points="220,126 229,126" stroke="rgb(0, 0, 0)" stroke-linecap="square" stroke-width="1.0"/>
   <polyline fill="none" points="230,126 230,132" stroke="rgb(0, 0, 0)" stroke-linecap="square" stroke-width="1.0"/>
   <polyline fill="none" points="230,133 221,133" stroke="rgb(0, 0, 0)" stroke-linecap="square" stroke-width="1.0"/>
   <polyline fill="none" points="220,133 220,127" stroke="rgb(0, 0, 0)" stroke-linecap="square" stroke-width="1.0"/>
   <polyline fill="none" points="240,126 249,126" stroke="rgb(0, 0, 0)" stroke-linecap="square" stroke-width="1.0"/>
   <polyline fill="none" points="250,126 250,132" stroke="rgb(0, 0, 0)" stroke-linecap="square" stroke-width="1.0"/>
   <polyline fill="none" points="250,133 241,133" stroke="rgb(0, 0, 0)" stroke-linecap="square" stroke-width="1.0"/>
   <polyline fill="none" points="240,133 240,127" stroke="rgb(0, 0, 0)" stroke-linecap="square" stroke-width="1.0"/>
   <polyline fill="none" points="260,126 269,126" stroke="rgb(0, 0, 0)" stroke-linecap="square" stroke-width="1.0"/>
   <polyline fill="none" points="270,126 270,132" stroke="rgb(0, 0, 0)" stroke-linecap="square" stroke-width="1.0"/>
   <polyline fill="none" points="270,133 261,133" stroke="rgb(0, 0, 0)" stroke-linecap="square" stroke-width="1.0"/>
   <polyline fill="none" points="260,133 260,127" stroke="rgb(0, 0, 0)" stroke-linecap="square" stroke-width="1.0"/>
   <polyline fill="none" points="280,126 289,126" stroke="rgb(0, 0, 0)" stroke-linecap="square" stroke-width="1.0"/>
   <polyline fill="none" points="290,126 290,132" stroke="rgb(0, 0, 0)" stroke-linecap="square" stroke-width="1.0"/>
   <polyline fill="none" points="290,133 281,133" stroke="rgb(0, 0, 0)" stroke-linecap="square" stroke-width="1.0"/>
   <polyline fill="none" points="280,133 280,127" stroke="rgb(0, 0, 0)" stroke-linecap="square" stroke-width="1.0"/>
   <polyline fill="none" points="300,126 309,126" stroke="rgb(0, 0, 0)" stroke-linecap="square" stroke-width="1.0"/>
   <polyline fill="none" points="310,126 310,132" stroke="rgb(0, 0, 0)" stroke-linecap="square" stroke-width="1.0"/>
   <polyline fill="none" points="310,133 301,133" stroke="rgb(0, 0, 0)" stroke-linecap="square" stroke-width="1.0"/>
   <polyline fill="none" points="300,133 300,127" stroke="rgb(0, 0, 0)" stroke-linecap="square" stroke-width="1.0"/>
   <rect fill="none" height="46" rx="5.0" ry="5.0" stroke="rgb(0, 0, 0)" stroke-linecap="square" stroke-width="1.0" width="140" x="175" y="80"/>
   <path d="M175.0,110.0 A7.0,7.0 -270.0 0,0 175.0,96.0" fill="none" stroke="rgb(0, 0, 0)" stroke-width="1.0"/>
   <text fill="rgb(0, 0, 0)" font-family="DialogInput" font-size="7" font-weight="bold" x="179.0" y="88.0">Vcc</text>
   <text fill="rgb(0, 0, 0)" font-family="DialogInput" font-size="7" font-weight="bold" x="299.0" y="123.0">GND</text>
   <ellipse cx="193.0" cy="113.0" fill="none" rx="2.0" ry="2.0" stroke="rgb(0, 0, 0)" stroke-width="1.0"/>
   <path d="M209.0,120.0 A17.0,17.0 90.0 0,1 195.2467110956259,112.99234928897204" fill="none" stroke="rgb(0, 0, 0)" stroke-width="1.0"/>
   <path d="M209.0,106.0 A17.0,17.0 -90.0 0,0 195.2467110956259,113.00765071102796" fill="none" stroke="rgb(0, 0, 0)" stroke-width="1.0"/>
   <path d="M209.6349021371745,106.1901425039068 A15.0,15.0 -153.0 0,0 209.6349021371745,119.8098574960932" fill="none" stroke="rgb(0, 0, 0)" stroke-width="1.0"/>
   <polyline fill="none" points="191,113 185,113 185,126" stroke="rgb(0, 0, 0)" stroke-linecap="square" stroke-width="1.0"/>
   <polyline fill="none" points="205,126 205,123 215,123 215,118 209,118" stroke="rgb(0, 0, 0)" stroke-linecap="square" stroke-width="1.0"/>
   <polyline fill="none" points="225,126 225,108 209,108" stroke="rgb(0, 0, 0)" stroke-linecap="square" stroke-width="1.0"/>
   <ellipse cx="253.0" cy="113.0" fill="none" rx="2.0" ry="2.0" stroke="rgb(0, 0, 0)" stroke-width="1.0"/>
   <path d="M269.0,120.0 A17.0,17.0 90.0 0,1 255.24671109562587,112.99234928897204" fill="none" stroke="rgb(0, 0, 0)" stroke-width="1.0"/>
   <path d="M269.0,106.0 A17.0,17.0 -90.0 0,0 255.24671109562587,113.00765071102796" fill="none" stroke="rgb(0, 0, 0)" stroke-width="1.0"/>
   <path d="M269.6349021371745,106.1901425039068 A15.0,15.0 -153.0 0,0 269.6349021371745,119.8098574960932" fill="none" stroke="rgb(0, 0, 0)" stroke-width="1.0"/>
   <polyline fill="none" points="251,113 245,113 245,126" stroke="rgb(0, 0, 0)" stroke-linecap="square" stroke-width="1.0"/>
   <polyline fill="none" points="265,126 265,123 275,123 275,118 269,118" stroke="rgb(0, 0, 0)" stroke-linecap="square" stroke-width="1.0"/>
   <polyline fill="none" points="285,126 285,108 269,108" stroke="rgb(0, 0, 0)" stroke-linecap="square" stroke-width="1.0"/>
   <ellipse cx="213.0" cy="93.0" fill="none" rx="2.0" ry="2.0" stroke="rgb(0, 0, 0)" stroke-width="1.0"/>
   <path d="M229.0,100.0 A17.0,17.0 90.0 0,1 215.24671109562587,92.99234928897204" fill="none" stroke="rgb(0, 0, 0)" stroke-width="1.0"/>
   <path d="M229.0,86.0 A17.0,17.0 -90.0 0,0 215.24671109562587,93.00765071102796" fill="none" stroke="rgb(0, 0, 0)" stroke-width="1.0"/>
   <path d="M229.6349021371745,86.1901425039068 A15.0,15.0 -153.0 0,0 229.6349021371745,99.8098574960932" fill="none" stroke="rgb(0, 0, 0)" stroke-width="1.0"/>
   <polyline fill="none" points="211,93 205,93 205,80" stroke="rgb(0, 0, 0)" stroke-linecap="square" stroke-width="1.0"/>
   <polyline fill="none" points="225,80 225,83 235,83 235,88 229,88" stroke="rgb(0, 0, 0)" stroke-linecap="square" stroke-width="1.0"/>
   <polyline fill="none" points="245,80 245,98 229,98" stroke="rgb(0, 0, 0)" stroke-linecap="square" stroke-width="1.0"/>
   <ellipse cx="273.0" cy="93.0" fill="none" rx="2.0" ry="2.0" stroke="rgb(0, 0, 0)" stroke-width="1.0"/>
   <path d="M289.0,100.0 A17.0,17.0 90.0 0,1 275.24671109562587,92.99234928897204" fill="none" stroke="rgb(0, 0, 0)" stroke-width="1.0"/>
   <path d="M289.0,86.0 A17.0,17.0 -90.0 0,0 275.24671109562587,93.00765071102796" fill="none" stroke="rgb(0, 0, 0)" stroke-width="1.0"/>
   <path d="M289.6349021371745,86.1901425039068 A15.0,15.0 -153.0 0,0 289.6349021371745,99.8098574960932" fill="none" stroke="rgb(0, 0, 0)" stroke-width="1.0"/>
   <polyline fill="none" points="271,93 265,93 265,80" stroke="rgb(0, 0, 0)" stroke-linecap="square" stroke-width="1.0"/>
   <polyline fill="none" points="285,80 285,83 295,83 295,88 289,88" stroke="rgb(0, 0, 0)" stroke-linecap="square" stroke-width="1.0"/>
   <polyline fill="none" points="305,80 305,98 289,98" stroke="rgb(0, 0, 0)" stroke-linecap="square" stroke-width="1.0"/>
   <text fill="rgb(0, 0, 0)" font-family="SansSerif" font-size="16" font-weight="bold" x="213.0" y="25.0">7402</text>
   <text fill="rgb(0, 0, 0)" font-family="SansSerif" font-size="16" font-weight="bold" x="188.0" y="52.0">2-input NOR</text>
   <ellipse cx="15.0" cy="133.0" fill="rgb(0, 0, 0)" rx="2.0" ry="2.0" stroke="none" stroke-width="1.0"/>
   <ellipse cx="35.0" cy="133.0" fill="rgb(0, 0, 0)" rx="2.0" ry="2.0" stroke="none" stroke-width="1.0"/>
   <ellipse cx="55.0" cy="133.0" fill="rgb(0, 0, 0)" rx="2.0" ry="2.0" stroke="none" stroke-width="1.0"/>
   <ellipse cx="75.0" cy="133.0" fill="rgb(0, 0, 0)" rx="2.0" ry="2.0" stroke="none" stroke-width="1.0"/>
   <ellipse cx="95.0" cy="133.0" fill="rgb(0, 0, 0)" rx="2.0" ry="2.0" stroke="none" stroke-width="1.0"/>
   <ellipse cx="115.0" cy="133.0" fill="rgb(0, 0, 0)" rx="2.0" ry="2.0" stroke="none" stroke-width="1.0"/>
   <ellipse cx="135.0" cy="73.0" fill="rgb(0, 0, 0)" rx="2.0" ry="2.0" stroke="none" stroke-width="1.0"/>
   <ellipse cx="115.0" cy="73.0" fill="rgb(0, 0, 0)" rx="2.0" ry="2.0" stroke="none" stroke-width="1.0"/>
   <ellipse cx="95.0" cy="73.0" fill="rgb(0, 0, 0)" rx="2.0" ry="2.0" stroke="none" stroke-width="1.0"/>
   <ellipse cx="75.0" cy="73.0" fill="rgb(0, 0, 0)" rx="2.0" ry="2.0" stroke="none" stroke-width="1.0"/>
   <ellipse cx="55.0" cy="73.0" fill="rgb(0, 0, 0)" rx="2.0" ry="2.0" stroke="none" stroke-width="1.0"/>
   <ellipse cx="35.0" cy="73.0" fill="rgb(0, 0, 0)" rx="2.0" ry="2.0" stroke="none" stroke-width="1.0"/>
   <polyline fill="none" points="10,73 19,73" stroke="rgb(0, 0, 0)" stroke-linecap="square" stroke-width="1.0"/>
   <polyline fill="none" points="20,73 20,79" stroke="rgb(0, 0, 0)" stroke-linecap="square" stroke-width="1.0"/>
   <polyline fill="none" points="20,80 11,80" stroke="rgb(0, 0, 0)" stroke-linecap="square" stroke-width="1.0"/>
   <polyline fill="none" points="10,80 10,74" stroke="rgb(0, 0, 0)" stroke-linecap="square" stroke-width="1.0"/>
   <polyline fill="none" points="30,73 39,73" stroke="rgb(0, 0, 0)" stroke-linecap="square" stroke-width="1.0"/>
   <polyline fill="none" points="40,73 40,79" stroke="rgb(0, 0, 0)" stroke-linecap="square" stroke-width="1.0"/>
   <polyline fill="none" points="40,80 31,80" stroke="rgb(0, 0, 0)" stroke-linecap="square" stroke-width="1.0"/>
   <polyline fill="none" points="30,80 30,74" stroke="rgb(0, 0, 0)" stroke-linecap="square" stroke-width="1.0"/>
   <polyline fill="none" points="50,73 59,73" stroke="rgb(0, 0, 0)" stroke-linecap="square" stroke-width="1.0"/>
   <polyline fill="none" points="60,73 60,79" stroke="rgb(0, 0, 0)" stroke-linecap="square" stroke-width="1.0"/>
   <polyline fill="none" points="60,80 51,80" stroke="rgb(0, 0, 0)" stroke-linecap="square" stroke-width="1.0"/>
   <polyline fill="none" points="50,80 50,74" stroke="rgb(0, 0, 0)" stroke-linecap="square" stroke-width="1.0"/>
   <polyline fill="none" points="70,73 79,73" stroke="rgb(0, 0, 0)" stroke-linecap="square" stroke-width="1.0"/>
   <polyline fill="none" points="80,73 80,79" stroke="rgb(0, 0, 0)" stroke-linecap="square" stroke-width="1.0"/>
   <polyline fill="none" points="80,80 71,80" stroke="rgb(0, 0, 0)" stroke-linecap="square" stroke-width="1.0"/>
   <polyline fill="none" points="70,80 70,74" stroke="rgb(0, 0, 0)" stroke-linecap="square" stroke-width="1.0"/>
   <polyline fill="none" points="90,73 99,73" stroke="rgb(0, 0, 0)" stroke-linecap="square" stroke-width="1.0"/>
   <polyline fill="none" points="100,73 100,79" stroke="rgb(0, 0, 0)" stroke-linecap="square" stroke-width="1.0"/>
   <polyline fill="none" points="100,80 91,80" stroke="rgb(0, 0, 0)" stroke-linecap="square" stroke-width="1.0"/>
   <polyline fill="none" points="90,80 90,74" stroke="rgb(0, 0, 0)" stroke-linecap="square" stroke-width="1.0"/>
   <polyline fill="none" points="110,73 119,73" stroke="rgb(0, 0, 0)" stroke-linecap="square" stroke-width="1.0"/>
   <polyline fill="none" points="120,73 120,79" stroke="rgb(0, 0, 0)" stroke-linecap="square" stroke-width="1.0"/>
   <polyline fill="none" points="120,80 111,80" stroke="rgb(0, 0, 0)" stroke-linecap="square" stroke-width="1.0"/>
   <polyline fill="none" points="110,80 110,74" stroke="rgb(0, 0, 0)" stroke-linecap="square" stroke-width="1.0"/>
   <polyline fill="none" points="130,73 139,73" stroke="rgb(0, 0, 0)" stroke-linecap="square" stroke-width="1.0"/>
   <polyline fill="none" points="140,73 140,79" stroke="rgb(0, 0, 0)" stroke-linecap="square" stroke-width="1.0"/>
   <polyline fill="none" points="140,80 131,80" stroke="rgb(0, 0, 0)" stroke-linecap="square" stroke-width="1.0"/>
   <polyline fill="none" points="130,80 130,74" stroke="rgb(0, 0, 0)" stroke-linecap="square" stroke-width="1.0"/>
   <polyline fill="none" points="10,126 19,126" stroke="rgb(0, 0, 0)" stroke-linecap="square" stroke-width="1.0"/>
   <polyline fill="none" points="20,126 20,132" stroke="rgb(0, 0, 0)" stroke-linecap="square" stroke-width="1.0"/>
   <polyline fill="none" points="20,133 11,133" stroke="rgb(0, 0, 0)" stroke-linecap="square" stroke-width="1.0"/>
   <polyline fill="none" points="10,133 10,127" stroke="rgb(0, 0, 0)" stroke-linecap="square" stroke-width="1.0"/>
   <polyline fill="none" points="30,126 39,126" stroke="rgb(0, 0, 0)" stroke-linecap="square" stroke-width="1.0"/>
   <polyline fill="none" points="40,126 40,132" stroke="rgb(0, 0, 0)" stroke-linecap="square" stroke-width="1.0"/>
   <polyline fill="none" points="40,133 31,133" stroke="rgb(0, 0, 0)" stroke-linecap="square" stroke-width="1.0"/>
   <polyline fill="none" points="30,133 30,127" stroke="rgb(0, 0, 0)" stroke-linecap="square" stroke-width="1.0"/>
   <polyline fill="none" points="50,126 59,126" stroke="rgb(0, 0, 0)" stroke-linecap="square" stroke-width="1.0"/>
   <polyline fill="none" points="60,126 60,132" stroke="rgb(0, 0, 0)" stroke-linecap="square" stroke-width="1.0"/>
   <polyline fill="none" points="60,133 51,133" stroke="rgb(0, 0, 0)" stroke-linecap="square" stroke-width="1.0"/>
   <polyline fill="none" points="50,133 50,127" stroke="rgb(0, 0, 0)" stroke-linecap="square" stroke-width="1.0"/>
   <polyline fill="none" points="70,126 79,126" stroke="rgb(0, 0, 0)" stroke-linecap="square" stroke-width="1.0"/>
   <polyline fill="none" points="80,126 80,132" stroke="rgb(0, 0, 0)" stroke-linecap="square" stroke-width="1.0"/>
   <polyline fill="none" points="80,133 71,133" stroke="rgb(0, 0, 0)" stroke-linecap="square" stroke-width="1.0"/>
   <polyline fill="none" points="70,133 70,127" stroke="rgb(0, 0, 0)" stroke-linecap="square" stroke-width="1.0"/>
   <polyline fill="none" points="90,126 99,126" stroke="rgb(0, 0, 0)" stroke-linecap="square" stroke-width="1.0"/>
   <polyline fill="none" points="100,126 100,132" stroke="rgb(0, 0, 0)" stroke-linecap="square" stroke-width="1.0"/>
   <polyline fill="none" points="100,133 91,133" stroke="rgb(0, 0, 0)" stroke-linecap="square" stroke-width="1.0"/>
   <polyline fill="none" points="90,133 90,127" stroke="rgb(0, 0, 0)" stroke-linecap="square" stroke-width="1.0"/>
   <polyline fill="none" points="110,126 119,126" stroke="rgb(0, 0, 0)" stroke-linecap="square" stroke-width="1.0"/>
   <polyline fill="none" points="120,126 120,132" stroke="rgb(0, 0, 0)" stroke-linecap="square" stroke-width="1.0"/>
   <polyline fill="none" points="120,133 111,133" stroke="rgb(0, 0, 0)" stroke-linecap="square" stroke-width="1.0"/>
   <polyline fill="none" points="110,133 110,127" stroke="rgb(0, 0, 0)" stroke-linecap="square" stroke-width="1.0"/>
   <polyline fill="none" points="130,126 139,126" stroke="rgb(0, 0, 0)" stroke-linecap="square" stroke-width="1.0"/>
   <polyline fill="none" points="140,126 140,132" stroke="rgb(0, 0, 0)" stroke-linecap="square" stroke-width="1.0"/>
   <polyline fill="none" points="140,133 131,133" stroke="rgb(0, 0, 0)" stroke-linecap="square" stroke-width="1.0"/>
   <polyline fill="none" points="130,133 130,127" stroke="rgb(0, 0, 0)" stroke-linecap="square" stroke-width="1.0"/>
   <rect fill="none" height="46" rx="5.0" ry="5.0" stroke="rgb(0, 0, 0)" stroke-linecap="square" stroke-width="1.0" width="140" x="5" y="80"/>
   <path d="M5.0,110.0 A7.0,7.0 -270.0 0,0 5.0,96.0" fill="none" stroke="rgb(0, 0, 0)" stroke-width="1.0"/>
   <text fill="rgb(0, 0, 0)" font-family="DialogInput" font-size="7" font-weight="bold" x="9.0" y="88.0">Vcc</text>
   <text fill="rgb(0, 0, 0)" font-family="DialogInput" font-size="7" font-weight="bold" x="129.0" y="123.0">GND</text>
   <ellipse cx="47.0" cy="113.0" fill="none" rx="2.0" ry="2.0" stroke="rgb(0, 0, 0)" stroke-width="1.0"/>
   <path d="M38.0,120.0 A7.0,7.0 90.0 0,0 38.0,106.0" fill="none" stroke="rgb(0, 0, 0)" stroke-width="1.0"/>
   <polyline fill="none" points="38,106 30,106 30,120 38,120" stroke="rgb(0, 0, 0)" stroke-linecap="square" stroke-width="1.0"/>
   <polyline fill="none" points="49,113 55,113 55,126" stroke="rgb(0, 0, 0)" stroke-linecap="square" stroke-width="1.0"/>
   <polyline fill="none" points="35,126 35,123 25,123 25,118 30,118" stroke="rgb(0, 0, 0)" stroke-linecap="square" stroke-width="1.0"/>
   <polyline fill="none" points="15,126 15,108 30,108" stroke="rgb(0, 0, 0)" stroke-linecap="square" stroke-width="1.0"/>
   <ellipse cx="107.0" cy="113.0" fill="none" rx="2.0" ry="2.0" stroke="rgb(0, 0, 0)" stroke-width="1.0"/>
   <path d="M98.0,120.0 A7.0,7.0 90.0 0,0 98.0,106.0" fill="none" stroke="rgb(0, 0, 0)" stroke-width="1.0"/>
   <polyline fill="none" points="98,106 90,106 90,120 98,120" stroke="rgb(0, 0, 0)" stroke-linecap="square" stroke-width="1.0"/>
   <polyline fill="none" points="109,113 115,113 115,126" stroke="rgb(0, 0, 0)" stroke-linecap="square" stroke-width="1.0"/>
   <polyline fill="none" points="95,126 95,123 85,123 85,118 90,118" stroke="rgb(0, 0, 0)" stroke-linecap="square" stroke-width="1.0"/>
   <polyline fill="none" points="75,126 75,108 90,108" stroke="rgb(0, 0, 0)" stroke-linecap="square" stroke-width="1.0"/>
   <ellipse cx="67.0" cy="93.0" fill="none" rx="2.0" ry="2.0" stroke="rgb(0, 0, 0)" stroke-width="1.0"/>
   <path d="M58.0,100.0 A7.0,7.0 90.0 0,0 58.0,86.0" fill="none" stroke="rgb(0, 0, 0)" stroke-width="1.0"/>
   <polyline fill="none" points="58,86 50,86 50,100 58,100" stroke="rgb(0, 0, 0)" stroke-linecap="square" stroke-width="1.0"/>
   <polyline fill="none" points="69,93 75,93 75,80" stroke="rgb(0, 0, 0)" stroke-linecap="square" stroke-width="1.0"/>
   <polyline fill="none" points="55,80 55,83 45,83 45,88 50,88" stroke="rgb(0, 0, 0)" stroke-linecap="square" stroke-width="1.0"/>
   <polyline fill="none" points="35,80 35,98 50,98" stroke="rgb(0, 0, 0)" stroke-linecap="square" stroke-width="1.0"/>
   <ellipse cx="127.0" cy="93.0" fill="none" rx="2.0" ry="2.0" stroke="rgb(0, 0, 0)" stroke-width="1.0"/>
   <path d="M118.0,100.0 A7.0,7.0 90.0 0,0 118.0,86.0" fill="none" stroke="rgb(0, 0, 0)" stroke-width="1.0"/>
   <polyline fill="none" points="118,86 110,86 110,100 118,100" stroke="rgb(0, 0, 0)" stroke-linecap="square" stroke-width="1.0"/>
   <polyline fill="none" points="129,93 135,93 135,80" stroke="rgb(0, 0, 0)" stroke-linecap="square" stroke-width="1.0"/>
   <polyline fill="none" points="115,80 115,83 105,83 105,88 110,88" stroke="rgb(0, 0, 0)" stroke-linecap="square" stroke-width="1.0"/>
   <polyline fill="none" points="95,80 95,98 110,98" stroke="rgb(0, 0, 0)" stroke-linecap="square" stroke-width="1.0"/>
   <text fill="rgb(0, 0, 0)" font-family="SansSerif" font-size="16" font-weight="bold" x="47.0" y="24.0">7400</text>
   <text fill="rgb(0, 0, 0)" font-family="SansSerif" font-size="16" font-weight="bold" x="16.0" y="54.0">2-input NAND</text>
   <text fill="rgb(0, 0, 0)" font-family="SansSerif" font-size="16" font-weight="bold" x="388.0" y="32.0">7404</text>
   <text fill="rgb(0, 0, 0)" font-family="SansSerif" font-size="16" font-weight="bold" x="393.0" y="55.0">NOT</text>
   <ellipse cx="355.0" cy="133.0" fill="rgb(0, 0, 0)" rx="2.0" ry="2.0" stroke="none" stroke-width="1.0"/>
   <ellipse cx="375.0" cy="133.0" fill="rgb(0, 0, 0)" rx="2.0" ry="2.0" stroke="none" stroke-width="1.0"/>
   <ellipse cx="395.0" cy="133.0" fill="rgb(0, 0, 0)" rx="2.0" ry="2.0" stroke="none" stroke-width="1.0"/>
   <ellipse cx="415.0" cy="133.0" fill="rgb(0, 0, 0)" rx="2.0" ry="2.0" stroke="none" stroke-width="1.0"/>
   <ellipse cx="435.0" cy="133.0" fill="rgb(0, 0, 0)" rx="2.0" ry="2.0" stroke="none" stroke-width="1.0"/>
   <ellipse cx="455.0" cy="133.0" fill="rgb(0, 0, 0)" rx="2.0" ry="2.0" stroke="none" stroke-width="1.0"/>
   <ellipse cx="475.0" cy="73.0" fill="rgb(0, 0, 0)" rx="2.0" ry="2.0" stroke="none" stroke-width="1.0"/>
   <ellipse cx="455.0" cy="73.0" fill="rgb(0, 0, 0)" rx="2.0" ry="2.0" stroke="none" stroke-width="1.0"/>
   <ellipse cx="435.0" cy="73.0" fill="rgb(0, 0, 0)" rx="2.0" ry="2.0" stroke="none" stroke-width="1.0"/>
   <ellipse cx="415.0" cy="73.0" fill="rgb(0, 0, 0)" rx="2.0" ry="2.0" stroke="none" stroke-width="1.0"/>
   <ellipse cx="395.0" cy="73.0" fill="rgb(0, 0, 0)" rx="2.0" ry="2.0" stroke="none" stroke-width="1.0"/>
   <ellipse cx="375.0" cy="73.0" fill="rgb(0, 0, 0)" rx="2.0" ry="2.0" stroke="none" stroke-width="1.0"/>
   <polyline fill="none" points="350,73 359,73" stroke="rgb(0, 0, 0)" stroke-linecap="square" stroke-width="1.0"/>
   <polyline fill="none" points="360,73 360,79" stroke="rgb(0, 0, 0)" stroke-linecap="square" stroke-width="1.0"/>
   <polyline fill="none" points="360,80 351,80" stroke="rgb(0, 0, 0)" stroke-linecap="square" stroke-width="1.0"/>
   <polyline fill="none" points="350,80 350,74" stroke="rgb(0, 0, 0)" stroke-linecap="square" stroke-width="1.0"/>
   <polyline fill="none" points="370,73 379,73" stroke="rgb(0, 0, 0)" stroke-linecap="square" stroke-width="1.0"/>
   <polyline fill="none" points="380,73 380,79" stroke="rgb(0, 0, 0)" stroke-linecap="square" stroke-width="1.0"/>
   <polyline fill="none" points="380,80 371,80" stroke="rgb(0, 0, 0)" stroke-linecap="square" stroke-width="1.0"/>
   <polyline fill="none" points="370,80 370,74" stroke="rgb(0, 0, 0)" stroke-linecap="square" stroke-width="1.0"/>
   <polyline fill="none" points="390,73 399,73" stroke="rgb(0, 0, 0)" stroke-linecap="square" stroke-width="1.0"/>
   <polyline fill="none" points="400,73 400,79" stroke="rgb(0, 0, 0)" stroke-linecap="square" stroke-width="1.0"/>
   <polyline fill="none" points="400,80 391,80" stroke="rgb(0, 0, 0)" stroke-linecap="square" stroke-width="1.0"/>
   <polyline fill="none" points="390,80 390,74" stroke="rgb(0, 0, 0)" stroke-linecap="square" stroke-width="1.0"/>
   <polyline fill="none" points="410,73 419,73" stroke="rgb(0, 0, 0)" stroke-linecap="square" stroke-width="1.0"/>
   <polyline fill="none" points="420,73 420,79" stroke="rgb(0, 0, 0)" stroke-linecap="square" stroke-width="1.0"/>
   <polyline fill="none" points="420,80 411,80" stroke="rgb(0, 0, 0)" stroke-linecap="square" stroke-width="1.0"/>
   <polyline fill="none" points="410,80 410,74" stroke="rgb(0, 0, 0)" stroke-linecap="square" stroke-width="1.0"/>
   <polyline fill="none" points="430,73 439,73" stroke="rgb(0, 0, 0)" stroke-linecap="square" stroke-width="1.0"/>
   <polyline fill="none" points="440,73 440,79" stroke="rgb(0, 0, 0)" stroke-linecap="square" stroke-width="1.0"/>
   <polyline fill="none" points="440,80 431,80" stroke="rgb(0, 0, 0)" stroke-linecap="square" stroke-width="1.0"/>
   <polyline fill="none" points="430,80 430,74" stroke="rgb(0, 0, 0)" stroke-linecap="square" stroke-width="1.0"/>
   <polyline fill="none" points="450,73 459,73" stroke="rgb(0, 0, 0)" stroke-linecap="square" stroke-width="1.0"/>
   <polyline fill="none" points="460,73 460,79" stroke="rgb(0, 0, 0)" stroke-linecap="square" stroke-width="1.0"/>
   <polyline fill="none" points="460,80 451,80" stroke="rgb(0, 0, 0)" stroke-linecap="square" stroke-width="1.0"/>
   <polyline fill="none" points="450,80 450,74" stroke="rgb(0, 0, 0)" stroke-linecap="square" stroke-width="1.0"/>
   <polyline fill="none" points="470,73 479,73" stroke="rgb(0, 0, 0)" stroke-linecap="square" stroke-width="1.0"/>
   <polyline fill="none" points="480,73 480,79" stroke="rgb(0, 0, 0)" stroke-linecap="square" stroke-width="1.0"/>
   <polyline fill="none" points="480,80 471,80" stroke="rgb(0, 0, 0)" stroke-linecap="square" stroke-width="1.0"/>
   <polyline fill="none" points="470,80 470,74" stroke="rgb(0, 0, 0)" stroke-linecap="square" stroke-width="1.0"/>
   <polyline fill="none" points="350,126 359,126" stroke="rgb(0, 0, 0)" stroke-linecap="square" stroke-width="1.0"/>
   <polyline fill="none" points="360,126 360,132" stroke="rgb(0, 0, 0)" stroke-linecap="square" stroke-width="1.0"/>
   <polyline fill="none" points="360,133 351,133" stroke="rgb(0, 0, 0)" stroke-linecap="square" stroke-width="1.0"/>
   <polyline fill="none" points="350,133 350,127" stroke="rgb(0, 0, 0)" stroke-linecap="square" stroke-width="1.0"/>
   <polyline fill="none" points="370,126 379,126" stroke="rgb(0, 0, 0)" stroke-linecap="square" stroke-width="1.0"/>
   <polyline fill="none" points="380,126 380,132" stroke="rgb(0, 0, 0)" stroke-linecap="square" stroke-width="1.0"/>
   <polyline fill="none" points="380,133 371,133" stroke="rgb(0, 0, 0)" stroke-linecap="square" stroke-width="1.0"/>
   <polyline fill="none" points="370,133 370,127" stroke="rgb(0, 0, 0)" stroke-linecap="square" stroke-width="1.0"/>
   <polyline fill="none" points="390,126 399,126" stroke="rgb(0, 0, 0)" stroke-linecap="square" stroke-width="1.0"/>
   <polyline fill="none" points="400,126 400,132" stroke="rgb(0, 0, 0)" stroke-linecap="square" stroke-width="1.0"/>
   <polyline fill="none" points="400,133 391,133" stroke="rgb(0, 0, 0)" stroke-linecap="square" stroke-width="1.0"/>
   <polyline fill="none" points="390,133 390,127" stroke="rgb(0, 0, 0)" stroke-linecap="square" stroke-width="1.0"/>
   <polyline fill="none" points="410,126 419,126" stroke="rgb(0, 0, 0)" stroke-linecap="square" stroke-width="1.0"/>
   <polyline fill="none" points="420,126 420,132" stroke="rgb(0, 0, 0)" stroke-linecap="square" stroke-width="1.0"/>
   <polyline fill="none" points="420,133 411,133" stroke="rgb(0, 0, 0)" stroke-linecap="square" stroke-width="1.0"/>
   <polyline fill="none" points="410,133 410,127" stroke="rgb(0, 0, 0)" stroke-linecap="square" stroke-width="1.0"/>
   <polyline fill="none" points="430,126 439,126" stroke="rgb(0, 0, 0)" stroke-linecap="square" stroke-width="1.0"/>
   <polyline fill="none" points="440,126 440,132" stroke="rgb(0, 0, 0)" stroke-linecap="square" stroke-width="1.0"/>
   <polyline fill="none" points="440,133 431,133" stroke="rgb(0, 0, 0)" stroke-linecap="square" stroke-width="1.0"/>
   <polyline fill="none" points="430,133 430,127" stroke="rgb(0, 0, 0)" stroke-linecap="square" stroke-width="1.0"/>
   <polyline fill="none" points="450,126 459,126" stroke="rgb(0, 0, 0)" stroke-linecap="square" stroke-width="1.0"/>
   <polyline fill="none" points="460,126 460,132" stroke="rgb(0, 0, 0)" stroke-linecap="square" stroke-width="1.0"/>
   <polyline fill="none" points="460,133 451,133" stroke="rgb(0, 0, 0)" stroke-linecap="square" stroke-width="1.0"/>
   <polyline fill="none" points="450,133 450,127" stroke="rgb(0, 0, 0)" stroke-linecap="square" stroke-width="1.0"/>
   <polyline fill="none" points="470,126 479,126" stroke="rgb(0, 0, 0)" stroke-linecap="square" stroke-width="1.0"/>
   <polyline fill="none" points="480,126 480,132" stroke="rgb(0, 0, 0)" stroke-linecap="square" stroke-width="1.0"/>
   <polyline fill="none" points="480,133 471,133" stroke="rgb(0, 0, 0)" stroke-linecap="square" stroke-width="1.0"/>
   <polyline fill="none" points="470,133 470,127" stroke="rgb(0, 0, 0)" stroke-linecap="square" stroke-width="1.0"/>
   <rect fill="none" height="46" rx="5.0" ry="5.0" stroke="rgb(0, 0, 0)" stroke-linecap="square" stroke-width="1.0" width="140" x="345" y="80"/>
   <path d="M345.0,110.0 A7.0,7.0 -270.0 0,0 345.0,96.0" fill="none" stroke="rgb(0, 0, 0)" stroke-width="1.0"/>
   <text fill="rgb(0, 0, 0)" font-family="DialogInput" font-size="7" font-weight="bold" x="349.0" y="88.0">Vcc</text>
   <text fill="rgb(0, 0, 0)" font-family="DialogInput" font-size="7" font-weight="bold" x="469.0" y="123.0">GND</text>
   <ellipse cx="369.0" cy="113.0" fill="none" rx="2.0" ry="2.0" stroke="rgb(0, 0, 0)" stroke-width="1.0"/>
   <polygon fill="none" points="367,113 359,110 359,116" stroke="rgb(0, 0, 0)" stroke-linecap="square" stroke-width="1.0"/>
   <polyline fill="none" points="371,113 375,113 375,126" stroke="rgb(0, 0, 0)" stroke-linecap="square" stroke-width="1.0"/>
   <polyline fill="none" points="355,126 355,113 359,113" stroke="rgb(0, 0, 0)" stroke-linecap="square" stroke-width="1.0"/>
   <ellipse cx="409.0" cy="113.0" fill="none" rx="2.0" ry="2.0" stroke="rgb(0, 0, 0)" stroke-width="1.0"/>
   <polygon fill="none" points="407,113 399,110 399,116" stroke="rgb(0, 0, 0)" stroke-linecap="square" stroke-width="1.0"/>
   <polyline fill="none" points="411,113 415,113 415,126" stroke="rgb(0, 0, 0)" stroke-linecap="square" stroke-width="1.0"/>
   <polyline fill="none" points="395,126 395,113 399,113" stroke="rgb(0, 0, 0)" stroke-linecap="square" stroke-width="1.0"/>
   <ellipse cx="449.0" cy="113.0" fill="none" rx="2.0" ry="2.0" stroke="rgb(0, 0, 0)" stroke-width="1.0"/>
   <polygon fill="none" points="447,113 439,110 439,116" stroke="rgb(0, 0, 0)" stroke-linecap="square" stroke-width="1.0"/>
   <polyline fill="none" points="451,113 455,113 455,126" stroke="rgb(0, 0, 0)" stroke-linecap="square" stroke-width="1.0"/>
   <polyline fill="none" points="435,126 435,113 439,113" stroke="rgb(0, 0, 0)" stroke-linecap="square" stroke-width="1.0"/>
   <ellipse cx="389.0" cy="93.0" fill="none" rx="2.0" ry="2.0" stroke="rgb(0, 0, 0)" stroke-width="1.0"/>
   <polygon fill="none" points="387,93 379,90 379,96" stroke="rgb(0, 0, 0)" stroke-linecap="square" stroke-width="1.0"/>
   <polyline fill="none" points="391,93 395,93 395,80" stroke="rgb(0, 0, 0)" stroke-linecap="square" stroke-width="1.0"/>
   <polyline fill="none" points="375,80 375,93 379,93" stroke="rgb(0, 0, 0)" stroke-linecap="square" stroke-width="1.0"/>
   <ellipse cx="429.0" cy="93.0" fill="none" rx="2.0" ry="2.0" stroke="rgb(0, 0, 0)" stroke-width="1.0"/>
   <polygon fill="none" points="427,93 419,90 419,96" stroke="rgb(0, 0, 0)" stroke-linecap="square" stroke-width="1.0"/>
   <polyline fill="none" points="431,93 435,93 435,80" stroke="rgb(0, 0, 0)" stroke-linecap="square" stroke-width="1.0"/>
   <polyline fill="none" points="415,80 415,93 419,93" stroke="rgb(0, 0, 0)" stroke-linecap="square" stroke-width="1.0"/>
   <ellipse cx="469.0" cy="93.0" fill="none" rx="2.0" ry="2.0" stroke="rgb(0, 0, 0)" stroke-width="1.0"/>
   <polygon fill="none" points="467,93 459,90 459,96" stroke="rgb(0, 0, 0)" stroke-linecap="square" stroke-width="1.0"/>
   <polyline fill="none" points="471,93 475,93 475,80" stroke="rgb(0, 0, 0)" stroke-linecap="square" stroke-width="1.0"/>
   <polyline fill="none" points="455,80 455,93 459,93" stroke="rgb(0, 0, 0)" stroke-linecap="square" stroke-width="1.0"/>
   <text fill="rgb(0, 0, 0)" font-family="SansSerif" font-size="16" font-weight="bold" x="50.0" y="174.0">7408</text>
   <text fill="rgb(0, 0, 0)" font-family="SansSerif" font-size="16" font-weight="bold" x="26.0" y="201.0">2-input AND</text>
   <ellipse cx="15.0" cy="283.0" fill="rgb(0, 0, 0)" rx="2.0" ry="2.0" stroke="none" stroke-width="1.0"/>
   <ellipse cx="35.0" cy="283.0" fill="rgb(0, 0, 0)" rx="2.0" ry="2.0" stroke="none" stroke-width="1.0"/>
   <ellipse cx="55.0" cy="283.0" fill="rgb(0, 0, 0)" rx="2.0" ry="2.0" stroke="none" stroke-width="1.0"/>
   <ellipse cx="75.0" cy="283.0" fill="rgb(0, 0, 0)" rx="2.0" ry="2.0" stroke="none" stroke-width="1.0"/>
   <ellipse cx="95.0" cy="283.0" fill="rgb(0, 0, 0)" rx="2.0" ry="2.0" stroke="none" stroke-width="1.0"/>
   <ellipse cx="115.0" cy="283.0" fill="rgb(0, 0, 0)" rx="2.0" ry="2.0" stroke="none" stroke-width="1.0"/>
   <ellipse cx="135.0" cy="223.0" fill="rgb(0, 0, 0)" rx="2.0" ry="2.0" stroke="none" stroke-width="1.0"/>
   <ellipse cx="115.0" cy="223.0" fill="rgb(0, 0, 0)" rx="2.0" ry="2.0" stroke="none" stroke-width="1.0"/>
   <ellipse cx="95.0" cy="223.0" fill="rgb(0, 0, 0)" rx="2.0" ry="2.0" stroke="none" stroke-width="1.0"/>
   <ellipse cx="75.0" cy="223.0" fill="rgb(0, 0, 0)" rx="2.0" ry="2.0" stroke="none" stroke-width="1.0"/>
   <ellipse cx="55.0" cy="223.0" fill="rgb(0, 0, 0)" rx="2.0" ry="2.0" stroke="none" stroke-width="1.0"/>
   <ellipse cx="35.0" cy="223.0" fill="rgb(0, 0, 0)" rx="2.0" ry="2.0" stroke="none" stroke-width="1.0"/>
   <polyline fill="none" points="10,223 19,223" stroke="rgb(0, 0, 0)" stroke-linecap="square" stroke-width="1.0"/>
   <polyline fill="none" points="20,223 20,229" stroke="rgb(0, 0, 0)" stroke-linecap="square" stroke-width="1.0"/>
   <polyline fill="none" points="20,230 11,230" stroke="rgb(0, 0, 0)" stroke-linecap="square" stroke-width="1.0"/>
   <polyline fill="none" points="10,230 10,224" stroke="rgb(0, 0, 0)" stroke-linecap="square" stroke-width="1.0"/>
   <polyline fill="none" points="30,223 39,223" stroke="rgb(0, 0, 0)" stroke-linecap="square" stroke-width="1.0"/>
   <polyline fill="none" points="40,223 40,229" stroke="rgb(0, 0, 0)" stroke-linecap="square" stroke-width="1.0"/>
   <polyline fill="none" points="40,230 31,230" stroke="rgb(0, 0, 0)" stroke-linecap="square" stroke-width="1.0"/>
   <polyline fill="none" points="30,230 30,224" stroke="rgb(0, 0, 0)" stroke-linecap="square" stroke-width="1.0"/>
   <polyline fill="none" points="50,223 59,223" stroke="rgb(0, 0, 0)" stroke-linecap="square" stroke-width="1.0"/>
   <polyline fill="none" points="60,223 60,229" stroke="rgb(0, 0, 0)" stroke-linecap="square" stroke-width="1.0"/>
   <polyline fill="none" points="60,230 51,230" stroke="rgb(0, 0, 0)" stroke-linecap="square" stroke-width="1.0"/>
   <polyline fill="none" points="50,230 50,224" stroke="rgb(0, 0, 0)" stroke-linecap="square" stroke-width="1.0"/>
   <polyline fill="none" points="70,223 79,223" stroke="rgb(0, 0, 0)" stroke-linecap="square" stroke-width="1.0"/>
   <polyline fill="none" points="80,223 80,229" stroke="rgb(0, 0, 0)" stroke-linecap="square" stroke-width="1.0"/>
   <polyline fill="none" points="80,230 71,230" stroke="rgb(0, 0, 0)" stroke-linecap="square" stroke-width="1.0"/>
   <polyline fill="none" points="70,230 70,224" stroke="rgb(0, 0, 0)" stroke-linecap="square" stroke-width="1.0"/>
   <polyline fill="none" points="90,223 99,223" stroke="rgb(0, 0, 0)" stroke-linecap="square" stroke-width="1.0"/>
   <polyline fill="none" points="100,223 100,229" stroke="rgb(0, 0, 0)" stroke-linecap="square" stroke-width="1.0"/>
   <polyline fill="none" points="100,230 91,230" stroke="rgb(0, 0, 0)" stroke-linecap="square" stroke-width="1.0"/>
   <polyline fill="none" points="90,230 90,224" stroke="rgb(0, 0, 0)" stroke-linecap="square" stroke-width="1.0"/>
   <polyline fill="none" points="110,223 119,223" stroke="rgb(0, 0, 0)" stroke-linecap="square" stroke-width="1.0"/>
   <polyline fill="none" points="120,223 120,229" stroke="rgb(0, 0, 0)" stroke-linecap="square" stroke-width="1.0"/>
   <polyline fill="none" points="120,230 111,230" stroke="rgb(0, 0, 0)" stroke-linecap="square" stroke-width="1.0"/>
   <polyline fill="none" points="110,230 110,224" stroke="rgb(0, 0, 0)" stroke-linecap="square" stroke-width="1.0"/>
   <polyline fill="none" points="130,223 139,223" stroke="rgb(0, 0, 0)" stroke-linecap="square" stroke-width="1.0"/>
   <polyline fill="none" points="140,223 140,229" stroke="rgb(0, 0, 0)" stroke-linecap="square" stroke-width="1.0"/>
   <polyline fill="none" points="140,230 131,230" stroke="rgb(0, 0, 0)" stroke-linecap="square" stroke-width="1.0"/>
   <polyline fill="none" points="130,230 130,224" stroke="rgb(0, 0, 0)" stroke-linecap="square" stroke-width="1.0"/>
   <polyline fill="none" points="10,276 19,276" stroke="rgb(0, 0, 0)" stroke-linecap="square" stroke-width="1.0"/>
   <polyline fill="none" points="20,276 20,282" stroke="rgb(0, 0, 0)" stroke-linecap="square" stroke-width="1.0"/>
   <polyline fill="none" points="20,283 11,283" stroke="rgb(0, 0, 0)" stroke-linecap="square" stroke-width="1.0"/>
   <polyline fill="none" points="10,283 10,277" stroke="rgb(0, 0, 0)" stroke-linecap="square" stroke-width="1.0"/>
   <polyline fill="none" points="30,276 39,276" stroke="rgb(0, 0, 0)" stroke-linecap="square" stroke-width="1.0"/>
   <polyline fill="none" points="40,276 40,282" stroke="rgb(0, 0, 0)" stroke-linecap="square" stroke-width="1.0"/>
   <polyline fill="none" points="40,283 31,283" stroke="rgb(0, 0, 0)" stroke-linecap="square" stroke-width="1.0"/>
   <polyline fill="none" points="30,283 30,277" stroke="rgb(0, 0, 0)" stroke-linecap="square" stroke-width="1.0"/>
   <polyline fill="none" points="50,276 59,276" stroke="rgb(0, 0, 0)" stroke-linecap="square" stroke-width="1.0"/>
   <polyline fill="none" points="60,276 60,282" stroke="rgb(0, 0, 0)" stroke-linecap="square" stroke-width="1.0"/>
   <polyline fill="none" points="60,283 51,283" stroke="rgb(0, 0, 0)" stroke-linecap="square" stroke-width="1.0"/>
   <polyline fill="none" points="50,283 50,277" stroke="rgb(0, 0, 0)" stroke-linecap="square" stroke-width="1.0"/>
   <polyline fill="none" points="70,276 79,276" stroke="rgb(0, 0, 0)" stroke-linecap="square" stroke-width="1.0"/>
   <polyline fill="none" points="80,276 80,282" stroke="rgb(0, 0, 0)" stroke-linecap="square" stroke-width="1.0"/>
   <polyline fill="none" points="80,283 71,283" stroke="rgb(0, 0, 0)" stroke-linecap="square" stroke-width="1.0"/>
   <polyline fill="none" points="70,283 70,277" stroke="rgb(0, 0, 0)" stroke-linecap="square" stroke-width="1.0"/>
   <polyline fill="none" points="90,276 99,276" stroke="rgb(0, 0, 0)" stroke-linecap="square" stroke-width="1.0"/>
   <polyline fill="none" points="100,276 100,282" stroke="rgb(0, 0, 0)" stroke-linecap="square" stroke-width="1.0"/>
   <polyline fill="none" points="100,283 91,283" stroke="rgb(0, 0, 0)" stroke-linecap="square" stroke-width="1.0"/>
   <polyline fill="none" points="90,283 90,277" stroke="rgb(0, 0, 0)" stroke-linecap="square" stroke-width="1.0"/>
   <polyline fill="none" points="110,276 119,276" stroke="rgb(0, 0, 0)" stroke-linecap="square" stroke-width="1.0"/>
   <polyline fill="none" points="120,276 120,282" stroke="rgb(0, 0, 0)" stroke-linecap="square" stroke-width="1.0"/>
   <polyline fill="none" points="120,283 111,283" stroke="rgb(0, 0, 0)" stroke-linecap="square" stroke-width="1.0"/>
   <polyline fill="none" points="110,283 110,277" stroke="rgb(0, 0, 0)" stroke-linecap="square" stroke-width="1.0"/>
   <polyline fill="none" points="130,276 139,276" stroke="rgb(0, 0, 0)" stroke-linecap="square" stroke-width="1.0"/>
   <polyline fill="none" points="140,276 140,282" stroke="rgb(0, 0, 0)" stroke-linecap="square" stroke-width="1.0"/>
   <polyline fill="none" points="140,283 131,283" stroke="rgb(0, 0, 0)" stroke-linecap="square" stroke-width="1.0"/>
   <polyline fill="none" points="130,283 130,277" stroke="rgb(0, 0, 0)" stroke-linecap="square" stroke-width="1.0"/>
   <rect fill="none" height="46" rx="5.0" ry="5.0" stroke="rgb(0, 0, 0)" stroke-linecap="square" stroke-width="1.0" width="140" x="5" y="230"/>
   <path d="M5.0,260.0 A7.0,7.0 -270.0 0,0 5.0,246.0" fill="none" stroke="rgb(0, 0, 0)" stroke-width="1.0"/>
   <text fill="rgb(0, 0, 0)" font-family="DialogInput" font-size="7" font-weight="bold" x="9.0" y="238.0">Vcc</text>
   <text fill="rgb(0, 0, 0)" font-family="DialogInput" font-size="7" font-weight="bold" x="129.0" y="273.0">GND</text>
   <path d="M42.0,270.0 A7.0,7.0 90.0 0,0 42.0,256.0" fill="none" stroke="rgb(0, 0, 0)" stroke-width="1.0"/>
   <polyline fill="none" points="42,256 34,256 34,270 42,270" stroke="rgb(0, 0, 0)" stroke-linecap="square" stroke-width="1.0"/>
   <polyline fill="none" points="49,263 55,263 55,276" stroke="rgb(0, 0, 0)" stroke-linecap="square" stroke-width="1.0"/>
   <polyline fill="none" points="35,276 35,273 25,273 25,268 34,268" stroke="rgb(0, 0, 0)" stroke-linecap="square" stroke-width="1.0"/>
   <polyline fill="none" points="15,276 15,258 34,258" stroke="rgb(0, 0, 0)" stroke-linecap="square" stroke-width="1.0"/>
   <path d="M102.0,270.0 A7.0,7.0 90.0 0,0 102.0,256.0" fill="none" stroke="rgb(0, 0, 0)" stroke-width="1.0"/>
   <polyline fill="none" points="102,256 94,256 94,270 102,270" stroke="rgb(0, 0, 0)" stroke-linecap="square" stroke-width="1.0"/>
   <polyline fill="none" points="109,263 115,263 115,276" stroke="rgb(0, 0, 0)" stroke-linecap="square" stroke-width="1.0"/>
   <polyline fill="none" points="95,276 95,273 85,273 85,268 94,268" stroke="rgb(0, 0, 0)" stroke-linecap="square" stroke-width="1.0"/>
   <polyline fill="none" points="75,276 75,258 94,258" stroke="rgb(0, 0, 0)" stroke-linecap="square" stroke-width="1.0"/>
   <path d="M62.0,250.0 A7.0,7.0 90.0 0,0 62.0,236.0" fill="none" stroke="rgb(0, 0, 0)" stroke-width="1.0"/>
   <polyline fill="none" points="62,236 54,236 54,250 62,250" stroke="rgb(0, 0, 0)" stroke-linecap="square" stroke-width="1.0"/>
   <polyline fill="none" points="69,243 75,243 75,230" stroke="rgb(0, 0, 0)" stroke-linecap="square" stroke-width="1.0"/>
   <polyline fill="none" points="55,230 55,233 45,233 45,238 54,238" stroke="rgb(0, 0, 0)" stroke-linecap="square" stroke-width="1.0"/>
   <polyline fill="none" points="35,230 35,248 54,248" stroke="rgb(0, 0, 0)" stroke-linecap="square" stroke-width="1.0"/>
   <path d="M122.0,250.0 A7.0,7.0 90.0 0,0 122.0,236.0" fill="none" stroke="rgb(0, 0, 0)" stroke-width="1.0"/>
   <polyline fill="none" points="122,236 114,236 114,250 122,250" stroke="rgb(0, 0, 0)" stroke-linecap="square" stroke-width="1.0"/>
   <polyline fill="none" points="129,243 135,243 135,230" stroke="rgb(0, 0, 0)" stroke-linecap="square" stroke-width="1.0"/>
   <polyline fill="none" points="115,230 115,233 105,233 105,238 114,238" stroke="rgb(0, 0, 0)" stroke-linecap="square" stroke-width="1.0"/>
   <polyline fill="none" points="95,230 95,248 114,248" stroke="rgb(0, 0, 0)" stroke-linecap="square" stroke-width="1.0"/>
   <text fill="rgb(0, 0, 0)" font-family="SansSerif" font-size="16" font-weight="bold" x="390.0" y="187.0">7486</text>
   <ellipse cx="355.0" cy="283.0" fill="rgb(0, 0, 0)" rx="2.0" ry="2.0" stroke="none" stroke-width="1.0"/>
   <ellipse cx="375.0" cy="283.0" fill="rgb(0, 0, 0)" rx="2.0" ry="2.0" stroke="none" stroke-width="1.0"/>
   <ellipse cx="395.0" cy="283.0" fill="rgb(0, 0, 0)" rx="2.0" ry="2.0" stroke="none" stroke-width="1.0"/>
   <ellipse cx="415.0" cy="283.0" fill="rgb(0, 0, 0)" rx="2.0" ry="2.0" stroke="none" stroke-width="1.0"/>
   <ellipse cx="435.0" cy="283.0" fill="rgb(0, 0, 0)" rx="2.0" ry="2.0" stroke="none" stroke-width="1.0"/>
   <ellipse cx="455.0" cy="283.0" fill="rgb(0, 0, 0)" rx="2.0" ry="2.0" stroke="none" stroke-width="1.0"/>
   <ellipse cx="475.0" cy="223.0" fill="rgb(0, 0, 0)" rx="2.0" ry="2.0" stroke="none" stroke-width="1.0"/>
   <ellipse cx="455.0" cy="223.0" fill="rgb(0, 0, 0)" rx="2.0" ry="2.0" stroke="none" stroke-width="1.0"/>
   <ellipse cx="435.0" cy="223.0" fill="rgb(0, 0, 0)" rx="2.0" ry="2.0" stroke="none" stroke-width="1.0"/>
   <ellipse cx="415.0" cy="223.0" fill="rgb(0, 0, 0)" rx="2.0" ry="2.0" stroke="none" stroke-width="1.0"/>
   <ellipse cx="395.0" cy="223.0" fill="rgb(0, 0, 0)" rx="2.0" ry="2.0" stroke="none" stroke-width="1.0"/>
   <ellipse cx="375.0" cy="223.0" fill="rgb(0, 0, 0)" rx="2.0" ry="2.0" stroke="none" stroke-width="1.0"/>
   <polyline fill="none" points="350,223 359,223" stroke="rgb(0, 0, 0)" stroke-linecap="square" stroke-width="1.0"/>
   <polyline fill="none" points="360,223 360,229" stroke="rgb(0, 0, 0)" stroke-linecap="square" stroke-width="1.0"/>
   <polyline fill="none" points="360,230 351,230" stroke="rgb(0, 0, 0)" stroke-linecap="square" stroke-width="1.0"/>
   <polyline fill="none" points="350,230 350,224" stroke="rgb(0, 0, 0)" stroke-linecap="square" stroke-width="1.0"/>
   <polyline fill="none" points="370,223 379,223" stroke="rgb(0, 0, 0)" stroke-linecap="square" stroke-width="1.0"/>
   <polyline fill="none" points="380,223 380,229" stroke="rgb(0, 0, 0)" stroke-linecap="square" stroke-width="1.0"/>
   <polyline fill="none" points="380,230 371,230" stroke="rgb(0, 0, 0)" stroke-linecap="square" stroke-width="1.0"/>
   <polyline fill="none" points="370,230 370,224" stroke="rgb(0, 0, 0)" stroke-linecap="square" stroke-width="1.0"/>
   <polyline fill="none" points="390,223 399,223" stroke="rgb(0, 0, 0)" stroke-linecap="square" stroke-width="1.0"/>
   <polyline fill="none" points="400,223 400,229" stroke="rgb(0, 0, 0)" stroke-linecap="square" stroke-width="1.0"/>
   <polyline fill="none" points="400,230 391,230" stroke="rgb(0, 0, 0)" stroke-linecap="square" stroke-width="1.0"/>
   <polyline fill="none" points="390,230 390,224" stroke="rgb(0, 0, 0)" stroke-linecap="square" stroke-width="1.0"/>
   <polyline fill="none" points="410,223 419,223" stroke="rgb(0, 0, 0)" stroke-linecap="square" stroke-width="1.0"/>
   <polyline fill="none" points="420,223 420,229" stroke="rgb(0, 0, 0)" stroke-linecap="square" stroke-width="1.0"/>
   <polyline fill="none" points="420,230 411,230" stroke="rgb(0, 0, 0)" stroke-linecap="square" stroke-width="1.0"/>
   <polyline fill="none" points="410,230 410,224" stroke="rgb(0, 0, 0)" stroke-linecap="square" stroke-width="1.0"/>
   <polyline fill="none" points="430,223 439,223" stroke="rgb(0, 0, 0)" stroke-linecap="square" stroke-width="1.0"/>
   <polyline fill="none" points="440,223 440,229" stroke="rgb(0, 0, 0)" stroke-linecap="square" stroke-width="1.0"/>
   <polyline fill="none" points="440,230 431,230" stroke="rgb(0, 0, 0)" stroke-linecap="square" stroke-width="1.0"/>
   <polyline fill="none" points="430,230 430,224" stroke="rgb(0, 0, 0)" stroke-linecap="square" stroke-width="1.0"/>
   <polyline fill="none" points="450,223 459,223" stroke="rgb(0, 0, 0)" stroke-linecap="square" stroke-width="1.0"/>
   <polyline fill="none" points="460,223 460,229" stroke="rgb(0, 0, 0)" stroke-linecap="square" stroke-width="1.0"/>
   <polyline fill="none" points="460,230 451,230" stroke="rgb(0, 0, 0)" stroke-linecap="square" stroke-width="1.0"/>
   <polyline fill="none" points="450,230 450,224" stroke="rgb(0, 0, 0)" stroke-linecap="square" stroke-width="1.0"/>
   <polyline fill="none" points="470,223 479,223" stroke="rgb(0, 0, 0)" stroke-linecap="square" stroke-width="1.0"/>
   <polyline fill="none" points="480,223 480,229" stroke="rgb(0, 0, 0)" stroke-linecap="square" stroke-width="1.0"/>
   <polyline fill="none" points="480,230 471,230" stroke="rgb(0, 0, 0)" stroke-linecap="square" stroke-width="1.0"/>
   <polyline fill="none" points="470,230 470,224" stroke="rgb(0, 0, 0)" stroke-linecap="square" stroke-width="1.0"/>
   <polyline fill="none" points="350,276 359,276" stroke="rgb(0, 0, 0)" stroke-linecap="square" stroke-width="1.0"/>
   <polyline fill="none" points="360,276 360,282" stroke="rgb(0, 0, 0)" stroke-linecap="square" stroke-width="1.0"/>
   <polyline fill="none" points="360,283 351,283" stroke="rgb(0, 0, 0)" stroke-linecap="square" stroke-width="1.0"/>
   <polyline fill="none" points="350,283 350,277" stroke="rgb(0, 0, 0)" stroke-linecap="square" stroke-width="1.0"/>
   <polyline fill="none" points="370,276 379,276" stroke="rgb(0, 0, 0)" stroke-linecap="square" stroke-width="1.0"/>
   <polyline fill="none" points="380,276 380,282" stroke="rgb(0, 0, 0)" stroke-linecap="square" stroke-width="1.0"/>
   <polyline fill="none" points="380,283 371,283" stroke="rgb(0, 0, 0)" stroke-linecap="square" stroke-width="1.0"/>
   <polyline fill="none" points="370,283 370,277" stroke="rgb(0, 0, 0)" stroke-linecap="square" stroke-width="1.0"/>
   <polyline fill="none" points="390,276 399,276" stroke="rgb(0, 0, 0)" stroke-linecap="square" stroke-width="1.0"/>
   <polyline fill="none" points="400,276 400,282" stroke="rgb(0, 0, 0)" stroke-linecap="square" stroke-width="1.0"/>
   <polyline fill="none" points="400,283 391,283" stroke="rgb(0, 0, 0)" stroke-linecap="square" stroke-width="1.0"/>
   <polyline fill="none" points="390,283 390,277" stroke="rgb(0, 0, 0)" stroke-linecap="square" stroke-width="1.0"/>
   <polyline fill="none" points="410,276 419,276" stroke="rgb(0, 0, 0)" stroke-linecap="square" stroke-width="1.0"/>
   <polyline fill="none" points="420,276 420,282" stroke="rgb(0, 0, 0)" stroke-linecap="square" stroke-width="1.0"/>
   <polyline fill="none" points="420,283 411,283" stroke="rgb(0, 0, 0)" stroke-linecap="square" stroke-width="1.0"/>
   <polyline fill="none" points="410,283 410,277" stroke="rgb(0, 0, 0)" stroke-linecap="square" stroke-width="1.0"/>
   <polyline fill="none" points="430,276 439,276" stroke="rgb(0, 0, 0)" stroke-linecap="square" stroke-width="1.0"/>
   <polyline fill="none" points="440,276 440,282" stroke="rgb(0, 0, 0)" stroke-linecap="square" stroke-width="1.0"/>
   <polyline fill="none" points="440,283 431,283" stroke="rgb(0, 0, 0)" stroke-linecap="square" stroke-width="1.0"/>
   <polyline fill="none" points="430,283 430,277" stroke="rgb(0, 0, 0)" stroke-linecap="square" stroke-width="1.0"/>
   <polyline fill="none" points="450,276 459,276" stroke="rgb(0, 0, 0)" stroke-linecap="square" stroke-width="1.0"/>
   <polyline fill="none" points="460,276 460,282" stroke="rgb(0, 0, 0)" stroke-linecap="square" stroke-width="1.0"/>
   <polyline fill="none" points="460,283 451,283" stroke="rgb(0, 0, 0)" stroke-linecap="square" stroke-width="1.0"/>
   <polyline fill="none" points="450,283 450,277" stroke="rgb(0, 0, 0)" stroke-linecap="square" stroke-width="1.0"/>
   <polyline fill="none" points="470,276 479,276" stroke="rgb(0, 0, 0)" stroke-linecap="square" stroke-width="1.0"/>
   <polyline fill="none" points="480,276 480,282" stroke="rgb(0, 0, 0)" stroke-linecap="square" stroke-width="1.0"/>
   <polyline fill="none" points="480,283 471,283" stroke="rgb(0, 0, 0)" stroke-linecap="square" stroke-width="1.0"/>
   <polyline fill="none" points="470,283 470,277" stroke="rgb(0, 0, 0)" stroke-linecap="square" stroke-width="1.0"/>
   <rect fill="none" height="46" rx="5.0" ry="5.0" stroke="rgb(0, 0, 0)" stroke-linecap="square" stroke-width="1.0" width="140" x="345" y="230"/>
   <path d="M345.0,260.0 A7.0,7.0 -270.0 0,0 345.0,246.0" fill="none" stroke="rgb(0, 0, 0)" stroke-width="1.0"/>
   <text fill="rgb(0, 0, 0)" font-family="DialogInput" font-size="7" font-weight="bold" x="349.0" y="238.0">Vcc</text>
   <text fill="rgb(0, 0, 0)" font-family="DialogInput" font-size="7" font-weight="bold" x="469.0" y="273.0">GND</text>
   <path d="M375.0,270.0 A17.0,17.0 90.0 0,0 388.75328890437413,262.99234928897204" fill="none" stroke="rgb(0, 0, 0)" stroke-width="1.0"/>
   <path d="M375.0,256.0 A17.0,17.0 -90.0 0,1 388.75328890437413,263.00765071102796" fill="none" stroke="rgb(0, 0, 0)" stroke-width="1.0"/>
   <path d="M374.3650978628255,269.8098574960932 A15.0,15.0 27.0 0,0 374.3650978628255,256.1901425039068" fill="none" stroke="rgb(0, 0, 0)" stroke-width="1.0"/>
   <path d="M370.3650978628255,269.8098574960932 A15.0,15.0 27.0 0,0 370.3650978628255,256.1901425039068" fill="none" stroke="rgb(0, 0, 0)" stroke-width="1.0"/>
   <polyline fill="none" points="389,263 395,263 395,276" stroke="rgb(0, 0, 0)" stroke-linecap="square" stroke-width="1.0"/>
   <polyline fill="none" points="375,276 375,273 365,273 365,268 371,268" stroke="rgb(0, 0, 0)" stroke-linecap="square" stroke-width="1.0"/>
   <polyline fill="none" points="355,276 355,258 371,258" stroke="rgb(0, 0, 0)" stroke-linecap="square" stroke-width="1.0"/>
   <path d="M435.0,270.0 A17.0,17.0 90.0 0,0 448.75328890437413,262.99234928897204" fill="none" stroke="rgb(0, 0, 0)" stroke-width="1.0"/>
   <path d="M435.0,256.0 A17.0,17.0 -90.0 0,1 448.75328890437413,263.00765071102796" fill="none" stroke="rgb(0, 0, 0)" stroke-width="1.0"/>
   <path d="M434.3650978628255,269.8098574960932 A15.0,15.0 27.0 0,0 434.3650978628255,256.1901425039068" fill="none" stroke="rgb(0, 0, 0)" stroke-width="1.0"/>
   <path d="M430.3650978628255,269.8098574960932 A15.0,15.0 27.0 0,0 430.3650978628255,256.1901425039068" fill="none" stroke="rgb(0, 0, 0)" stroke-width="1.0"/>
   <polyline fill="none" points="449,263 455,263 455,276" stroke="rgb(0, 0, 0)" stroke-linecap="square" stroke-width="1.0"/>
   <polyline fill="none" points="435,276 435,273 425,273 425,268 431,268" stroke="rgb(0, 0, 0)" stroke-linecap="square" stroke-width="1.0"/>
   <polyline fill="none" points="415,276 415,258 431,258" stroke="rgb(0, 0, 0)" stroke-linecap="square" stroke-width="1.0"/>
   <path d="M395.0,250.0 A17.0,17.0 90.0 0,0 408.75328890437413,242.99234928897204" fill="none" stroke="rgb(0, 0, 0)" stroke-width="1.0"/>
   <path d="M395.0,236.0 A17.0,17.0 -90.0 0,1 408.75328890437413,243.00765071102796" fill="none" stroke="rgb(0, 0, 0)" stroke-width="1.0"/>
   <path d="M394.3650978628255,249.80985749609317 A15.0,15.0 27.0 0,0 394.3650978628255,236.19014250390683" fill="none" stroke="rgb(0, 0, 0)" stroke-width="1.0"/>
   <path d="M390.3650978628255,249.80985749609317 A15.0,15.0 27.0 0,0 390.3650978628255,236.19014250390683" fill="none" stroke="rgb(0, 0, 0)" stroke-width="1.0"/>
   <polyline fill="none" points="409,243 415,243 415,230" stroke="rgb(0, 0, 0)" stroke-linecap="square" stroke-width="1.0"/>
   <polyline fill="none" points="395,230 395,233 385,233 385,238 391,238" stroke="rgb(0, 0, 0)" stroke-linecap="square" stroke-width="1.0"/>
   <polyline fill="none" points="375,230 375,248 391,248" stroke="rgb(0, 0, 0)" stroke-linecap="square" stroke-width="1.0"/>
   <path d="M455.0,250.0 A17.0,17.0 90.0 0,0 468.75328890437413,242.99234928897204" fill="none" stroke="rgb(0, 0, 0)" stroke-width="1.0"/>
   <path d="M455.0,236.0 A17.0,17.0 -90.0 0,1 468.75328890437413,243.00765071102796" fill="none" stroke="rgb(0, 0, 0)" stroke-width="1.0"/>
   <path d="M454.3650978628255,249.80985749609317 A15.0,15.0 27.0 0,0 454.3650978628255,236.19014250390683" fill="none" stroke="rgb(0, 0, 0)" stroke-width="1.0"/>
   <path d="M450.3650978628255,249.80985749609317 A15.0,15.0 27.0 0,0 450.3650978628255,236.19014250390683" fill="none" stroke="rgb(0, 0, 0)" stroke-width="1.0"/>
   <polyline fill="none" points="469,243 475,243 475,230" stroke="rgb(0, 0, 0)" stroke-linecap="square" stroke-width="1.0"/>
   <polyline fill="none" points="455,230 455,233 445,233 445,238 451,238" stroke="rgb(0, 0, 0)" stroke-linecap="square" stroke-width="1.0"/>
   <polyline fill="none" points="435,230 435,248 451,248" stroke="rgb(0, 0, 0)" stroke-linecap="square" stroke-width="1.0"/>
   <text fill="rgb(0, 0, 0)" font-family="SansSerif" font-size="16" font-weight="bold" x="395.0" y="210.0">NOT</text>
   <ellipse cx="185.0" cy="283.0" fill="rgb(0, 0, 0)" rx="2.0" ry="2.0" stroke="none" stroke-width="1.0"/>
   <ellipse cx="205.0" cy="283.0" fill="rgb(0, 0, 0)" rx="2.0" ry="2.0" stroke="none" stroke-width="1.0"/>
   <ellipse cx="225.0" cy="283.0" fill="rgb(0, 0, 0)" rx="2.0" ry="2.0" stroke="none" stroke-width="1.0"/>
   <ellipse cx="245.0" cy="283.0" fill="rgb(0, 0, 0)" rx="2.0" ry="2.0" stroke="none" stroke-width="1.0"/>
   <ellipse cx="265.0" cy="283.0" fill="rgb(0, 0, 0)" rx="2.0" ry="2.0" stroke="none" stroke-width="1.0"/>
   <ellipse cx="285.0" cy="283.0" fill="rgb(0, 0, 0)" rx="2.0" ry="2.0" stroke="none" stroke-width="1.0"/>
   <ellipse cx="305.0" cy="223.0" fill="rgb(0, 0, 0)" rx="2.0" ry="2.0" stroke="none" stroke-width="1.0"/>
   <ellipse cx="285.0" cy="223.0" fill="rgb(0, 0, 0)" rx="2.0" ry="2.0" stroke="none" stroke-width="1.0"/>
   <ellipse cx="265.0" cy="223.0" fill="rgb(0, 0, 0)" rx="2.0" ry="2.0" stroke="none" stroke-width="1.0"/>
   <ellipse cx="245.0" cy="223.0" fill="rgb(0, 0, 0)" rx="2.0" ry="2.0" stroke="none" stroke-width="1.0"/>
   <ellipse cx="225.0" cy="223.0" fill="rgb(0, 0, 0)" rx="2.0" ry="2.0" stroke="none" stroke-width="1.0"/>
   <ellipse cx="205.0" cy="223.0" fill="rgb(0, 0, 0)" rx="2.0" ry="2.0" stroke="none" stroke-width="1.0"/>
   <polyline fill="none" points="180,223 189,223" stroke="rgb(0, 0, 0)" stroke-linecap="square" stroke-width="1.0"/>
   <polyline fill="none" points="190,223 190,229" stroke="rgb(0, 0, 0)" stroke-linecap="square" stroke-width="1.0"/>
   <polyline fill="none" points="190,230 181,230" stroke="rgb(0, 0, 0)" stroke-linecap="square" stroke-width="1.0"/>
   <polyline fill="none" points="180,230 180,224" stroke="rgb(0, 0, 0)" stroke-linecap="square" stroke-width="1.0"/>
   <polyline fill="none" points="200,223 209,223" stroke="rgb(0, 0, 0)" stroke-linecap="square" stroke-width="1.0"/>
   <polyline fill="none" points="210,223 210,229" stroke="rgb(0, 0, 0)" stroke-linecap="square" stroke-width="1.0"/>
   <polyline fill="none" points="210,230 201,230" stroke="rgb(0, 0, 0)" stroke-linecap="square" stroke-width="1.0"/>
   <polyline fill="none" points="200,230 200,224" stroke="rgb(0, 0, 0)" stroke-linecap="square" stroke-width="1.0"/>
   <polyline fill="none" points="220,223 229,223" stroke="rgb(0, 0, 0)" stroke-linecap="square" stroke-width="1.0"/>
   <polyline fill="none" points="230,223 230,229" stroke="rgb(0, 0, 0)" stroke-linecap="square" stroke-width="1.0"/>
   <polyline fill="none" points="230,230 221,230" stroke="rgb(0, 0, 0)" stroke-linecap="square" stroke-width="1.0"/>
   <polyline fill="none" points="220,230 220,224" stroke="rgb(0, 0, 0)" stroke-linecap="square" stroke-width="1.0"/>
   <polyline fill="none" points="240,223 249,223" stroke="rgb(0, 0, 0)" stroke-linecap="square" stroke-width="1.0"/>
   <polyline fill="none" points="250,223 250,229" stroke="rgb(0, 0, 0)" stroke-linecap="square" stroke-width="1.0"/>
   <polyline fill="none" points="250,230 241,230" stroke="rgb(0, 0, 0)" stroke-linecap="square" stroke-width="1.0"/>
   <polyline fill="none" points="240,230 240,224" stroke="rgb(0, 0, 0)" stroke-linecap="square" stroke-width="1.0"/>
   <polyline fill="none" points="260,223 269,223" stroke="rgb(0, 0, 0)" stroke-linecap="square" stroke-width="1.0"/>
   <polyline fill="none" points="270,223 270,229" stroke="rgb(0, 0, 0)" stroke-linecap="square" stroke-width="1.0"/>
   <polyline fill="none" points="270,230 261,230" stroke="rgb(0, 0, 0)" stroke-linecap="square" stroke-width="1.0"/>
   <polyline fill="none" points="260,230 260,224" stroke="rgb(0, 0, 0)" stroke-linecap="square" stroke-width="1.0"/>
   <polyline fill="none" points="280,223 289,223" stroke="rgb(0, 0, 0)" stroke-linecap="square" stroke-width="1.0"/>
   <polyline fill="none" points="290,223 290,229" stroke="rgb(0, 0, 0)" stroke-linecap="square" stroke-width="1.0"/>
   <polyline fill="none" points="290,230 281,230" stroke="rgb(0, 0, 0)" stroke-linecap="square" stroke-width="1.0"/>
   <polyline fill="none" points="280,230 280,224" stroke="rgb(0, 0, 0)" stroke-linecap="square" stroke-width="1.0"/>
   <polyline fill="none" points="300,223 309,223" stroke="rgb(0, 0, 0)" stroke-linecap="square" stroke-width="1.0"/>
   <polyline fill="none" points="310,223 310,229" stroke="rgb(0, 0, 0)" stroke-linecap="square" stroke-width="1.0"/>
   <polyline fill="none" points="310,230 301,230" stroke="rgb(0, 0, 0)" stroke-linecap="square" stroke-width="1.0"/>
   <polyline fill="none" points="300,230 300,224" stroke="rgb(0, 0, 0)" stroke-linecap="square" stroke-width="1.0"/>
   <polyline fill="none" points="180,276 189,276" stroke="rgb(0, 0, 0)" stroke-linecap="square" stroke-width="1.0"/>
   <polyline fill="none" points="190,276 190,282" stroke="rgb(0, 0, 0)" stroke-linecap="square" stroke-width="1.0"/>
   <polyline fill="none" points="190,283 181,283" stroke="rgb(0, 0, 0)" stroke-linecap="square" stroke-width="1.0"/>
   <polyline fill="none" points="180,283 180,277" stroke="rgb(0, 0, 0)" stroke-linecap="square" stroke-width="1.0"/>
   <polyline fill="none" points="200,276 209,276" stroke="rgb(0, 0, 0)" stroke-linecap="square" stroke-width="1.0"/>
   <polyline fill="none" points="210,276 210,282" stroke="rgb(0, 0, 0)" stroke-linecap="square" stroke-width="1.0"/>
   <polyline fill="none" points="210,283 201,283" stroke="rgb(0, 0, 0)" stroke-linecap="square" stroke-width="1.0"/>
   <polyline fill="none" points="200,283 200,277" stroke="rgb(0, 0, 0)" stroke-linecap="square" stroke-width="1.0"/>
   <polyline fill="none" points="220,276 229,276" stroke="rgb(0, 0, 0)" stroke-linecap="square" stroke-width="1.0"/>
   <polyline fill="none" points="230,276 230,282" stroke="rgb(0, 0, 0)" stroke-linecap="square" stroke-width="1.0"/>
   <polyline fill="none" points="230,283 221,283" stroke="rgb(0, 0, 0)" stroke-linecap="square" stroke-width="1.0"/>
   <polyline fill="none" points="220,283 220,277" stroke="rgb(0, 0, 0)" stroke-linecap="square" stroke-width="1.0"/>
   <polyline fill="none" points="240,276 249,276" stroke="rgb(0, 0, 0)" stroke-linecap="square" stroke-width="1.0"/>
   <polyline fill="none" points="250,276 250,282" stroke="rgb(0, 0, 0)" stroke-linecap="square" stroke-width="1.0"/>
   <polyline fill="none" points="250,283 241,283" stroke="rgb(0, 0, 0)" stroke-linecap="square" stroke-width="1.0"/>
   <polyline fill="none" points="240,283 240,277" stroke="rgb(0, 0, 0)" stroke-linecap="square" stroke-width="1.0"/>
   <polyline fill="none" points="260,276 269,276" stroke="rgb(0, 0, 0)" stroke-linecap="square" stroke-width="1.0"/>
   <polyline fill="none" points="270,276 270,282" stroke="rgb(0, 0, 0)" stroke-linecap="square" stroke-width="1.0"/>
   <polyline fill="none" points="270,283 261,283" stroke="rgb(0, 0, 0)" stroke-linecap="square" stroke-width="1.0"/>
   <polyline fill="none" points="260,283 260,277" stroke="rgb(0, 0, 0)" stroke-linecap="square" stroke-width="1.0"/>
   <polyline fill="none" points="280,276 289,276" stroke="rgb(0, 0, 0)" stroke-linecap="square" stroke-width="1.0"/>
   <polyline fill="none" points="290,276 290,282" stroke="rgb(0, 0, 0)" stroke-linecap="square" stroke-width="1.0"/>
   <polyline fill="none" points="290,283 281,283" stroke="rgb(0, 0, 0)" stroke-linecap="square" stroke-width="1.0"/>
   <polyline fill="none" points="280,283 280,277" stroke="rgb(0, 0, 0)" stroke-linecap="square" stroke-width="1.0"/>
   <polyline fill="none" points="300,276 309,276" stroke="rgb(0, 0, 0)" stroke-linecap="square" stroke-width="1.0"/>
   <polyline fill="none" points="310,276 310,282" stroke="rgb(0, 0, 0)" stroke-linecap="square" stroke-width="1.0"/>
   <polyline fill="none" points="310,283 301,283" stroke="rgb(0, 0, 0)" stroke-linecap="square" stroke-width="1.0"/>
   <polyline fill="none" points="300,283 300,277" stroke="rgb(0, 0, 0)" stroke-linecap="square" stroke-width="1.0"/>
   <rect fill="none" height="46" rx="5.0" ry="5.0" stroke="rgb(0, 0, 0)" stroke-linecap="square" stroke-width="1.0" width="140" x="175" y="230"/>
   <path d="M175.0,260.0 A7.0,7.0 -270.0 0,0 175.0,246.0" fill="none" stroke="rgb(0, 0, 0)" stroke-width="1.0"/>
   <text fill="rgb(0, 0, 0)" font-family="DialogInput" font-size="7" font-weight="bold" x="179.0" y="238.0">Vcc</text>
   <text fill="rgb(0, 0, 0)" font-family="DialogInput" font-size="7" font-weight="bold" x="299.0" y="273.0">GND</text>
   <path d="M201.0,270.0 A17.0,17.0 90.0 0,0 214.75328890437413,262.99234928897204" fill="none" stroke="rgb(0, 0, 0)" stroke-width="1.0"/>
   <path d="M201.0,256.0 A17.0,17.0 -90.0 0,1 214.75328890437413,263.00765071102796" fill="none" stroke="rgb(0, 0, 0)" stroke-width="1.0"/>
   <path d="M200.3650978628255,269.8098574960932 A15.0,15.0 27.0 0,0 200.3650978628255,256.1901425039068" fill="none" stroke="rgb(0, 0, 0)" stroke-width="1.0"/>
   <polyline fill="none" points="215,263 225,263 225,276" stroke="rgb(0, 0, 0)" stroke-linecap="square" stroke-width="1.0"/>
   <polyline fill="none" points="205,276 205,273 195,273 195,268 201,268" stroke="rgb(0, 0, 0)" stroke-linecap="square" stroke-width="1.0"/>
   <polyline fill="none" points="185,276 185,258 201,258" stroke="rgb(0, 0, 0)" stroke-linecap="square" stroke-width="1.0"/>
   <path d="M261.0,270.0 A17.0,17.0 90.0 0,0 274.75328890437413,262.99234928897204" fill="none" stroke="rgb(0, 0, 0)" stroke-width="1.0"/>
   <path d="M261.0,256.0 A17.0,17.0 -90.0 0,1 274.75328890437413,263.00765071102796" fill="none" stroke="rgb(0, 0, 0)" stroke-width="1.0"/>
   <path d="M260.3650978628255,269.8098574960932 A15.0,15.0 27.0 0,0 260.3650978628255,256.1901425039068" fill="none" stroke="rgb(0, 0, 0)" stroke-width="1.0"/>
   <polyline fill="none" points="275,263 285,263 285,276" stroke="rgb(0, 0, 0)" stroke-linecap="square" stroke-width="1.0"/>
   <polyline fill="none" points="265,276 265,273 255,273 255,268 261,268" stroke="rgb(0, 0, 0)" stroke-linecap="square" stroke-width="1.0"/>
   <polyline fill="none" points="245,276 245,258 261,258" stroke="rgb(0, 0, 0)" stroke-linecap="square" stroke-width="1.0"/>
   <path d="M221.0,250.0 A17.0,17.0 90.0 0,0 234.75328890437413,242.99234928897204" fill="none" stroke="rgb(0, 0, 0)" stroke-width="1.0"/>
   <path d="M221.0,236.0 A17.0,17.0 -90.0 0,1 234.75328890437413,243.00765071102796" fill="none" stroke="rgb(0, 0, 0)" stroke-width="1.0"/>
   <path d="M220.3650978628255,249.80985749609317 A15.0,15.0 27.0 0,0 220.3650978628255,236.19014250390683" fill="none" stroke="rgb(0, 0, 0)" stroke-width="1.0"/>
   <polyline fill="none" points="235,243 245,243 245,230" stroke="rgb(0, 0, 0)" stroke-linecap="square" stroke-width="1.0"/>
   <polyline fill="none" points="225,230 225,233 215,233 215,238 221,238" stroke="rgb(0, 0, 0)" stroke-linecap="square" stroke-width="1.0"/>
   <polyline fill="none" points="205,230 205,248 221,248" stroke="rgb(0, 0, 0)" stroke-linecap="square" stroke-width="1.0"/>
   <path d="M281.0,250.0 A17.0,17.0 90.0 0,0 294.75328890437413,242.99234928897204" fill="none" stroke="rgb(0, 0, 0)" stroke-width="1.0"/>
   <path d="M281.0,236.0 A17.0,17.0 -90.0 0,1 294.75328890437413,243.00765071102796" fill="none" stroke="rgb(0, 0, 0)" stroke-width="1.0"/>
   <path d="M280.3650978628255,249.80985749609317 A15.0,15.0 27.0 0,0 280.3650978628255,236.19014250390683" fill="none" stroke="rgb(0, 0, 0)" stroke-width="1.0"/>
   <polyline fill="none" points="295,243 305,243 305,230" stroke="rgb(0, 0, 0)" stroke-linecap="square" stroke-width="1.0"/>
   <polyline fill="none" points="285,230 285,233 275,233 275,238 281,238" stroke="rgb(0, 0, 0)" stroke-linecap="square" stroke-width="1.0"/>
   <polyline fill="none" points="265,230 265,248 281,248" stroke="rgb(0, 0, 0)" stroke-linecap="square" stroke-width="1.0"/>
   <text fill="rgb(0, 0, 0)" font-family="SansSerif" font-size="16" font-weight="bold" x="213.0" y="176.0">7432</text>
   <text fill="rgb(0, 0, 0)" font-family="SansSerif" font-size="16" font-weight="bold" x="195.0" y="203.0">2-input OR</text>
</svg>
