# Branches,# Junctions,# End-point voxels,# Junction voxels,# Slab voxels,Average Branch Length,# Triple points,# Quadruple points,Maximum Branch Length
3,1,3,5,134,60.807,1,0,76.468
1,0,2,0,59,66.627,0,0,66.627
1,0,2,0,39,42.485,0,0,42.485
1,0,2,0,35,41.385,0,0,41.385
1,0,2,0,31,41.113,0,0,41.113
1,0,2,0,21,29.456,0,0,29.456
1,0,2,0,90,105.083,0,0,105.083
1,0,2,0,19,25.799,0,0,25.799
1,0,2,0,7,10.485,0,0,10.485
1,0,2,0,35,38.071,0,0,38.071
1,0,2,0,15,17.657,0,0,17.657
1,0,2,0,49,63.669,0,0,63.669
1,0,2,0,78,83.971,0,0,83.971
1,0,2,0,50,57.213,0,0,57.213
1,0,2,0,40,46.385,0,0,46.385
1,0,2,0,83,110.510,0,0,110.510
1,0,2,0,35,37.657,0,0,37.657
2,1,1,1,5,3.828,1,0,4.243
1,0,2,0,21,26.556,0,0,26.556
1,0,2,0,67,87.882,0,0,87.882
1,0,2,0,29,39.941,0,0,39.941
7,3,5,8,28,6.637,3,0,15.485
1,0,2,0,35,42.213,0,0,42.213
1,0,2,0,43,58.083,0,0,58.083
1,0,2,0,42,56.669,0,0,56.669
1,0,2,0,12,15.071,0,0,15.071
1,0,2,0,65,74.698,0,0,74.698
1,0,2,0,9,11.243,0,0,11.243
1,0,2,0,25,33.870,0,0,33.870
3,1,3,3,121,51.251,1,0,91.326
1,0,2,0,10,13.071,0,0,13.071
5,2,4,8,133,32.328,2,0,53.385
3,1,3,3,17,8.576,1,0,11.657
1,0,2,0,80,90.527,0,0,90.527
1,0,2,0,24,26.657,0,0,26.657
1,0,2,0,38,43.142,0,0,43.142
8,4,5,16,139,22.016,3,0,54.899
1,0,2,0,57,60.071,0,0,60.071
1,0,2,0,58,66.042,0,0,66.042
3,1,3,3,9,5.495,1,0,9.243
1,0,2,0,74,83.284,0,0,83.284
1,0,2,0,35,44.698,0,0,44.698
1,0,2,0,48,58.527,0,0,58.527
1,0,2,0,51,56.971,0,0,56.971
1,0,2,0,44,55.770,0,0,55.770
1,0,2,0,57,60.899,0,0,60.899
1,0,2,0,35,44.698,0,0,44.698
1,0,2,0,47,52.971,0,0,52.971
1,0,2,0,44,56.598,0,0,56.598
3,1,3,1,33,14.347,1,0,28.142
1,0,2,0,72,79.627,0,0,79.627
1,0,2,0,8,10.243,0,0,10.243
5,2,4,7,115,27.982,2,0,45.728
1,0,2,0,82,107.024,0,0,107.024
1,0,2,0,28,31.485,0,0,31.485
1,0,2,0,57,58.828,0,0,58.828
