\@ifundefined {etoctocstyle}{\let \etoc@startlocaltoc \@gobble \let \etoc@settocdepth \@gobble \let \etoc@depthtag \@gobble \let \etoc@setlocaltop \@gobble }{}
\babel@toc {english}{}
\etoc@depthtag {mtsubsection}
\contentsline {section}{\numberline {1}I am a chapter}{4}{section.1}% 
\contentsline {subsection}{\numberline {1.1}I am a section (1)}{4}{subsection.1.1}% 
\contentsline {subsection}{\numberline {1.2}I am a section (2)}{4}{subsection.1.2}% 
\contentsline {subsubsection}{I am a subsection (2.1)}{4}{section*.4}% 
