\relax 
\providecommand\hyper@newdestlabel[2]{}
\bbl@beforestart
\providecommand\HyperFirstAtBeginDocument{\AtBeginDocument}
\HyperFirstAtBeginDocument{\ifx\hyper@anchor\@undefined
\global\let\oldcontentsline\contentsline
\gdef\contentsline#1#2#3#4{\oldcontentsline{#1}{#2}{#3}}
\global\let\oldnewlabel\newlabel
\gdef\newlabel#1#2{\newlabelxx{#1}#2}
\gdef\newlabelxx#1#2#3#4#5#6{\oldnewlabel{#1}{{#2}{#3}}}
\AtEndDocument{\ifx\hyper@anchor\@undefined
\let\contentsline\oldcontentsline
\let\newlabel\oldnewlabel
\fi}
\fi}
\global\let\hyper@last\relax 
\gdef\HyperFirstAtBeginDocument#1{#1}
\providecommand\HyField@AuxAddToFields[1]{}
\providecommand\HyField@AuxAddToCoFields[2]{}
\providecommand \oddpage@label [2]{}
\@writefile{toc}{\@ifundefined {etoctocstyle}{\let \etoc@startlocaltoc \@gobble \let \etoc@settocdepth \@gobble \let \etoc@depthtag \@gobble \let \etoc@setlocaltop \@gobble }{}}
\babel@aux{english}{}
\@writefile{toc}{\etoc@depthtag {mtsubsection}}
\@writefile{lof}{\contentsline {figure}{\numberline {1}{\ignorespaces \relax }}{3}{figure.caption.2}\protected@file@percent }
\citation{hobbes_leviathan}
\bibstyle{apalike}
\bibdata{bibliography}
\bibcite{hobbes_leviathan}{Hobbes, 1914}
\newlabel{fig:fullpage1}{{1}{4}{\relax }{figure.caption.2}{}}
\newlabel{fig:fullpage1@cref}{{[figure][1][]1}{[1][4][]4}}
\@writefile{toc}{\contentsline {section}{\numberline {1}I am a chapter}{4}{section.1}\protected@file@percent }
\@writefile{toc}{\contentsline {subsection}{\numberline {1.1}I am a section (1)}{4}{subsection.1.1}\protected@file@percent }
\newlabel{sec:sectionbla}{{1.1}{4}{I am a section (1)}{subsection.1.1}{}}
\newlabel{sec:sectionbla@cref}{{[subsection][1][1]1.1}{[1][4][]4}}
\@writefile{lof}{\contentsline {figure}{\numberline {2}{\ignorespaces Captions\relax }}{4}{figure.caption.3}\protected@file@percent }
\newlabel{fig:figure_name}{{2}{4}{Captions\relax }{figure.caption.3}{}}
\newlabel{fig:figure_name@cref}{{[figure][2][]2}{[1][4][]4}}
\@writefile{toc}{\contentsline {subsection}{\numberline {1.2}I am a section (2)}{4}{subsection.1.2}\protected@file@percent }
\newlabel{sec:sectionblabla}{{1.2}{4}{I am a section (2)}{subsection.1.2}{}}
\newlabel{sec:sectionblabla@cref}{{[subsection][2][1]1.2}{[1][4][]4}}
\@writefile{toc}{\contentsline {subsubsection}{I am a subsection (2.1)}{4}{section*.4}\protected@file@percent }
