,name,module,metricsNb,nbDims,sources,distributedOn,failedCheck,MetricsOk,DimsOk,SchemaOk,Status,Error,ErrorType,recordsNb,duration
0,LCR,Liquidity,1,33,"['Liquidity', 'LiquidityDatesLabel']",,0,False,False,False,200,True,http,0,258.62586641311646
1,detect_error,HistoVaR,0,4,"['Security_PnL_WIP', 'scenario_array']",SecurityId,0,False,False,False,200,True,http,0,260.07973623275757
2,Metrics,HistoVaR,3,12,"['Position_PnL_WIP', 'scenario_array']",Date,0,False,False,False,200,False,,0,1.2845022678375244
3,MaxLossContribution,HistoVaR,1,12,"['Position_PnL_WIP', 'scenario_array']",Date,0,False,False,False,200,True,http,0,262.2518630027771
4,Projection,HistoVaR,0,13,['Position_Sensi_WIP'],,0,False,False,False,200,True,http,0,262.39144015312195
5,MetricsV1WithSensi,HistoVaR,4,12,"['Position_PnL_WIP', 'scenario_array', 'Position_Sensi_WIP']",Date,0,False,False,False,200,False,,0,1.6765940189361572
6,ESContribution,HistoVaR,1,12,"['Position_PnL_WIP', 'scenario_array']",Date,0,False,False,False,200,True,http,0,264.12478041648865
7,MetricsV1,HistoVaR,3,11,"['Position_PnL_WIP', 'scenario_array']",Date,0,False,False,False,200,True,http,0,266.0537931919098
8,CVaR_CPTY,mtm,0,4,"['mtms', 'datearray']",counterparty,1,False,False,False,200,True,http,0,266.4628200531006
9,CVaR_CPTY_drillBy,mtm,0,4,"['mtms', 'datearray']",counterparty,0,False,False,False,200,True,http,0,268.08025765419006
10,Wrong_Test_non_dim_req,mtm,0,4,"['mtms', 'mtms']",counterparty,2,False,False,False,200,True,IllegalParameter,0,1.6429214477539062
11,Test_non_dim_req,mtm,0,4,"['mtms', 'mtms']",counterparty,2,False,False,False,200,True,http,0,269.11714482307434
12,TestMultiTableCalculator,mtm,0,4,"['mtms', 'fxs']",Date,0,False,False,False,200,True,DistributionSetNotMatching,0,3.3634157180786133
13,FRTB_GIRR_Sensi,sensi,0,3,['Sensi'],,0,False,False,False,200,True,http,0,271.0214982032776
14,EQ_Vol_AdvStressTest,sensi,0,3,['Sensi'],Desk,1,False,False,False,200,True,http,0,272.32470202445984
15,Map,sensi,0,36,['Sensi'],,0,False,False,False,200,True,http,0,273.0487244129181
16,Test,sensi,0,2,['Sensi'],,0,False,False,False,200,True,ClientPayloadError,0,0.8984746932983398
17,FRTB_EQ,sensi,0,3,['Sensi'],Desk,1,False,False,False,400,True,InvalidRequestType,0,6.580352783203125e-05
18,FRTB_CS,sensi,0,2,['Sensi'],,0,False,False,False,200,True,http,0,276.0465016365051
19,FRTB_GIRR_Sensi,sensi_dynamic,0,4,['Sensi'],,0,False,False,False,200,True,http,0,277.3254358768463
20,FRTB_EQ,sensi_dynamic,0,3,['Sensi'],Desk,1,False,False,False,400,True,InvalidRequestType,0,5.173683166503906e-05
21,FRTB_CS,sensi_dynamic,0,3,['Sensi'],,0,False,False,False,200,True,http,0,279.0795044898987
22,test_multi_metriques,sensi_dynamic,3,6,['Sensi'],,0,False,False,False,200,True,http,0,280.19114327430725
23,EQ_Vol_AdvStressTest,sensi_dynamic,0,3,['Sensi'],Desk,1,False,False,False,200,True,http,0,281.17534041404724
24,test_subtotals,sensi_dynamic,0,6,['Sensi'],,0,False,False,False,200,True,http,0,282.014408826828
25,Projection,sensi_dynamic,0,36,['Sensi'],,0,False,False,False,200,True,http,0,283.0821843147278
26,CVaR_CPTY,mtm_nv,0,4,"['mtms_nv', 'datearray']",counterparty,1,False,False,False,200,True,http,0,284.13394474983215
27,CVaR_CPTY_drillBy,mtm_nv,0,4,"['mtms_nv', 'datearray']",counterparty,0,False,False,False,200,True,http,0,285.3669846057892
28,FRTB_GIRR_Sensi,sensi_nv,0,3,['Sensi_nv'],,0,False,False,False,200,True,http,0,286.035192489624
29,EQ_Vol_AdvStressTest,sensi_nv,0,3,['Sensi_nv'],Desk,1,False,False,False,200,True,http,0,287.0819401741028
30,Map,sensi_nv,0,36,['Sensi_nv'],,0,False,False,False,200,True,http,0,287.9094123840332
31,Test,sensi_nv,0,2,['Sensi_nv'],,0,False,False,False,200,True,ClientPayloadError,0,0.7721941471099854
32,FRTB_CS,sensi_nv,0,2,['Sensi_nv'],,0,False,False,False,200,True,http,0,290.17340636253357
33,FRTB_EQ,sensi_nv,0,3,['Sensi_nv'],Desk,1,False,False,False,400,True,InvalidRequestType,0,5.221366882324219e-05
34,FRTB_EQ,sensi_nv_dynamic,0,3,['Sensi_nv'],Desk,1,False,False,False,400,True,InvalidRequestType,0,5.4836273193359375e-05
35,FRTB_CS,sensi_nv_dynamic,0,3,['Sensi_nv'],,0,False,False,False,200,True,http,0,293.3707158565521
36,Projection,sensi_nv_dynamic,0,36,['Sensi_nv'],,0,False,False,False,200,True,http,0,294.06811785697937
37,test_subtotals,sensi_nv_dynamic,0,6,['Sensi_nv'],,0,False,False,False,200,True,http,0,295.4101502895355
38,test_multi_metriques,sensi_nv_dynamic,3,6,['Sensi_nv'],,0,False,False,False,200,True,http,0,296.0235769748688
39,FRTB_GIRR_Sensi,sensi_nv_dynamic,0,4,['Sensi_nv'],,0,False,False,False,200,True,http,0,297.17933201789856
40,EQ_Vol_AdvStressTest,sensi_nv_dynamic,0,3,['Sensi_nv'],Desk,1,False,False,False,200,True,http,0,298.03414511680603
41,testNullable_calculator,testNullable,0,4,['TestNullable'],,0,False,False,False,200,True,http,0,299.3692066669464

