{
    "antifeatures": {
        "Ads": "يحتوي هذا التطبيق على إعلانات",
        "DisabledAlgorithm": "لدى هذا التطبيق توقيع أمان ضعيف",
        "KnownVuln": "يحتوي هذا التطبيق على ثغرة أمنية معروفة",
        "NoSourceSince": "لم يعد الكود المصدري متاحًا، لا تحديثات مُمكنة",
        "NonFreeAdd": "هذا التطبيق يحمل إضافات غير حرة",
        "NonFreeAssets": "هذا التطبيق يحتوي على أصول غير الحرة",
        "NonFreeDep": "هذا التطبيق يعتمد على تطبيقات أخرى غير حرة",
        "NonFreeNet": "هذا التطبيق يحمل خدمات شبكة غير حرة",
        "Tracking": "هذا التطبيق يراقب ويوثق نشاطك",
        "UpstreamNonFree": "شفرة المصدر المنشطة ليست حرة تماماً"
    },
    "app_categories": {
        "Connectivity": "الاتصال",
        "Development": "التطوير",
        "Games": "الألعاب",
        "Graphics": "الرسومات",
        "Internet": "الإنترنت",
        "Money": "المالية",
        "Multimedia": "الوسائط المتعددة",
        "Navigation": "التصفح",
        "Phone & SMS": "الهاتف و الرسائل القصيرة",
        "Reading": "القراءة",
        "Science & Education": "العلوم و التعليم",
        "Security": "الأمان",
        "Sports & Health": "الرياضة و الصحة",
        "System": "النظام",
        "Theming": "السمات",
        "Time": "الوقت",
        "Writing": "الكتابة",
        "show_all_packages": "عرض الكل %d"
    },
    "index": {
        "download_fdroid": "تنزيل F-Droid",
        "gpg_signature": "توقيع بي جي بي",
        "introduction": "F-Droid هو فهرس للتطبيقات والبرمجيات الحرة المفتوحة المصدر لمنصة أندرويد. يسمح لك التطبيق بإكتشاف وتثبيت ومتابعة التحديثات على جهازك.",
        "screenshot": "لقطات الشاشة ل F-Droid على نظام الأندرويد",
        "title": "ما هو F-Droid؟"
    },
    "navigation": {
        "about": "عن",
        "apps": "تَصَفّح",
        "contribute": "ساهم",
        "documentation": "الوثائق",
        "edit_on_gitlab": "تعديل على غيت لاب",
        "forum": "المنتدى",
        "issues": "المشاكل",
        "news": "الأخبار",
        "translate_on_weblate": "ترجمة على ويب لات"
    },
    "package": {
        "added_on": "مضاف في {{ package_added_date }}",
        "anti_features": "المميزات المضادة",
        "anti_features_warning": "لدى هذا التطبيق ميزات قد لا تعجبك.",
        "author": "المالك",
        "build_metadata": "بيانات البناء الوصفية",
        "changelog": "سجل التغييرات",
        "donate": "تبرع",
        "download": "تحميل {{ file_extension }}",
        "flattr": "فلاتر",
        "gpg_signature": "توقيع بي جي بي",
        "issue_tracker": "مقتفي المشاكل",
        "liberapay": "Liberapay",
        "license": "الرخصة",
        "minimum_android_version": "يتطلب هذا الإصدار نظام أندرويد {{ android_version }} أو أحدث.",
        "new_in_version": "جديد في الإصدار {{ latest_version }}",
        "opencollective": "Open Collective",
        "package_icon_alt": "ايقونة الحزمة",
        "packages": "الحزم",
        "permissions": "الأذونات",
        "signed_by_developer": "مُطوَّر و مُوَقَّع من قبل المُطوِّر الأصلي.",
        "signed_by_fdroid": "مصمّمٌ و مُوقّع عليه من طرف أف-درويد و مضمون ليتوافق مع <a href=\"{{ source_code_url }}\">حزمة تار المصدرية</a>.",
        "source_code": "الشفرة المصدرية",
        "suggest_downloading_via_fdroid": "على الرغم من تَوفّرحُزم APK أدناه لاعطيائك الخيار إلّا أنه يجب أن تكون على علم بأن عملية التثبيت بهذه الطريقة لن تمكِّنك من تلقي إخطارات التحديث وأنها وسيلة أقل أمنا للتنزيل. ننصحك بتثبيت تطبيق F-Droid واستخدامه.",
        "suggested": "مقترحة",
        "technical_info": "بيانات تقنية",
        "translation": "الترجمة",
        "version_info": "<b>الإصدار {{ package_version }}</b> ({{ package_version_code }})",
        "website": "الموقع"
    },
    "permissions": {
        "permdesc_acceptHandovers": "السماح للتطبيق بمواصلة مكالمة بدأت في تطبيق آخر.",
        "permdesc_accessBackgroundLocation": "إذا تمّ منح إذن التطبيق هذا بالإضافة إلى الموقع الجغرافي التقريبي أو الدقيق، يمكن للتطبيق الوصول إلى الموقع الجغرافي أثناء تشغيله في الخلفية.",
        "permdesc_accessCoarseLocation": "لا يمكن لهذا التطبيق معرفة موقعك الجغرافي التقريبي من خدمات الموقع الجغرافي عندما يكون التطبيق قيد التشغيل. يجب تفعيل خدمات الموقع الجغرافي على جهازك كي يتمكّن التطبيق من معرفة الموقع الجغرافي.",
        "permdesc_accessDrmCertificates": "‏للسماح لأحد التطبيقات بتقديم شهادات DRM واستخدامها. لا يجب أن يكون ذلك لازمًا مطلقًا مع التطبيقات العادية.",
        "permdesc_accessFineLocation": "يمكن لهذا التطبيق معرفة موقعك الجغرافي الدقيق من خدمات الموقع الجغرافي عندما يكون التطبيق قيد التشغيل. يجب تفعيل خدمات الموقع الجغرافي على جهازك كي يتمكّن التطبيق من معرفة الموقع الجغرافي. قد يؤدي هذا إلى زيادة استهلاك شحن البطارية.",
        "permdesc_accessImsCallService": "للسماح للتطبيق باستخدام خدمة الرسائل الفورية لإجراء المكالمات دون تدخل منك.",
        "permdesc_accessLocationExtraCommands": "‏للسماح للتطبيق بالدخول إلى أوامر إضافية لموفر الموقع. قد يتيح هذا للتطبيق التداخل مع تشغيل تقنية نظام تحديد المواقع العالمي (GPS) أو مصادر الموقع الأخرى.",
        "permdesc_accessNetworkConditions": "للسماح للتطبيق بالاستماع إلى ملاحظات حول أحوال الشبكة. لا حاجة إلى هذا مع التطبيقات العادية.",
        "permdesc_accessNetworkState": "للسماح للتطبيق بعرض معلومات حول اتصالات الشبكة كعرض معلومات عن الشبكات المتوفرة والشبكات المتصلة.",
        "permdesc_accessNotifications": "يتيح للتطبيق استرجاع الإشعارات وفحصها ومسحها، بما في ذلك تلك التي نشرتها تطبيقات أخرى.",
        "permdesc_accessWifiState": "‏للسماح للتطبيق بعرض معلومات حول شبكات Wi-Fi، كعرض معلومات حول ما إذا تم تفعيل Wi-Fi واسم أجهزة Wi-Fi المتصلة.",
        "permdesc_accessWimaxState": "‏للسماح للتطبيق بتحديد ما إذا تم تفعيل WiMAX وتحديد معلومات حول أي شبكات WiMAX متصلة.",
        "permdesc_access_notification_policy": "للسماح للتطبيق بقراءة تهيئة \\\"عدم الإزعاج\\\" وكتابتها.",
        "permdesc_activityRecognition": "يمكن لهذا التطبيق التعرّف على نشاطك البدني.",
        "permdesc_addVoicemail": "للسماح للتطبيق بإضافة رسائل إلى صندوق البريد الصوتي.",
        "permdesc_answerPhoneCalls": "للسماح للتطبيق بالرد على مكالمة هاتفية واردة.",
        "permdesc_audioWrite": "للسماح للتطبيق بتعديل مجموعتك الموسيقية.",
        "permdesc_bindCarrierMessagingService": "يسمح لحامله بالالتزام بواجهة المستوى العالي لخدمة المراسلة التابعة لمشغل شبكة الجوَّال. ومن المفترض عدم الحاجة إليه مع التطبيقات العادية.",
        "permdesc_bindCarrierServices": "للسماح للمالك بالالتزام بخدمات مشغل شبكة الجوال. لن تكون هناك حاجة إليه مطلقًا مع التطبيقات العادية.",
        "permdesc_bindCellBroadcastService": "يسمح للتطبيق بالارتباط بوحدة البث الخلوي لإعادة توجيه رسائل البث الخلوي بينما يتم استقبالها. ويتم تسليم تنبيهات البث الخلوي في بعض المواقع لتحذيرك في حالات الطوارئ. ويمكن أن تؤثر التطبيقات الضارة على أداء الجهاز أو تشغيله عندما يتم تلقي بث خلوي في حالات الطوارئ.",
        "permdesc_bindConditionProviderService": "للسماح للمالك بالربط بواجهة المستوى العلوي لخدمة موفر الحالة. لن تكون هناك حاجة إلى هذا الإعداد مطلقًا مع التطبيقات العادية.",
        "permdesc_bindDreamService": "‏للسماح للمالك بالالتزام بواجهة المستوى العلوي لخدمة dream. لن تكون هناك حاجة إليه مطلقًا مع التطبيقات العادية.",
        "permdesc_bindNotificationListenerService": "يتيح للمالك الربط بواجهة المستوى العلوي لخدمة تلقّي الإشعارات الصوتية. ولن تكون هناك حاجة إليه مطلقًا مع التطبيقات العادية.",
        "permdesc_bind_connection_service": "للسماح للتطبيق بالتفاعل مع الخدمات الهاتفية لإجراء/تلقي المكالمات.",
        "permdesc_bind_incall_service": "للسماح للتطبيق بالتحكم في وقت وكيفية مشاهدة المستخدم للشاشة أثناء الاتصال.",
        "permdesc_bluetooth": "للسماح للتطبيق بعرض تهيئة البلوتوث على الهاتف وإجراء اتصالات وقبولها مع الأجهزة المقترنة.",
        "permdesc_bluetoothAdmin": "للسماح للتطبيق بتهيئة هاتف البلوتوث المحلي، واكتشاف أجهزة التحكم عن بعد والاقتران بها.",
        "permdesc_bodySensors": "للسماح للتطبيق بالدخول إلى البيانات من أجهزة الاستشعار التي تراقب الحالة البدنية، مثل معدل نبضات القلب.",
        "permdesc_broadcastSticky": "للسماح للتطبيق بإرسال مجموعات بث مستمرة، والتي تظل بعد انتهاء البث. قد يؤدي الاستخدام بكثرة إلى حدوث بطء أو عدم استقرار في الهاتف من خلال التسبب في استخدام الهاتف لمساحة كبيرة للغاية من الذاكرة.",
        "permdesc_callCompanionApp": "يستطيع التطبيق رؤية المكالمات الجارية على الجهاز والتحكّم فيها. ويشمل ذلك معلومات مثل الأرقام وحالة المكالمات.",
        "permdesc_callPhone": "للسماح للتطبيق بطلب أرقام هاتفية بدون تدخل منك. وقد يؤدي ذلك إلى تحمل رسوم غير متوقعة أو إجراء مكالمات غير متوقعة. ومن الجدير بالذكر أن ذلك لا يتيح للتطبيق الاتصال بأرقام الطوارئ. وقد تؤدي التطبيقات الضارة إلى تحملك تكاليف مالية من خلال إجراء مكالمات بدون موافقة منك.",
        "permdesc_camera": "يمكن لهذا التطبيق التقاط صور وتسجيل فيديوهات باستخدام الكاميرا في أي وقت.",
        "permdesc_cameraOpenCloseListener": "يمكن أن يتلقّى هذا التطبيق استدعاءات عندما تكون هناك كاميرا مفتوحة (بواسطة هذا التطبيق) أو مغلقة.",
        "permdesc_changeNetworkState": "للسماح للتطبيق بتغيير حالة اتصال الشبكة.",
        "permdesc_changeTetherState": "للسماح للتطبيق بتغيير حالة اتصال الشبكة المربوطة.",
        "permdesc_changeWifiMulticastState": "‏للسماح للتطبيق بتلقي الحزم التي يتم إرسالها إلى جميع الأجهزة على شبكة Wi-Fi باستخدام عناوين بث متعدد، وليس باستخدام هاتفك فقط. ويؤدي ذلك إلى استخدام قدر أكبر من الطاقة يفوق وضع البث غير المتعدد.",
        "permdesc_changeWifiState": "‏للسماح للتطبيق بالاتصال بنقاط الوصول إلى Wi-Fi وقطع الاتصال بها، وإجراء تغييرات على تهيئة الجهاز لشبكات Wi-Fi.",
        "permdesc_changeWimaxState": "‏للسماح للتطبيق بتوصيل الهاتف بشبكات WiMAX وقطع اتصاله بها.",
        "permdesc_connection_manager": "للسماح للتطبيق بإدارة الاتصالات اللاسلكية.",
        "permdesc_control_incall_experience": "للسماح للتطبيق بتوفير تجربة للمستخدم أثناء الاتصال.",
        "permdesc_createNetworkSockets": "للسماح للتطبيق بإنشاء مقابس شبكات واستخدام بروتوكولات شبكات مخصصة. ويوفر المتصفح وتطبيقات أخرى طرقًا لإرسال البيانات إلى الإنترنت، ولذلك لا يعد هذا الإذن مطلوبًا لإرسال البيانات إلى الإنترنت.",
        "permdesc_disableKeyguard": "للسماح للتطبيق بإيقاف تأمين المفاتيح وأي أمان لكلمة مرور مرتبطة. على سبيل المثال، يعطل الهاتف تأمين المفاتيح عند استقبال مكالمة هاتفية واردة، ثم يعيد تفعيل تأمين المفاتيح عند انتهاء المكالمة.",
        "permdesc_enableCarMode": "للسماح للتطبيق بتمكين وضع السيارة.",
        "permdesc_exemptFromAudioRecordRestrictions": "إعفاء التطبيق من القيود على تسجيل الصوت.",
        "permdesc_expandStatusBar": "للسماح للتطبيق بتوسيع شريط الحالة أو تصغيره.",
        "permdesc_foregroundService": "للسماح للتطبيق بالاستفادة من الخدمات التي تعمل في المقدمة.",
        "permdesc_getAccounts": "للسماح للتطبيق بالحصول على قائمة بالحسابات التي يعرفها الهاتف. وقد يتضمن ذلك أي حسابات تم إنشاؤها بواسطة التطبيقات التي ثبتها.",
        "permdesc_getPackageSize": "للسماح للتطبيق باسترداد شفرته وبياناته وأحجام ذاكرات التخزين المؤقت",
        "permdesc_getTasks": "للسماح للتطبيق باسترداد معلومات حول المهام التي يجري تشغيلها حاليًا والتي تم تشغيلها مؤخرًا. وقد يسمح هذا للتطبيق باكتشاف معلومات حول التطبيقات المستخدمة على الجهاز.",
        "permdesc_handoverStatus": "‏السماح لهذا التطبيق بتلقي معلومات حول عمليات نقل شعاع Android الحالية",
        "permdesc_imagesWrite": "للسماح للتطبيق بتعديل مجموعة صورك.",
        "permdesc_install_shortcut": "للسماح لتطبيق بإضافة اختصارات على الشاشة الرئيسية بدون تدخل المستخدم.",
        "permdesc_invokeCarrierSetup": "للسماح للمالك باستدعاء تطبيق التهيئة الذي يوفره مشغل شبكة الجوال. لن تكون هناك حاجة إليه مطلقًا مع التطبيقات العادية.",
        "permdesc_killBackgroundProcesses": "للسماح للتطبيق بإنهاء عمليات التطبيقات الأخرى في الخلفية. وقد يؤدي هذا إلى توقف تطبيقات أخرى عن العمل.",
        "permdesc_manageFace": "السماح للتطبيق باستدعاء طرق لإضافة نماذج من الوجوه وحذفها.",
        "permdesc_manageFingerprint": "للسماح للتطبيق باستدعاء طرق لإضافة نماذج من بصمات الأصابع وحذفها.",
        "permdesc_manageNetworkPolicy": "للسماح لتطبيق بإدارة سياسات الشبكة وتحديد قواعد متعلقة بالتطبيق.",
        "permdesc_manageOwnCalls": "يسمح للتطبيق بتوجيه المكالمات من خلال النظام لتحسين تجربة الاتصال.",
        "permdesc_manageProfileAndDeviceOwners": "للسماح للتطبيقات بتعيين مالكي الملف الشخصي ومالك الجهاز.",
        "permdesc_mediaLocation": "يسمح للتطبيق بقراءة المواقع من مجموعة الوسائط الخاصة بك.",
        "permdesc_modifyAudioSettings": "للسماح للتطبيق بتعديل إعدادات الصوت العامة مثل مستوى الصوت وأي السماعات يتم استخدامها للاستماع.",
        "permdesc_modifyNetworkAccounting": "للسماح للتطبيق بتعديل كيفية حساب استخدام الشبكة في التطبيقات. ليس للاستخدام بواسطة التطبيقات العادية.",
        "permdesc_nfc": "‏للسماح للتطبيق بالاتصال بعلامات الاتصال قريب المدى (NFC)، والبطاقات وبرامج القراءة.",
        "permdesc_persistentActivity": "للسماح للتطبيق بجعل أجزاء منه ثابتة في الذاكرة. وقد يؤدي هذا إلى تقييد الذاكرة المتاحة للتطبيقات الأخرى مما يؤدي إلى حدوث بطء في الهاتف.",
        "permdesc_preferredPaymentInfo": "‏يسمح هذا الإذن للتطبيق بالحصول على معلومات الخدمات المدفوعة باستخدام الاتصال قصير المدى NFC المفضّل، مثلاً المساعدات المسجّلة ووجهة المسار.",
        "permdesc_processOutgoingCalls": "للسماح للتطبيق بالاطلاع على الرقم الذي يتم الاتصال به عند إجراء مكالمة صادرة مع وجود الخيار لإعادة توجيه المكالمة إلى رقم آخر أو إنهاء المكالمة تمامًا.",
        "permdesc_readCalendar": "يمكن لهذا التطبيق قراءة جميع أحداث التقويم المخزَّنة على الهاتف ومشاركة بيانات التقويم أو حفظها.",
        "permdesc_readCallLog": "يمكن لهذا التطبيق قراءة سجل المكالمات.",
        "permdesc_readCellBroadcasts": "السماح للتطبيق بقراءة رسائل بث الخلية التي يتلقاها هذا الجهاز. يتم تسليم اشعارات بث الخلية في بعض المواقع لتحذيرك من حالات طارئة. يمكن أن تتداخل التطبيقات الضارة مع أداء أو تشغيل الجهاز عندما يتم تلقي بث خلية طارئ.",
        "permdesc_readContacts": "يسمح هذا الإذن للتطبيق بقراءة بيانات حول جهات الاتصال المخزّنة على هاتفك. ويمكن للتطبيقات أيضًا الوصول إلى الحسابات التي تم إنشاء جهات الاتصال من خلالها على هاتفك. ويمكن أن يشمل ذلك الحسابات التي أنشأتها التطبيقات التي ثبتّها. ويتيح هذا الإذن للتطبيقات حفظ بيانات جهة الاتصال، وقد تشارك التطبيقات الضارة بيانات جهة الاتصال بدون علمك.",
        "permdesc_readHistoryBookmarks": "‏للسماح للتطبيق بقراءة سجل جميع عناوين URL التي زارها المتصفح، وجميع الإشارات المرجعية في المتصفح. ملاحظة: لا يجوز فرض هذا الإذن من قِبل متصفحات جهة خارجية أو تطبيقات أخرى تتوفر بها إمكانيات تصفح الويب.",
        "permdesc_readInstallSessions": "للسماح لأحد التطبيقات بقراءة جلسات التثبيت. ويسمح لك هذا بالاطلاع على تفاصيل بشأن عمليات تثبيت الحزم النشطة.",
        "permdesc_readNetworkUsageHistory": "للسماح للتطبيق بقراءة معلومات سابقة عن استخدام الشبكة لشبكات وتطبيقات محددة.",
        "permdesc_readPhoneNumbers": "للسماح للتطبيق بالوصول إلى أرقام الهواتف على هذا الجهاز.",
        "permdesc_readPhoneState": "للسماح للتطبيق بالدخول إلى ميزات الهاتف في الجهاز. ويتيح هذا الإذن للتطبيق تحديد رقم الهاتف ومعرّفات الجهاز، وما إذا كانت هناك مكالمة نشطة والرقم البعيد الذي تم الاتصال به في المكالمة.",
        "permdesc_readSms": "‏يمكن لهذا التطبيق قراءة جميع الرسائل النصية القصيرة (SMS) المخزّنة على الهاتف.",
        "permdesc_readSyncSettings": "للسماح للتطبيق بقراءة الإعدادات المتزامنة لحساب ما. على سبيل المثال، يمكن أن يؤدي هذا إلى تحديد ما إذا تمت مزامنة تطبيق \\\"الأشخاص\\\" مع حساب ما.",
        "permdesc_readSyncStats": "للسماح للتطبيق بقراءة إحصائيات المزامنة لحساب ما، بما في ذلك سجل الأحداث المتزامنة ومقدار البيانات التي تمت مزامنتها.",
        "permdesc_receiveBootCompleted": "للسماح للتطبيق ببدء تشغيل نفسه عقب انتهاء النظام من التشغيل. قد يؤدي ذلك إلى استغراق المزيد من الوقت عن بدء الهاتف والسماح للتطبيق بإبطاء الأداء الإجمالي للهاتف حيث يتم تشغيله دائمًا.",
        "permdesc_receiveMms": "للسماح للتطبيق بتلقي ومعالجة رسائل الوسائط المتعددة. وهذا يعني أنه يمكن للتطبيق مراقبة الرسائل التي يتم إرسالها لجهازك أو حذفها بدون عرضها لك.",
        "permdesc_receiveSms": "‏للسماح للتطبيق بتلقي ومعالجة الرسائل القصيرة SMS. وهذا يعني أنه يمكن للتطبيق مراقبة الرسائل التي يتم إرسالها إلى جهازك أو حذفها بدون عرضها لك.",
        "permdesc_receiveWapPush": "‏للسماح للتطبيق بتلقي رسائل WAP ومعالجتها. ويتضمن هذا الإذن إمكانية مراقبة الرسائل التي يتم إرسالها إليك أو حذفها بدون عرضها لك.",
        "permdesc_recordAudio": "يمكن لهذا التطبيق تسجيل الصوت باستخدام الميكروفون في أي وقت.",
        "permdesc_register_call_provider": "للسماح للتطبيق بتسجيل الاتصالات اللاسلكية الجديدة.",
        "permdesc_register_sim_subscription": "‏للسماح للتطبيق بتسجيل اتصالات SIM اللاسلكية الجديدة.",
        "permdesc_removeDrmCertificates": "‏للسماح لأحد التطبيقات بإزالة شهادات DRM. لن تكون هناك حاجة إليه مطلقًا مع التطبيقات العادية.",
        "permdesc_reorderTasks": "للسماح للتطبيق بنقل المهام إلى المقدمة والخلفية. وقد يجري التطبيق ذلك بدون إذنك.",
        "permdesc_requestDeletePackages": "للسماح لتطبيق ما بطلب حذف الحِزم.",
        "permdesc_requestIgnoreBatteryOptimizations": "للسماح للتطبيق بطلب الإذن لتجاهل تحسينات البطارية في هذا التطبيق.",
        "permdesc_requestInstallPackages": "للسماح لتطبيق ما بطلب تثبيت الحزم.",
        "permdesc_requestPasswordComplexity": "يسمح للتطبيق بمعرفة مستوى صعوبة قفل الشاشة (عالي أو متوسط أو منخفض الصعوبة أو بدون)، والذي يحدّد النطاق المحتمل لطول ونوع قفل الشاشة. ويمكن أن يقترح التطبيق للمستخدمين أيضًا تعديل قفل الشاشة إلى مستوى معيّن، ولهم مطلق الحرية في تجاهل هذا الاقتراح ورفضه. وتجدر الإشارة إلى أنه لا يتم حفظ قفل الشاشة في نص عادي، لذا لا يعرف التطبيق كلمة المرور تحديدًا.",
        "permdesc_route_media_output": "للسماح للتطبيق بتوجيه إخراج الوسائط إلى أجهزة خارجية أخرى.",
        "permdesc_runInBackground": "يمكن أن يعمل هذا التطبيق في الخلفية. وهذا قد يستنفد البطارية بشكل أسرع.",
        "permdesc_sdcardRead": "للسماح للتطبيق بقراءة محتوى مساحة التخزين المشتركة.",
        "permdesc_sdcardWrite": "للسماح للتطبيق بالكتابة إلى محتوى مساحة التخزين المشتركة.",
        "permdesc_sendSms": "‏للسماح للتطبيق بإرسال رسائل قصيرة SMS. وقد يؤدي هذا إلى تحمل رسوم غير متوقعة. وقد تكلفك التطبيقات الضارة أموالاً من خلال إرسال رسائل بدون موافقة منك.",
        "permdesc_setAlarm": "للسماح للتطبيق بضبط المنبّه في تطبيق المنبّه المثبّت. ربما لا تنفذ بعض تطبيقات المنبّه هذه الميزة.",
        "permdesc_setInputCalibration": "يتيح للتطبيق إمكانية تعديل معلمات المعايرة في شاشة اللمس. يجب عدم اللجوء إليه مع التطبيقات العادية.",
        "permdesc_setTimeZone": "للسماح للتطبيق بتغيير المنطقة الزمنية للهاتف.",
        "permdesc_setWallpaper": "للسماح للتطبيق بتعيين خلفية النظام.",
        "permdesc_setWallpaperHints": "للسماح للتطبيق بتعيين تلميحات حجم خلفية النظام.",
        "permdesc_sim_communication": "‏السماح للتطبيق بإرسال أوامر إلى شريحة SIM. وهذا أمر بالغ الخطورة.",
        "permdesc_startViewPermissionUsage": "يسمح للمالك ببدء استخدام التصريح لأحد التطبيقات. ليس هناك حاجة إليه مطلقًا مع التطبيقات العادية.",
        "permdesc_statusBar": "للسماح للتطبيق بإيقاف شريط الحالة أو إضافة رموز نظام وإزالتها.",
        "permdesc_statusBarService": "للسماح للتطبيق بأن يكون شريط الحالة.",
        "permdesc_subscribedFeedsRead": "للسماح للتطبيق بالحصول على تفاصيل حول الخلاصات المتزامنة في الوقت الحالي.",
        "permdesc_systemAlertWindow": "يمكن لهذا التطبيق الظهور في مقدمة التطبيقات أو أجزاء الشاشة الأخرى. وقد يتداخل هذا مع الاستخدام العادي للتطبيقات أو يؤدي إلى تغيير طريقة ظهور التطبيقات الأخرى.",
        "permdesc_systemCamera": "‏إنّ تطبيق النظام هذا، أو التطبيق المزوّد بأذونات مميّزة، يمكنه التقاط صور وتسجيل فيديوهات باستخدام كاميرا النظام في أي وقت. ويجب أن يحصل التطبيق أيضًا على الإذن android.permission.CAMERA",
        "permdesc_transmitIr": "للسماح للتطبيق باستخدام مرسل الأشعة تحت الحمراء الخاص بالهاتف.",
        "permdesc_uninstall_shortcut": "للسماح للتطبيق بإزالة اختصارات من الشاشة الرئيسية بدون تدخل المستخدم.",
        "permdesc_useBiometric": "للسماح للتطبيق باستخدام الأجهزة البيومترية للمصادقة",
        "permdesc_useDataInBackground": "يمكن أن يستخدم هذا التطبيق البيانات في الخلفية. وهذا قد يؤدي إلى زيادة استخدام البيانات.",
        "permdesc_useFaceAuthentication": "السماح للتطبيق باستخدام أجهزة \\\"فتح القفل بالوجه\\\" لإجراء المصادقة",
        "permdesc_useFingerprint": "للسماح للتطبيق باستخدام أجهزة بصمة الإصبع للمصادقة",
        "permdesc_use_sip": "‏للسماح للتطبيق بإجراء مكالمات SIP وتلقيها.",
        "permdesc_vibrate": "للسماح للتطبيق بالتحكم في الهزّاز.",
        "permdesc_vibrator_state": "يسمح هذا الإذن للتطبيق بالوصول إلى حالة الهزّاز.",
        "permdesc_videoWrite": "يسمح للتطبيق بتعديل مجموعة الفيديوهات الخاصة بك.",
        "permdesc_wakeLock": "للسماح للتطبيق بمنع الهاتف من الانتقال إلى وضع السكون.",
        "permdesc_writeCalendar": "يمكن لهذا التطبيق إضافة أحداث تقويم أو إزالتها أو تغييرها على الهاتف. كما يمكنه إرسال رسائل يبدو أنها واردة من مالكي التقويم، ويمكنه كذلك تغيير الأحداث بدون إشعار مالكيها.",
        "permdesc_writeCallLog": "للسماح للتطبيق بتعديل سجل مكالمات الهاتف، بما في ذلك البيانات عن المكالمات الواردة والصادرة. وربما تستخدم التطبيقات الضارة هذا لمحو سجل المكالمات أو تعديله.",
        "permdesc_writeContacts": "يسمح هذا الإذن للتطبيق بتعديل البيانات حول جهات الاتصال المخزّنة على هاتفك. ويسمح هذا الإذن للتطبيقات بحذف بيانات جهات الاتصال.",
        "permdesc_writeGeolocationPermissions": "للسماح لأحد التطبيقات بتعديل أذونات الموقع الجغرافي للمتصفح. يمكن أن تستخدم التطبيقات الضارة هذا للسماح بإرسال معلومات الموقع إلى مواقع ويب عشوائية.",
        "permdesc_writeHistoryBookmarks": "للسماح للتطبيق بتعديل سجل المتصفح أو الإشارات المرجعية المخزنة على هاتفك. وقد يتيح هذا للتطبيق محو بيانات المتصفح أو تعديلها. ملاحظة: لا يجوز فرض هذا الإذن من قِبل متصفحات جهات خارجية أو تطبيقات أخرى بها إمكانيات تصفح الويب.",
        "permdesc_writeSettings": "للسماح للتطبيق بتعديل بيانات إعدادات النظام. يمكن أن تتلف التطبيقات الضارة تهيئة نظامك.",
        "permdesc_writeSyncSettings": "للسماح للتطبيق بتعديل إعدادات المزامنة لحساب ما. على سبيل المثال، يمكن استخدام ذلك لتمكين مزامنة تطبيق \\\"الأشخاص\\\" مع حساب ما.",
        "permgroupbackgroundrequest_location": "السماح للتطبيق بطلب الموقع في الخلفية.",
        "permgroupbackgroundrequestdetail_location": "لا يمكن للتطبيق الآن النفاذ إلى الموقع الجغرافي إلا عند استخدامك للتطبيق",
        "permgroupdesc_activityRecognition": "الوصول إلى بيانات نشاطك البدني",
        "permgroupdesc_calendar": "الوصول تقويمك",
        "permgroupdesc_calllog": "قراءة سجلّ المكالمات الهاتفية والكتابة إليه",
        "permgroupdesc_camera": "التقاط صور وتسجيل فيديو",
        "permgroupdesc_contacts": "الوصول إلى جهات اتصالك",
        "permgroupdesc_location": "الوصول إلى موقع هذا الجهاز",
        "permgroupdesc_microphone": "تسجيل الصوت",
        "permgroupdesc_phone": "إجراء مكالمات هاتفية وإدارتها",
        "permgroupdesc_sensors": "الوصول إلى بيانات المستشعر حول علاماتك الحيوية",
        "permgroupdesc_sms": "‏إرسال رسائل قصيرة SMS وعرضها",
        "permgroupdesc_storage": "الوصول إلى الصور والوسائط والملفات على جهازك",
        "permgrouplab_activityRecognition": "النشاط البدني",
        "permgrouplab_calendar": "التقويم",
        "permgrouplab_calllog": "سجلّ المكالمات",
        "permgrouplab_camera": "الكاميرا",
        "permgrouplab_contacts": "جهات الاتصال",
        "permgrouplab_location": "الموقع الجغرافي",
        "permgrouplab_microphone": "الميكروفون",
        "permgrouplab_phone": "الهاتف",
        "permgrouplab_sensors": "أجهزة استشعار الجسم",
        "permgrouplab_sms": "SMS",
        "permgrouplab_storage": "التخزين",
        "permgrouprequest_activityRecognition": "‏السماح للتطبيق بتتبع نشاطك.",
        "permgrouprequest_calendar": "‏هل تريد السماح لتطبيق <b>",
        "permgrouprequest_calllog": "‏هل تريد السماح لتطبيق <b>",
        "permgrouprequest_camera": "‏هل تريد السماح لخدمة <b>",
        "permgrouprequest_contacts": "‏هل تريد السماح لتطبيق <b>",
        "permgrouprequest_location": "‏هل تريد السماح لتطبيق <b>",
        "permgrouprequest_microphone": "‏هل تريد السماح لـ <b>",
        "permgrouprequest_phone": "‏هل تريد السماح لـ <b>",
        "permgrouprequest_sensors": "‏هل تريد السماح لتطبيق <b>",
        "permgrouprequest_sms": "‏هل تريد السماح لتطبيق <b>",
        "permgrouprequest_storage": "‏هل تريد السماح لتطبيق <b>",
        "permgrouprequestdetail_location": "لن يكون بإمكان التطبيق الوصول إلى الموقع الجغرافي إلا عند استخدامك لهذا التطبيق",
        "permlab_acceptHandover": "مواصلة مكالمة من تطبيق آخر",
        "permlab_accessBackgroundLocation": "الوصول إلى الموقع الجغرافي في الخلفية",
        "permlab_accessCoarseLocation": "الوصول إلى الموقع الجغرافي التقريبي في الواجهة الأمامية فقط",
        "permlab_accessDrmCertificates": "‏الدخول إلى شهادات DRM",
        "permlab_accessFineLocation": "الوصول إلى الموقع الجغرافي الدقيق في الواجهة الأمامية فقط",
        "permlab_accessImsCallService": "الوصول إلى خدمة الاتصال عبر الرسائل الفورية",
        "permlab_accessLocationExtraCommands": "الدخول إلى المزيد من أوامر موفر الموقع",
        "permlab_accessNetworkConditions": "الاستماع إلى ملاحظات حول أحوال الشبكة",
        "permlab_accessNetworkState": "عرض اتصالات الشبكة",
        "permlab_accessNotifications": "إشعارات الدخول",
        "permlab_accessWifiState": "‏عرض اتصالات Wi-Fi",
        "permlab_accessWimaxState": "‏الاتصال بشبكة WiMAX وقطع الاتصال منها",
        "permlab_access_notification_policy": "الوصول إلى إعداد \\\"عدم الإزعاج\\",
        "permlab_activityRecognition": "التعرّف على النشاط البدني",
        "permlab_addVoicemail": "إضافة بريد صوتي",
        "permlab_answerPhoneCalls": "الرد على المكالمات الهاتفية",
        "permlab_audioWrite": "تعديل مجموعتك الموسيقية",
        "permlab_bindCarrierMessagingService": "الالتزام بخدمة المراسلة التابعة لمشغل شبكة الجوّال",
        "permlab_bindCarrierServices": "الالتزام بخدمات مشغل شبكة الجوال",
        "permlab_bindCellBroadcastService": "إعادة توجيه رسائل البث الخلوي",
        "permlab_bindConditionProviderService": "الربط بخدمة موفر الحالة",
        "permlab_bindDreamService": "‏الالتزام بخدمة dream",
        "permlab_bindNotificationListenerService": "الربط بخدمة تلقّي الإشعارات الصوتية",
        "permlab_bind_connection_service": "التفاعل مع الخدمات الهاتفية",
        "permlab_bind_incall_service": "التفاعل مع الشاشة أثناء الاتصال",
        "permlab_bluetooth": "الاتصال بأجهزة بلوتوث",
        "permlab_bluetoothAdmin": "الدخول إلى إعدادات بلوتوث",
        "permlab_bodySensors": "الوصول إلى أجهزة استشعار الجسم (مثل شاشات معدل ضربات القلب)",
        "permlab_broadcastSticky": "إرسال بث طويل الزيارة",
        "permlab_callCompanionApp": "رؤية المكالمات والتحكّم فيها من خلال النظام.",
        "permlab_callPhone": "اتصال مباشر بأرقام الهواتف",
        "permlab_camera": "التقاط صور وفيديوهات",
        "permlab_cameraOpenCloseListener": "يسمح الإذن لتطبيق أو خدمة بتلقّي استدعاءات عما إذا كانت أجهزة الكاميرات مفتوحة أو مغلقة.",
        "permlab_changeNetworkState": "تغيير اتصال الشبكة",
        "permlab_changeTetherState": "تغيير الاتصال المربوط",
        "permlab_changeWifiMulticastState": "‏السماح باستقبال بث Wi-Fi متعدد",
        "permlab_changeWifiState": "‏التوصيل والفصل من Wi-Fi",
        "permlab_changeWimaxState": "‏تغيير حالة WiMAX",
        "permlab_connection_manager": "إدارة الاتصالات اللاسلكية",
        "permlab_control_incall_experience": "توفير تجربة للمستخدم أثناء الاتصال",
        "permlab_createNetworkSockets": "حق الوصول الكامل إلى الشبكة",
        "permlab_disableKeyguard": "إيقاف قفل الشاشة",
        "permlab_enableCarMode": "تفعيل وضع السيارة",
        "permlab_exemptFromAudioRecordRestrictions": "الإعفاء من القيود على تسجيل الصوت",
        "permlab_expandStatusBar": "توسيع/تصغير شريط الحالة",
        "permlab_foregroundService": "تشغيل الخدمة في المقدمة",
        "permlab_getAccounts": "البحث عن حسابات على الجهاز",
        "permlab_getPackageSize": "قياس مساحة تخزين التطبيق",
        "permlab_getTasks": "استرداد التطبيقات التي قيد التشغيل",
        "permlab_handoverStatus": "‏تلقي حالة نقل شعاع Android",
        "permlab_imagesWrite": "تعديل مجموعة صورك",
        "permlab_install_shortcut": "تثبيت اختصارات",
        "permlab_invokeCarrierSetup": "استدعاء تطبيق التهيئة الذي يوفره مشغل شبكة الجوال",
        "permlab_killBackgroundProcesses": "إغلاق التطبيقات الأخرى",
        "permlab_manageFace": "إدارة أجهزة \\\"فتح القفل بالوجه\\",
        "permlab_manageFingerprint": "لإدارة أجهزة بصمة الإصبع",
        "permlab_manageNetworkPolicy": "إدارة سياسة الشبكة",
        "permlab_manageOwnCalls": "توجيه المكالمات من خلال النظام",
        "permlab_manageProfileAndDeviceOwners": "إدارة الملف الشخصي ومالكي الجهاز",
        "permlab_mediaLocation": "قراءة المواقع من مجموعة الوسائط الخاصة بك",
        "permlab_modifyAudioSettings": "تغيير إعداداتك الصوتية",
        "permlab_modifyNetworkAccounting": "تعديل حساب استخدام الشبكة",
        "permlab_nfc": "التحكم في اتصال الحقل القريب",
        "permlab_persistentActivity": "تشغيل التطبيق دائمًا",
        "permlab_preferredPaymentInfo": "‏معلومات الخدمات المدفوعة باستخدام الاتصال قصير المدى NFC المفضّل",
        "permlab_processOutgoingCalls": "إعادة توجيه المكالمات الصادرة",
        "permlab_readCalendar": "قراءة أحداث التقويم والتفاصيل",
        "permlab_readCallLog": "قراءة سجل المكالمات",
        "permlab_readCellBroadcasts": "قراءة رسائل بث الخلية",
        "permlab_readContacts": "قراءة جهات الاتصال",
        "permlab_readHistoryBookmarks": "قراءة إشارات ويب والسجل",
        "permlab_readInstallSessions": "قراءة جلسات التثبيت",
        "permlab_readNetworkUsageHistory": "قراءة بيانات الاستخدام السابقة للشبكة",
        "permlab_readPhoneNumbers": "قراءة أرقام الهواتف",
        "permlab_readPhoneState": "قراءة حالة الهاتف والهوية",
        "permlab_readSms": "‏قراءة الرسائل النصية (الرسائل القصيرة SMS أو رسائل الوسائط المتعددة)",
        "permlab_readSyncSettings": "قراءة إعدادات المزامنة",
        "permlab_readSyncStats": "قراءة إحصاءات المزامنة",
        "permlab_receiveBootCompleted": "العمل عند بدء التشغيل",
        "permlab_receiveMms": "تلقي رسائل نصية (رسائل وسائط متعددة)",
        "permlab_receiveSms": "‏تلقي رسائل نصية (رسائل قصيرة SMS)",
        "permlab_receiveWapPush": "‏تلقي رسائل نصية (WAP)",
        "permlab_recordAudio": "تسجيل الصوت",
        "permlab_register_call_provider": "تسجيل الاتصالات اللاسلكية الجديدة",
        "permlab_register_sim_subscription": "‏تسجيل اتصالات SIM اللاسلكية الجديدة",
        "permlab_removeDrmCertificates": "‏إزالة شهادات DRM",
        "permlab_reorderTasks": "إعادة ترتيب التطبيقات قيد التشغيل",
        "permlab_requestDeletePackages": "طلب حذف الحِزم",
        "permlab_requestIgnoreBatteryOptimizations": "طلب تجاهل تحسينات البطارية",
        "permlab_requestInstallPackages": "طلب حزم التثبيت",
        "permlab_requestPasswordComplexity": "طلب معرفة مستوى صعوبة قفل الشاشة",
        "permlab_route_media_output": "توجيه إخراج الوسائط",
        "permlab_runInBackground": "العمل في الخلفية",
        "permlab_sdcardRead": "قراءة محتوى مساحة التخزين المشتركة",
        "permlab_sdcardWrite": "تعديل محتوى مساحة التخزين المشتركة أو حذفه",
        "permlab_sendSms": "‏إرسال رسائل قصيرة SMS وعرضها",
        "permlab_setAlarm": "تعيين منبه",
        "permlab_setInputCalibration": "تغيير معايرة أجهزة الإدخال",
        "permlab_setTimeZone": "تعيين المنطقة الزمنية",
        "permlab_setWallpaper": "تعيين الخلفية",
        "permlab_setWallpaperHints": "تعديل حجم الخلفية",
        "permlab_sim_communication": "‏إرسال أوامر إلى شريحة SIM",
        "permlab_startViewPermissionUsage": "بدء استخدام تصريح العرض",
        "permlab_statusBar": "إيقاف شريط الحالة أو تعديله",
        "permlab_statusBarService": "العمل كشريط للحالة",
        "permlab_subscribedFeedsRead": "قراءة الخلاصات المشتركة",
        "permlab_systemAlertWindow": "يمكن لهذا التطبيق الظهور في مقدمة التطبيقات الأخرى",
        "permlab_systemCamera": "السماح لتطبيق أو خدمة بالوصول إلى كاميرات النظام لالتقاط صور وتسجيل فيديوهات",
        "permlab_transmitIr": "إرسال الأشعة تحت الحمراء",
        "permlab_uninstall_shortcut": "إزالة الاختصارات",
        "permlab_useBiometric": "استخدام الأجهزة البيومترية",
        "permlab_useDataInBackground": "استخدام البيانات في الخلفية",
        "permlab_useFaceAuthentication": "استخدام أجهزة \\\"فتح القفل بالوجه\\",
        "permlab_useFingerprint": "لاستخدام أجهزة بصمة الإصبع",
        "permlab_use_sip": "‏إجراء/تلقي مكالمات SIP",
        "permlab_vibrate": "التحكم في الاهتزاز",
        "permlab_videoWrite": "تعديل مجموعة فيديوهاتك",
        "permlab_wakeLock": "منع الهاتف من الدخول في وضع السكون",
        "permlab_writeCalendar": "إضافة أو تعديل أحداث التقويم وإرسال رسالة إلكترونية إلى المدعوين بدون معرفة المالكين",
        "permlab_writeCallLog": "كتابة سجل المكالمات",
        "permlab_writeContacts": "تعديل جهات الاتصال",
        "permlab_writeGeolocationPermissions": "تعديل أذونات الموقع الجغرافي للمتصفح",
        "permlab_writeHistoryBookmarks": "كتابة إشارات ويب والسجل",
        "permlab_writeSettings": "تعديل إعدادات النظام",
        "permlab_writeSyncSettings": "التبديل بين تشغيل المزامنة وإيقافها"
    },
    "sidebars": {
        "donate": {
            "bank_transfer_name": "الإسم",
            "bitcoin_alt": "تبرع بالبيتكوين",
            "flattr_alt": "تبرع عبر فلاتر",
            "heading": "تبرع",
            "hellotux": "👕 أقمصة 👕 مِن",
            "hellotux_alt": "HELLOTUX",
            "hellotux_donation": "F-Droid سوف يتلقى 3 يورو لكل قميص يباع.",
            "liberapay_alt": "تبرع عبر Liberapay",
            "litecoin_alt": "التبرع عبر اللايت كُوين",
            "opencollective_alt": "تبرع لمجموعتنا",
            "paypal_alt": "تبرع عبر بايبال",
            "powered_by_donations": "إنَّ F-Droid مدعوم بتبرعاتكم !",
            "via_bank_transfer": "تحويل بنكي"
        },
        "lang": {
            "change": "تغيير"
        },
        "last_updated": {
            "heading": "آخر تحديث"
        },
        "latest_packages": {
            "heading": "أحدث التطبيقات"
        },
        "news": {
            "heading": "الأخبار"
        },
        "search": {
            "heading": "إبحث عن تطبيقات",
            "noscript": "تتطلب تفعيل جافا سكريبت",
            "search": "ابحث"
        }
    }
}
