EESchema Schematic File Version 4
EELAYER 30 0
EELAYER END
$Descr A 11000 8500
encoding utf-8
Sheet 1 1
Title "Proximity Sensor"
Date "2022-03-07"
Rev "1.5"
Comp "Charger Robotics Team 3786"
Comment1 ""
Comment2 ""
Comment3 ""
Comment4 "Nicholas L."
$EndDescr
$Comp
L MCU_Microchip_ATtiny:ATtiny85-20PU U1
U 1 1 6222D361
P 1750 1600
F 0 "U1" H 1221 1646 50  0000 R CNN
F 1 "ATtiny85-20PU" H 1221 1555 50  0000 R CNN
F 2 "Package_DIP:DIP-8_W7.62mm" H 1750 1600 50  0001 C CIN
F 3 "http://ww1.microchip.com/downloads/en/DeviceDoc/atmel-2586-avr-8-bit-microcontroller-attiny25-attiny45-attiny85_datasheet.pdf" H 1750 1600 50  0001 C CNN
	1    1750 1600
	1    0    0    -1  
$EndComp
Text GLabel 2850 1600 2    50   Input ~ 0
ANALOG_IN
Text GLabel 2850 1700 2    50   Input ~ 0
DIGITAL_OUT
$Comp
L Connector:Conn_01x03_Male J1
U 1 1 6222E3DD
P 3100 900
F 0 "J1" V 3162 712 50  0000 R CNN
F 1 "Conn_01x03_Male" V 3253 712 50  0000 R CNN
F 2 "" H 3100 900 50  0001 C CNN
F 3 "~" H 3100 900 50  0001 C CNN
	1    3100 900 
	0    -1   1    0   
$EndComp
$Comp
L power:+5V #PWR01
U 1 1 62230F5D
P 1750 900
F 0 "#PWR01" H 1750 750 50  0001 C CNN
F 1 "+5V" H 1765 1073 50  0000 C CNN
F 2 "" H 1750 900 50  0001 C CNN
F 3 "" H 1750 900 50  0001 C CNN
	1    1750 900 
	1    0    0    -1  
$EndComp
$Comp
L power:GND #PWR05
U 1 1 6223213D
P 1750 2300
F 0 "#PWR05" H 1750 2050 50  0001 C CNN
F 1 "GND" H 1755 2127 50  0000 C CNN
F 2 "" H 1750 2300 50  0001 C CNN
F 3 "" H 1750 2300 50  0001 C CNN
	1    1750 2300
	1    0    0    -1  
$EndComp
$Comp
L Connector:Conn_01x06_Male J2
U 1 1 62232BAB
P 5150 1500
F 0 "J2" H 5122 1474 50  0000 R CNN
F 1 "Conn_01x06_Male" H 5122 1383 50  0000 R CNN
F 2 "Connector_PinSocket_2.54mm:PinSocket_2x03_P2.54mm_Vertical" H 5150 1500 50  0001 C CNN
F 3 "~" H 5150 1500 50  0001 C CNN
	1    5150 1500
	-1   0    0    -1  
$EndComp
Text Notes 2800 850  0    50   ~ 0
RoboRIO Header
Text Notes 4700 1950 0    50   ~ 0
ISP Program Header
Wire Wire Line
	1750 900  1750 950 
Wire Wire Line
	1750 2200 1750 2300
Wire Wire Line
	2850 1700 2750 1700
Wire Wire Line
	2350 1600 2850 1600
Wire Wire Line
	2550 1150 2550 950 
Wire Wire Line
	2550 950  1750 950 
Connection ~ 1750 950 
Wire Wire Line
	1750 950  1750 1000
$Comp
L power:GND #PWR02
U 1 1 62238A9A
P 3000 1250
F 0 "#PWR02" H 3000 1000 50  0001 C CNN
F 1 "GND" H 3005 1077 50  0000 C CNN
F 2 "" H 3000 1250 50  0001 C CNN
F 3 "" H 3000 1250 50  0001 C CNN
	1    3000 1250
	1    0    0    -1  
$EndComp
Wire Wire Line
	2750 1700 2750 1500
Wire Wire Line
	2750 1500 3200 1500
Wire Wire Line
	3200 1500 3200 1100
Connection ~ 2750 1700
Wire Wire Line
	2750 1700 2350 1700
$Comp
L power:+5V #PWR03
U 1 1 6223AAF2
P 4600 1400
F 0 "#PWR03" H 4600 1250 50  0001 C CNN
F 1 "+5V" H 4615 1573 50  0000 C CNN
F 2 "" H 4600 1400 50  0001 C CNN
F 3 "" H 4600 1400 50  0001 C CNN
	1    4600 1400
	1    0    0    -1  
$EndComp
$Comp
L power:GND #PWR04
U 1 1 6223BCAA
P 4600 1800
F 0 "#PWR04" H 4600 1550 50  0001 C CNN
F 1 "GND" H 4605 1627 50  0000 C CNN
F 2 "" H 4600 1800 50  0001 C CNN
F 3 "" H 4600 1800 50  0001 C CNN
	1    4600 1800
	1    0    0    -1  
$EndComp
Wire Wire Line
	4950 1400 4600 1400
Wire Wire Line
	4600 1800 4950 1800
Text Label 2350 1300 0    50   ~ 0
MOSI
Text Label 2350 1400 0    50   ~ 0
MISO
Text Label 2350 1500 0    50   ~ 0
SCK
Text Label 2350 1800 0    50   ~ 0
~RESET
Text Label 4950 1300 2    50   ~ 0
MISO
Text Label 4950 1500 2    50   ~ 0
SCK
Text Label 4950 1600 2    50   ~ 0
MOSI
Text Label 4950 1700 2    50   ~ 0
~RESET
$Comp
L Sensor_Proximity:ITR1201SR10AR U2
U 1 1 6225007D
P 1700 4200
F 0 "U2" H 1700 4517 50  0000 C CNN
F 1 "ITR20001\\T" H 1700 4426 50  0000 C CNN
F 2 "OptoDevice:Everlight_ITR1201SR10AR" H 1700 4000 50  0001 C CNN
F 3 "http://www.everlight.com/file/ProductFile/ITR1201SR10AR-TR.pdf" H 1700 4300 50  0001 C CNN
	1    1700 4200
	1    0    0    -1  
$EndComp
$Comp
L Device:R R1
U 1 1 6225315C
P 1150 3950
F 0 "R1" H 1220 3996 50  0000 L CNN
F 1 "220" H 1220 3905 50  0000 L CNN
F 2 "" V 1080 3950 50  0001 C CNN
F 3 "~" H 1150 3950 50  0001 C CNN
	1    1150 3950
	1    0    0    -1  
$EndComp
$Comp
L power:GND #PWR07
U 1 1 6225597A
P 1400 4600
F 0 "#PWR07" H 1400 4350 50  0001 C CNN
F 1 "GND" H 1405 4427 50  0000 C CNN
F 2 "" H 1400 4600 50  0001 C CNN
F 3 "" H 1400 4600 50  0001 C CNN
	1    1400 4600
	1    0    0    -1  
$EndComp
$Comp
L power:+5V #PWR06
U 1 1 62256638
P 1700 3500
F 0 "#PWR06" H 1700 3350 50  0001 C CNN
F 1 "+5V" H 1715 3673 50  0000 C CNN
F 2 "" H 1700 3500 50  0001 C CNN
F 3 "" H 1700 3500 50  0001 C CNN
	1    1700 3500
	1    0    0    -1  
$EndComp
Wire Wire Line
	1150 4100 1400 4100
Wire Wire Line
	1150 3800 1150 3650
Wire Wire Line
	1150 3650 1700 3650
Wire Wire Line
	1700 3650 1700 3500
Wire Wire Line
	1700 3650 2250 3650
Wire Wire Line
	2250 3650 2250 4100
Wire Wire Line
	2250 4100 2000 4100
Connection ~ 1700 3650
Text GLabel 2250 4300 2    50   Input ~ 0
ANALOG_IN
Text Notes 1100 4900 0    50   ~ 0
Proximity Sensor
Wire Notes Line
	500  2800 6300 2800
Wire Notes Line
	500  6300 6300 6300
Wire Notes Line
	6300 500  6300 6300
Wire Wire Line
	3000 1100 3000 1250
Wire Wire Line
	2550 1150 3100 1150
Wire Wire Line
	3100 1150 3100 1100
$Comp
L power:GND #PWR?
U 1 1 6226EE09
P 2400 4600
F 0 "#PWR?" H 2400 4350 50  0001 C CNN
F 1 "GND" H 2405 4427 50  0000 C CNN
F 2 "" H 2400 4600 50  0001 C CNN
F 3 "" H 2400 4600 50  0001 C CNN
	1    2400 4600
	1    0    0    -1  
$EndComp
Wire Wire Line
	1400 4300 1400 4600
$Comp
L Device:R_POT RV?
U 1 1 6227236A
P 2100 4500
F 0 "RV?" V 1985 4500 50  0000 C CNN
F 1 "R_POT" V 1894 4500 50  0000 C CNN
F 2 "" H 2100 4500 50  0001 C CNN
F 3 "~" H 2100 4500 50  0001 C CNN
	1    2100 4500
	0    -1   -1   0   
$EndComp
Wire Wire Line
	2000 4300 2100 4300
NoConn ~ 1950 4500
Wire Wire Line
	2100 4350 2100 4300
Connection ~ 2100 4300
Wire Wire Line
	2100 4300 2250 4300
Wire Wire Line
	2250 4500 2400 4500
Wire Wire Line
	2400 4500 2400 4600
$EndSCHEMATC
