{
    "views": {
        "confirm_button": {
            "resource_id": ".*id/confirm_button"
        },
        "agree_checkbox": {
            "resource_id": ".*id/checkBox",
            "class": ".*CheckBox"
        },
        "start_button": {
            "resource_id": ".*id/tutorialStartButton",
            "class": ".*ViewGroup"
        },
        "marketing_confirm_button": {
            "resource_id": ".*id/positiveButton"
        },
        "address_search_edittext": {
            "resource_id": ".*id/search_keyword_edittext"
        },
        "address_search_keyword_button": {
            "resource_id": ".*id/search_keyword_button"
        },
        "address_title_textview": {
            "resource_id": ".*id/address_title_textvew"
        },
        "detail_address_edittext": {
            "resource_id": ".*id/detail_address_edittext",
            "class": ".*EditText"
        },
        "detail_address_confirm_button": {
            "resource_id": ".*id/detail_address_confirm_button",
            "class": ".*Button"
        },
        "id_edittext": {
            "resource_id": ".*id/input_edittext",
            "class": ".*EditText",
            "is_password": false
        },
        "password_edittext": {
            "resource_id": ".*id/input_edittext",
            "class": ".*EditText",
            "is_password": true
        },
        "login_button": {
            "resource_id": ".*id/login_button"
        }
    },
    "states": {
        "permission_state": {
            "activity": ".*com.baemin.presentation.ui.home.HomeActivity",
            "views": ["confirm_button"]
        },
        "welcome_state": {
            "activity": ".*com.baemin.presentation.ui.tutorial.TutorialActivity",
            "views": ["agree_checkbox"]
        },
        "address_state": {
            "activity": ".*com.baemin.presentation.ui.location.LocationActivity",
            "views": ["address_search_edittext"] 
        },
        "login_state": {
            "activity": ".*com.baemin.presentation.ui.user.login.LoginActivity",
            "views": ["login_button"] 
        }
    },
    "operations": {
        "permission_operation": [
            {
                "event_type": "touch",
                "target_view": "confirm_button"
            }
        ],
        "welcome_operation": [
            {
                "event_type": "touch",
                "target_view": "agree_checkbox"
            },
            {
                "event_type": "touch",
                "target_view": "start_button"
            },
            {
                "event_type": "touch",
                "target_view": "marketing_confirm_button"
            }
        ],
        "address_operation": [
            {
                "event_type": "set_text",
                "target_view": "address_search_edittext",
                "text": "jamsil"
            },
            {
                "event_type": "touch",
                "target_view": "address_search_keyword_button"
            },
            {
                "event_type": "touch",
                "target_view": "address_title_textview"
            },
            {
                "event_type": "touch",
                "target_view": "detail_address_confirm_button"
            }
        ],
        "login_operation": [
            {
                "event_type": "set_text",
                "target_view": "id_edittext",
                "text": "testfarm00@testfarm.com"
            },
            {
                "event_type": "set_text",
                "target_view": "password_edittext",
                "text": "xptmxmvka00"
            },
            {
                "event_type": "touch",
                "target_view": "login_button"
            }
        ]
    },
    "main": {
        "permission_state": ["permission_operation"],
        "welcome_state": ["welcome_operation"],
        "address_state": ["address_operation"],
        "login_state": ["login_operation"]
    }
}
