INDEX VERSION 1.130+C:\TalentSprint\FSD53\fsd53\2.SpringBoot\EmpDeptWorkspace\.metadata\.plugins\org.eclipse.jdt.core
3935593868.index
4015574660.index
2205379618.index
4014111090.index
3566089501.index
3605345685.index
197716873.index
1044980207.index
3852244655.index
3918188840.index
1157287036.index
3423850866.index
3324167211.index
2194716159.index
1205484310.index
3218664467.index
3348415324.index
2653330038.index
676340587.index
3210191387.index
2938422138.index
1970103051.index
1027117862.index
718510507.index
1821064743.index
1404041086.index
882726225.index
1854429558.index
3491326387.index
1195687730.index
1462201049.index
2876760108.index
3913727641.index
2045939337.index
3083700867.index
2514888711.index
2625916034.index
1581348692.index
900065360.index
3864761229.index
3533659648.index
3857871962.index
1225161430.index
515057236.index
103960179.index
206967720.index
24295162.index
3312165055.index
4265029711.index
3441071246.index
1178459890.index
2018367206.index
3088939722.index
2183990692.index
1113136935.index
1682170420.index
2850851968.index
3918770766.index
2329921264.index
2907598008.index
1150157152.index
4289772145.index
4173153252.index
339849572.index
3168727527.index
3333554893.index
743109110.index
3684700968.index
1092534359.index
2782998763.index
4278764599.index
2006079928.index
2529459560.index
1747123487.index
1048200558.index
1546412837.index
505255175.index
491392295.index
3179307192.index
2256529200.index
743164995.index
2458108162.index
4188318834.index
2071462652.index
2975380373.index
191344456.index
817652364.index
1227306570.index
4269824944.index
3825404697.index
960247709.index
2563816903.index
2556016690.index
3355708150.index
659779090.index
2758576337.index
3891222140.index
3638156409.index
1834422475.index
1737575566.index
1552878334.index
