127.0.0.1 - - [28/Nov/2023:15:15:58 +0530] "GET / HTTP/1.1" 404 751
0:0:0:0:0:0:0:1 - - [28/Nov/2023:15:16:05 +0530] "GET /EmpWebApp/Login.html HTTP/1.1" 304 -
0:0:0:0:0:0:0:1 - - [28/Nov/2023:15:16:26 +0530] "POST /EmpWebApp/LoginServlet HTTP/1.1" 200 663
0:0:0:0:0:0:0:1 - - [28/Nov/2023:15:16:57 +0530] "GET /EmpWebApp/GetAllEmployees HTTP/1.1" 200 3401
0:0:0:0:0:0:0:1 - - [28/Nov/2023:15:16:57 +0530] "GET /EmpWebApp/GetAllEmployees HTTP/1.1" 200 3401
0:0:0:0:0:0:0:1 - - [28/Nov/2023:15:16:57 +0530] "GET /EmpWebApp/GetAllEmployees HTTP/1.1" 200 3401
0:0:0:0:0:0:0:1 - - [28/Nov/2023:15:16:57 +0530] "GET /EmpWebApp/GetAllEmployees HTTP/1.1" 200 3401
0:0:0:0:0:0:0:1 - - [28/Nov/2023:15:16:57 +0530] "GET /EmpWebApp/GetAllEmployees HTTP/1.1" 200 3401
0:0:0:0:0:0:0:1 - - [28/Nov/2023:15:16:57 +0530] "GET /EmpWebApp/GetAllEmployees HTTP/1.1" 200 3401
0:0:0:0:0:0:0:1 - - [28/Nov/2023:15:17:08 +0530] "GET /EmpWebApp/DeleteEmployee?empId=6 HTTP/1.1" 200 3161
127.0.0.1 - - [28/Nov/2023:15:52:44 +0530] "GET / HTTP/1.1" 404 751
0:0:0:0:0:0:0:1 - - [28/Nov/2023:15:52:54 +0530] "POST /EmpWebApp/LoginServlet HTTP/1.1" 200 663
0:0:0:0:0:0:0:1 - - [28/Nov/2023:15:53:01 +0530] "GET /EmpWebApp/GetAllEmployees HTTP/1.1" 200 3322
0:0:0:0:0:0:0:1 - - [28/Nov/2023:15:53:01 +0530] "GET /EmpWebApp/GetAllEmployees HTTP/1.1" 200 3322
0:0:0:0:0:0:0:1 - - [28/Nov/2023:15:53:12 +0530] "GET /EmpWebApp/EditEmployee?empId=7 HTTP/1.1" 200 2045
0:0:0:0:0:0:0:1 - - [28/Nov/2023:15:53:34 +0530] "POST /EmpWebApp/UpdateEmployee HTTP/1.1" 200 3329
