[gd_scene load_steps=5 format=2]

[ext_resource path="res://Scripts/SmalltalkProxy.cs" type="Script" id=1]

[sub_resource type="BoxShape" id=1]

[sub_resource type="ProceduralSky" id=2]

[sub_resource type="Environment" id=3]
background_mode = 2
background_sky = SubResource( 2 )
background_sky_orientation = Basis( -0.959535, 0, 0.281588, 0, 1, 0, -0.281588, 0, -0.959535 )

[node name="Spatial" type="Spatial"]
script = ExtResource( 1 )

[node name="Camera" type="Camera" parent="."]
transform = Transform( 1, 0, 0, 0, 1, 0, 0, 0, 1, 0, 0, 6.25906 )

[node name="boiKinematic" type="KinematicBody" parent="."]
transform = Transform( 1, 0, 0, 0, 1, 0, 0, 0, 1, 0, 0.996135, 0 )

[node name="CollisionShape" type="CollisionShape" parent="boiKinematic"]
shape = SubResource( 1 )

[node name="boiModel" type="CSGBox" parent="boiKinematic"]

[node name="ground" type="CSGBox" parent="."]
transform = Transform( 7.2663, 0, 0, 0, 1.31738, 0, 0, 0, 7.2663, 0, -2.48232, 0 )
use_collision = true

[node name="WorldEnvironment" type="WorldEnvironment" parent="."]
environment = SubResource( 3 )

[node name="DirectionalLight" type="DirectionalLight" parent="."]
transform = Transform( 0.316611, 0.821317, -0.474548, -0.634555, 0.555249, 0.537623, 0.705051, 0.13091, 0.696969, 0, 0, 0 )
light_energy = 0.21
shadow_enabled = true
