<svg xmlns="http://www.w3.org/2000/svg" width="24" height="24" viewBox="0 0 24 24">
    <g fill="none" fill-rule="evenodd">
        <path d="M0 0h24v24H0z"/>
        <path fill="#FFF" d="M18.675 16.975l-4.442-4.368a.32.32 0 0 1 0-.427l4.442-4.369a1.018 1.018 0 0 0 0-1.491 1.06 1.06 0 0 0-1.517 0l-4.441 4.369a.334.334 0 0 1-.434 0L7.95 6.426c-.433-.32-1.192-.32-1.625 0-.325.426-.325 1.172 0 1.599l4.442 4.368a.32.32 0 0 1 0 .427l-4.442 4.369a1.018 1.018 0 0 0 0 1.491 1.06 1.06 0 0 0 1.517 0l4.441-4.369a.334.334 0 0 1 .434 0l4.441 4.37a1.06 1.06 0 0 0 1.517 0c.325-.533.325-1.28 0-1.706z"/>
    </g>
</svg>
