{
  "workloads": [
    {
      "id": 1,
      "name": "VM"
    },
    {
      "id": 2,
      "name": "NAS"
    },
    {
      "id": 3,
      "name": "NAS-DA",
      "parameters": []
    },
    {
      "id": 4,
      "name": "EXTRA",
      "parameters": []
    }
  ],
  "requests": [
    {
      "companyName": "Google",
      "sizingRequestName": "rqst",
      "industry": "IT & Software Products",
      "location": "USA",
      "oppurtunity": "ggg",
      "dataGrowthRate": "3",
      "storageType": "Yes",
      "workloads": [
        {
          "name": "v1",
          "type": "VM",
          "parameters": [
            {
              "key": "sla1",
              "type": true,
              "groupName": "",
              "enabled": true,
              "hidden": false,
              "required": true,
              "heading": "SLA for retention policy",
              "title": "",
              "interaction": 1,
              "hint": "",
              "default": "",
              "placeholder": "",
              "class": "full",
              "options": [],
              "actions": {},
              "validations": [],
              "order": 4,
              "parameters": [
                {
                  "id": 2,
                  "key": "capacity",
                  "type": false,
                  "groupName": "sla1",
                  "enabled": true,
                  "hidden": false,
                  "required": true,
                  "heading": "Yearly Capacity:",
                  "title": "Enter yearly capacity",
                  "interaction": 1,
                  "hint": "",
                  "default": "",
                  "placeholder": "Capacity",
                  "class": "fourth",
                  "options": [],
                  "actions": {},
                  "validations": [
                    {
                      "regex": "(?<=\\s|^)\\d+(?=\\s|$)",
                      "error": "Enter numbers only"
                    }
                  ],
                  "order": 5,
                  "parameters": [],
                  "workloadId": 1
                },
                {
                  "key": "aaa",
                  "type": false,
                  "groupName": "sla1",
                  "enabled": true,
                  "hidden": false,
                  "required": true,
                  "heading": "ds",
                  "title": "sdsdsdsdsdsd",
                  "interaction": 1,
                  "hint": "",
                  "default": "",
                  "placeholder": "",
                  "class": "third",
                  "options": [],
                  "actions": {},
                  "validations": [],
                  "order": 8,
                  "parameters": [],
                  "workloadId": 1,
                  "id": 7
                }
              ],
              "workloadId": 1,
              "id": 3
            },
            {
              "key": "anothr",
              "type": false,
              "groupName": "",
              "enabled": true,
              "hidden": false,
              "required": true,
              "heading": "ddsddsd",
              "title": "sddsdsd",
              "interaction": 1,
              "hint": "",
              "default": "",
              "placeholder": "",
              "class": "fourth",
              "options": [],
              "actions": {},
              "validations": [],
              "order": 5,
              "parameters": [],
              "workloadId": 1,
              "id": 4
            },
            {
              "key": "another",
              "type": false,
              "groupName": "",
              "enabled": true,
              "hidden": false,
              "required": true,
              "heading": "sdssd",
              "title": "sddssdds",
              "interaction": 1,
              "hint": "",
              "default": "",
              "placeholder": "",
              "class": "third",
              "options": [],
              "actions": {},
              "validations": [],
              "order": 6,
              "parameters": [],
              "workloadId": 1,
              "id": 5
            },
            {
              "key": "aassdd",
              "type": false,
              "groupName": "",
              "enabled": true,
              "hidden": false,
              "required": true,
              "heading": "ffff",
              "title": "ddd",
              "interaction": 1,
              "hint": "ddd",
              "default": "",
              "placeholder": "",
              "class": "third",
              "options": [],
              "actions": {},
              "validations": [],
              "order": 7,
              "parameters": [],
              "workloadId": 1,
              "id": 6
            },
            {
              "key": "adasdd",
              "type": true,
              "groupName": "",
              "enabled": true,
              "hidden": false,
              "required": true,
              "heading": "asddasdd",
              "title": "asddasddada",
              "interaction": 1,
              "hint": "",
              "default": "",
              "placeholder": "",
              "class": "third",
              "options": [],
              "actions": {},
              "validations": [],
              "order": 8,
              "parameters": [],
              "workloadId": 1,
              "id": 8
            }
          ]
        }
      ],
      "id": 1
    },
    {
      "companyName": "fff",
      "sizingRequestName": "aaa",
      "industry": "IT & Software Products",
      "location": "USA",
      "oppurtunity": "dddd",
      "dataGrowthRate": "3",
      "storageType": "Yes",
      "workloads": [
        {
          "name": "ddffgg",
          "type": "NAS-DA",
          "parameters": [
            {
              "key": "first",
              "type": false,
              "groupName": "",
              "enabled": true,
              "hidden": false,
              "required": true,
              "heading": "",
              "title": "What is first value",
              "interaction": 1,
              "hint": "",
              "default": "",
              "placeholder": "",
              "class": "half",
              "options": [],
              "actions": {},
              "validations": [],
              "order": 0,
              "parameters": [],
              "workloadId": 3,
              "id": 9
            },
            {
              "key": "second",
              "type": false,
              "groupName": "",
              "enabled": true,
              "hidden": false,
              "required": true,
              "heading": "",
              "title": "Second Parameter",
              "interaction": 1,
              "hint": "",
              "default": "",
              "placeholder": "",
              "class": "",
              "options": [],
              "actions": {},
              "validations": [],
              "order": 1,
              "parameters": [],
              "workloadId": 3,
              "id": 10
            },
            {
              "key": "third",
              "type": false,
              "groupName": "",
              "enabled": true,
              "hidden": false,
              "required": true,
              "heading": "",
              "title": "Third parameter",
              "interaction": 1,
              "hint": "",
              "default": "",
              "placeholder": "",
              "class": "",
              "options": [],
              "actions": {},
              "validations": [],
              "order": 2,
              "parameters": [],
              "workloadId": 3,
              "id": 11
            },
            {
              "id": 12,
              "key": "fourth",
              "type": false,
              "groupName": "",
              "enabled": true,
              "hidden": false,
              "required": true,
              "heading": "",
              "title": "This is fourth question",
              "interaction": 1,
              "hint": "",
              "default": "",
              "placeholder": "",
              "class": "half",
              "options": [],
              "actions": {},
              "validations": [],
              "order": 4,
              "parameters": [],
              "workloadId": 3
            },
            {
              "key": "fifth",
              "type": true,
              "groupName": "",
              "enabled": true,
              "hidden": false,
              "required": true,
              "heading": "A full group",
              "title": "This is group type question",
              "interaction": 1,
              "hint": "",
              "default": "",
              "placeholder": "",
              "class": "full",
              "options": [],
              "actions": {},
              "validations": [],
              "order": 5,
              "parameters": [],
              "workloadId": 3,
              "id": 13
            }
          ]
        }
      ],
      "id": 2
    },
    {
      "companyName": "fff",
      "sizingRequestName": "aaa",
      "industry": "IT & Software Products",
      "location": "USA",
      "oppurtunity": "dddd",
      "dataGrowthRate": "3",
      "storageType": "Yes",
      "workloads": [
        {
          "name": "ddffgg",
          "type": "NAS-DA",
          "parameters": []
        }
      ],
      "id": 3
    },
    {
      "companyName": "ddd",
      "sizingRequestName": "aaa",
      "industry": "Software Products",
      "location": "England",
      "oppurtunity": "sss",
      "dataGrowthRate": "3",
      "storageType": "Yes",
      "workloads": [
        {
          "name": "ddd",
          "type": "VM",
          "parameters": [
            {
              "key": "sla1",
              "type": true,
              "groupName": "",
              "enabled": true,
              "hidden": false,
              "required": true,
              "heading": "SLA for retention policy",
              "title": "",
              "interaction": 1,
              "hint": "",
              "default": "",
              "placeholder": "",
              "class": "full",
              "options": [],
              "actions": {},
              "validations": [],
              "order": 4,
              "parameters": [
                {
                  "id": 2,
                  "key": "capacity",
                  "type": false,
                  "groupName": "sla1",
                  "enabled": true,
                  "hidden": false,
                  "required": true,
                  "heading": "Yearly Capacity:",
                  "title": "Enter yearly capacity",
                  "interaction": 1,
                  "hint": "",
                  "default": "",
                  "placeholder": "Capacity",
                  "class": "fourth",
                  "options": [],
                  "actions": {},
                  "validations": [
                    {
                      "regex": "(?<=\\s|^)\\d+(?=\\s|$)",
                      "error": "Enter numbers only"
                    }
                  ],
                  "order": 5,
                  "parameters": [],
                  "workloadId": 1
                },
                {
                  "key": "aaa",
                  "type": false,
                  "groupName": "sla1",
                  "enabled": true,
                  "hidden": false,
                  "required": true,
                  "heading": "ds",
                  "title": "sdsdsdsdsdsd",
                  "interaction": 1,
                  "hint": "",
                  "default": "",
                  "placeholder": "",
                  "class": "third",
                  "options": [],
                  "actions": {},
                  "validations": [],
                  "order": 8,
                  "parameters": [],
                  "workloadId": 1,
                  "id": 7
                }
              ],
              "workloadId": 1,
              "id": 3
            },
            {
              "key": "anothr",
              "type": false,
              "groupName": "",
              "enabled": true,
              "hidden": false,
              "required": true,
              "heading": "ddsddsd",
              "title": "sddsdsd",
              "interaction": 1,
              "hint": "",
              "default": "",
              "placeholder": "",
              "class": "fourth",
              "options": [],
              "actions": {},
              "validations": [],
              "order": 5,
              "parameters": [],
              "workloadId": 1,
              "id": 4
            },
            {
              "key": "another",
              "type": false,
              "groupName": "",
              "enabled": true,
              "hidden": false,
              "required": true,
              "heading": "sdssd",
              "title": "sddssdds",
              "interaction": 1,
              "hint": "",
              "default": "",
              "placeholder": "",
              "class": "third",
              "options": [],
              "actions": {},
              "validations": [],
              "order": 6,
              "parameters": [],
              "workloadId": 1,
              "id": 5
            },
            {
              "key": "aassdd",
              "type": false,
              "groupName": "",
              "enabled": true,
              "hidden": false,
              "required": true,
              "heading": "ffff",
              "title": "ddd",
              "interaction": 1,
              "hint": "ddd",
              "default": "",
              "placeholder": "",
              "class": "third",
              "options": [],
              "actions": {},
              "validations": [],
              "order": 7,
              "parameters": [],
              "workloadId": 1,
              "id": 6
            },
            {
              "key": "adasdd",
              "type": true,
              "groupName": "",
              "enabled": true,
              "hidden": false,
              "required": true,
              "heading": "asddasdd",
              "title": "asddasddada",
              "interaction": 1,
              "hint": "",
              "default": "",
              "placeholder": "",
              "class": "third",
              "options": [],
              "actions": {},
              "validations": [],
              "order": 8,
              "parameters": [],
              "workloadId": 1,
              "id": 8
            }
          ]
        },
        {
          "name": "da1",
          "type": "NAS-DA",
          "parameters": [
            {
              "key": "first",
              "type": false,
              "groupName": "",
              "enabled": true,
              "hidden": false,
              "required": true,
              "heading": "",
              "title": "What is first value",
              "interaction": 1,
              "hint": "",
              "default": "",
              "placeholder": "",
              "class": "half",
              "options": [],
              "actions": {},
              "validations": [],
              "order": 0,
              "parameters": [],
              "workloadId": 3,
              "id": 9
            },
            {
              "key": "second",
              "type": false,
              "groupName": "",
              "enabled": true,
              "hidden": false,
              "required": true,
              "heading": "",
              "title": "Second Parameter",
              "interaction": 1,
              "hint": "",
              "default": "",
              "placeholder": "",
              "class": "",
              "options": [],
              "actions": {},
              "validations": [],
              "order": 1,
              "parameters": [],
              "workloadId": 3,
              "id": 10
            },
            {
              "key": "third",
              "type": false,
              "groupName": "",
              "enabled": true,
              "hidden": false,
              "required": true,
              "heading": "",
              "title": "Third parameter",
              "interaction": 1,
              "hint": "",
              "default": "",
              "placeholder": "",
              "class": "",
              "options": [],
              "actions": {},
              "validations": [],
              "order": 2,
              "parameters": [],
              "workloadId": 3,
              "id": 11
            },
            {
              "id": 12,
              "key": "fourth",
              "type": false,
              "groupName": "",
              "enabled": true,
              "hidden": false,
              "required": true,
              "heading": "",
              "title": "This is fourth question",
              "interaction": 1,
              "hint": "",
              "default": "",
              "placeholder": "",
              "class": "half",
              "options": [],
              "actions": {},
              "validations": [],
              "order": 4,
              "parameters": [],
              "workloadId": 3
            },
            {
              "key": "fifth",
              "type": true,
              "groupName": "",
              "enabled": true,
              "hidden": false,
              "required": true,
              "heading": "A full group",
              "title": "This is group type question",
              "interaction": 1,
              "hint": "",
              "default": "",
              "placeholder": "",
              "class": "full",
              "options": [],
              "actions": {},
              "validations": [],
              "order": 5,
              "parameters": [],
              "workloadId": 3,
              "id": 13
            }
          ]
        }
      ],
      "id": 4
    },
    {
      "companyName": "ddd",
      "sizingRequestName": "aaa",
      "industry": "Software Products",
      "location": "England",
      "oppurtunity": "sss",
      "dataGrowthRate": "3",
      "storageType": "Yes",
      "workloads": [
        {
          "name": "ddd",
          "type": "VM",
          "parameters": [
            {
              "key": "sla1",
              "type": true,
              "groupName": "",
              "enabled": true,
              "hidden": false,
              "required": true,
              "heading": "SLA for retention policy",
              "title": "",
              "interaction": 1,
              "hint": "",
              "default": "",
              "placeholder": "",
              "class": "full",
              "options": [],
              "actions": {},
              "validations": [],
              "order": 4,
              "parameters": [
                {
                  "id": 2,
                  "key": "capacity",
                  "type": false,
                  "groupName": "sla1",
                  "enabled": true,
                  "hidden": false,
                  "required": true,
                  "heading": "Yearly Capacity:",
                  "title": "Enter yearly capacity",
                  "interaction": 1,
                  "hint": "",
                  "default": "",
                  "placeholder": "Capacity",
                  "class": "fourth",
                  "options": [],
                  "actions": {},
                  "validations": [
                    {
                      "regex": "(?<=\\s|^)\\d+(?=\\s|$)",
                      "error": "Enter numbers only"
                    }
                  ],
                  "order": 5,
                  "parameters": [],
                  "workloadId": 1
                },
                {
                  "key": "aaa",
                  "type": false,
                  "groupName": "sla1",
                  "enabled": true,
                  "hidden": false,
                  "required": true,
                  "heading": "ds",
                  "title": "sdsdsdsdsdsd",
                  "interaction": 1,
                  "hint": "",
                  "default": "",
                  "placeholder": "",
                  "class": "third",
                  "options": [],
                  "actions": {},
                  "validations": [],
                  "order": 8,
                  "parameters": [],
                  "workloadId": 1,
                  "id": 7
                }
              ],
              "workloadId": 1,
              "id": 3
            },
            {
              "key": "anothr",
              "type": false,
              "groupName": "",
              "enabled": true,
              "hidden": false,
              "required": true,
              "heading": "ddsddsd",
              "title": "sddsdsd",
              "interaction": 1,
              "hint": "",
              "default": "",
              "placeholder": "",
              "class": "fourth",
              "options": [],
              "actions": {},
              "validations": [],
              "order": 5,
              "parameters": [],
              "workloadId": 1,
              "id": 4
            },
            {
              "key": "another",
              "type": false,
              "groupName": "",
              "enabled": true,
              "hidden": false,
              "required": true,
              "heading": "sdssd",
              "title": "sddssdds",
              "interaction": 1,
              "hint": "",
              "default": "",
              "placeholder": "",
              "class": "third",
              "options": [],
              "actions": {},
              "validations": [],
              "order": 6,
              "parameters": [],
              "workloadId": 1,
              "id": 5
            },
            {
              "key": "aassdd",
              "type": false,
              "groupName": "",
              "enabled": true,
              "hidden": false,
              "required": true,
              "heading": "ffff",
              "title": "ddd",
              "interaction": 1,
              "hint": "ddd",
              "default": "",
              "placeholder": "",
              "class": "third",
              "options": [],
              "actions": {},
              "validations": [],
              "order": 7,
              "parameters": [],
              "workloadId": 1,
              "id": 6
            },
            {
              "key": "adasdd",
              "type": true,
              "groupName": "",
              "enabled": true,
              "hidden": false,
              "required": true,
              "heading": "asddasdd",
              "title": "asddasddada",
              "interaction": 1,
              "hint": "",
              "default": "",
              "placeholder": "",
              "class": "third",
              "options": [],
              "actions": {},
              "validations": [],
              "order": 8,
              "parameters": [],
              "workloadId": 1,
              "id": 8
            }
          ]
        }
      ],
      "id": 5
    },
    {
      "companyName": "ddd",
      "sizingRequestName": "aaa",
      "industry": "Software Products",
      "location": "England",
      "oppurtunity": "sss",
      "dataGrowthRate": "3",
      "storageType": "Yes",
      "workloads": [
        {
          "name": "ddd",
          "type": "VM",
          "parameters": [
            {
              "key": "sla1",
              "type": true,
              "groupName": "",
              "enabled": true,
              "hidden": false,
              "required": true,
              "heading": "SLA for retention policy",
              "title": "",
              "interaction": 1,
              "hint": "",
              "default": "",
              "placeholder": "",
              "class": "full",
              "options": [],
              "actions": {},
              "validations": [],
              "order": 4,
              "parameters": [
                {
                  "id": 2,
                  "key": "capacity",
                  "type": false,
                  "groupName": "sla1",
                  "enabled": true,
                  "hidden": false,
                  "required": true,
                  "heading": "Yearly Capacity:",
                  "title": "Enter yearly capacity",
                  "interaction": 1,
                  "hint": "",
                  "default": "",
                  "placeholder": "Capacity",
                  "class": "fourth",
                  "options": [],
                  "actions": {},
                  "validations": [
                    {
                      "regex": "(?<=\\s|^)\\d+(?=\\s|$)",
                      "error": "Enter numbers only"
                    }
                  ],
                  "order": 5,
                  "parameters": [],
                  "workloadId": 1
                },
                {
                  "key": "aaa",
                  "type": false,
                  "groupName": "sla1",
                  "enabled": true,
                  "hidden": false,
                  "required": true,
                  "heading": "ds",
                  "title": "sdsdsdsdsdsd",
                  "interaction": 1,
                  "hint": "",
                  "default": "",
                  "placeholder": "",
                  "class": "third",
                  "options": [],
                  "actions": {},
                  "validations": [],
                  "order": 8,
                  "parameters": [],
                  "workloadId": 1,
                  "id": 7
                }
              ],
              "workloadId": 1,
              "id": 3
            },
            {
              "key": "anothr",
              "type": false,
              "groupName": "",
              "enabled": true,
              "hidden": false,
              "required": true,
              "heading": "ddsddsd",
              "title": "sddsdsd",
              "interaction": 1,
              "hint": "",
              "default": "",
              "placeholder": "",
              "class": "fourth",
              "options": [],
              "actions": {},
              "validations": [],
              "order": 5,
              "parameters": [],
              "workloadId": 1,
              "id": 4
            },
            {
              "key": "another",
              "type": false,
              "groupName": "",
              "enabled": true,
              "hidden": false,
              "required": true,
              "heading": "sdssd",
              "title": "sddssdds",
              "interaction": 1,
              "hint": "",
              "default": "",
              "placeholder": "",
              "class": "third",
              "options": [],
              "actions": {},
              "validations": [],
              "order": 6,
              "parameters": [],
              "workloadId": 1,
              "id": 5
            },
            {
              "key": "aassdd",
              "type": false,
              "groupName": "",
              "enabled": true,
              "hidden": false,
              "required": true,
              "heading": "ffff",
              "title": "ddd",
              "interaction": 1,
              "hint": "ddd",
              "default": "",
              "placeholder": "",
              "class": "third",
              "options": [],
              "actions": {},
              "validations": [],
              "order": 7,
              "parameters": [],
              "workloadId": 1,
              "id": 6
            },
            {
              "key": "adasdd",
              "type": true,
              "groupName": "",
              "enabled": true,
              "hidden": false,
              "required": true,
              "heading": "asddasdd",
              "title": "asddasddada",
              "interaction": 1,
              "hint": "",
              "default": "",
              "placeholder": "",
              "class": "third",
              "options": [],
              "actions": {},
              "validations": [],
              "order": 8,
              "parameters": [],
              "workloadId": 1,
              "id": 8
            }
          ]
        }
      ],
      "id": 6
    },
    {
      "companyName": "ddd",
      "sizingRequestName": "aaa",
      "industry": "Software Products",
      "location": "England",
      "oppurtunity": "sss",
      "dataGrowthRate": "3",
      "storageType": "Yes",
      "workloads": [
        {
          "name": "ddd",
          "type": "VM",
          "parameters": []
        }
      ],
      "id": 7
    },
    {
      "companyName": "ddd",
      "sizingRequestName": "aaa",
      "industry": "Software Products",
      "location": "England",
      "oppurtunity": "sss",
      "dataGrowthRate": "3",
      "storageType": "Yes",
      "workloads": [
        {
          "name": "ddd",
          "type": "VM",
          "parameters": []
        }
      ],
      "id": 8
    },
    {
      "companyName": "ddd",
      "sizingRequestName": "aaa",
      "industry": "Software Products",
      "location": "England",
      "oppurtunity": "sss",
      "dataGrowthRate": "3",
      "storageType": "Yes",
      "workloads": [
        {
          "name": "ddd",
          "type": "VM",
          "parameters": []
        }
      ],
      "id": 9
    },
    {
      "companyName": "ddd",
      "sizingRequestName": "ddd",
      "industry": "Software Products",
      "location": "USA",
      "oppurtunity": "dddd",
      "dataGrowthRate": "2",
      "storageType": "Yes",
      "workloads": [
        {
          "name": "ccccc",
          "type": "VM",
          "parameters": [
            {
              "key": "sla1",
              "type": true,
              "groupName": "",
              "enabled": true,
              "hidden": false,
              "required": true,
              "heading": "SLA for retention policy",
              "title": "",
              "interaction": 1,
              "hint": "",
              "default": "",
              "placeholder": "",
              "class": "full",
              "options": [],
              "actions": {},
              "validations": [],
              "order": 4,
              "parameters": [
                {
                  "id": 2,
                  "key": "capacity",
                  "type": false,
                  "groupName": "sla1",
                  "enabled": true,
                  "hidden": false,
                  "required": true,
                  "heading": "Yearly Capacity:",
                  "title": "Enter yearly capacity",
                  "interaction": 1,
                  "hint": "",
                  "default": "",
                  "placeholder": "Capacity",
                  "class": "fourth",
                  "options": [],
                  "actions": {},
                  "validations": [
                    {
                      "regex": "(?<=\\s|^)\\d+(?=\\s|$)",
                      "error": "Enter numbers only"
                    }
                  ],
                  "order": 5,
                  "parameters": [],
                  "workloadId": 1
                },
                {
                  "key": "aaa",
                  "type": false,
                  "groupName": "sla1",
                  "enabled": true,
                  "hidden": false,
                  "required": true,
                  "heading": "ds",
                  "title": "sdsdsdsdsdsd",
                  "interaction": 1,
                  "hint": "",
                  "default": "",
                  "placeholder": "",
                  "class": "third",
                  "options": [],
                  "actions": {},
                  "validations": [],
                  "order": 8,
                  "parameters": [],
                  "workloadId": 1,
                  "id": 7
                }
              ],
              "workloadId": 1,
              "id": 3
            },
            {
              "key": "anothr",
              "type": false,
              "groupName": "",
              "enabled": true,
              "hidden": false,
              "required": true,
              "heading": "ddsddsd",
              "title": "sddsdsd",
              "interaction": 1,
              "hint": "",
              "default": "",
              "placeholder": "",
              "class": "fourth",
              "options": [],
              "actions": {},
              "validations": [],
              "order": 5,
              "parameters": [],
              "workloadId": 1,
              "id": 4
            },
            {
              "key": "another",
              "type": false,
              "groupName": "",
              "enabled": true,
              "hidden": false,
              "required": true,
              "heading": "sdssd",
              "title": "sddssdds",
              "interaction": 1,
              "hint": "",
              "default": "",
              "placeholder": "",
              "class": "third",
              "options": [],
              "actions": {},
              "validations": [],
              "order": 6,
              "parameters": [],
              "workloadId": 1,
              "id": 5
            },
            {
              "key": "aassdd",
              "type": false,
              "groupName": "",
              "enabled": true,
              "hidden": false,
              "required": true,
              "heading": "ffff",
              "title": "ddd",
              "interaction": 1,
              "hint": "ddd",
              "default": "",
              "placeholder": "",
              "class": "third",
              "options": [],
              "actions": {},
              "validations": [],
              "order": 7,
              "parameters": [],
              "workloadId": 1,
              "id": 6
            },
            {
              "key": "adasdd",
              "type": true,
              "groupName": "",
              "enabled": true,
              "hidden": false,
              "required": true,
              "heading": "asddasdd",
              "title": "asddasddada",
              "interaction": 1,
              "hint": "",
              "default": "",
              "placeholder": "",
              "class": "third",
              "options": [],
              "actions": {},
              "validations": [],
              "order": 8,
              "parameters": [],
              "workloadId": 1,
              "id": 8
            }
          ]
        }
      ],
      "id": 10
    }
  ],
  "companies": [
    {
      "id": 1,
      "name": "Google"
    },
    {
      "id": 2,
      "name": "Microsoft"
    },
    {
      "id": 3,
      "name": "Facebook"
    },
    {
      "id": 4,
      "name": "Amazon"
    },
    {
      "id": 5,
      "name": "Salesforce"
    },
    {
      "id": 6,
      "name": "Accenture"
    },
    {
      "id": 7,
      "name": "Azure"
    }
  ],
  "industries": [
    {
      "id": 1,
      "name": "IT & Software Products"
    },
    {
      "id": 2,
      "name": "Software Products"
    },
    {
      "id": 3,
      "name": "Social Media"
    },
    {
      "id": 4,
      "name": "E-Comerce"
    },
    {
      "id": 5,
      "name": "Data Solutions"
    }
  ],
  "locations": [
    {
      "id": 1,
      "name": "USA"
    },
    {
      "id": 2,
      "name": "England"
    },
    {
      "id": 3,
      "name": "France"
    },
    {
      "id": 4,
      "name": "Germany"
    },
    {
      "id": 5,
      "name": "India"
    }
  ],
  "workloadparameters": [
    {
      "id": 1,
      "workloadId": -1
    },
    {
      "id": 2,
      "key": "capacity",
      "type": false,
      "groupName": "sla1",
      "enabled": true,
      "hidden": false,
      "required": true,
      "heading": "Yearly Capacity:",
      "title": "Enter yearly capacity",
      "interaction": 1,
      "hint": "",
      "default": "",
      "placeholder": "Capacity",
      "class": "fourth",
      "options": [],
      "actions": {},
      "validations": [
        {
          "regex": "(?<=\\s|^)\\d+(?=\\s|$)",
          "error": "Enter numbers only"
        }
      ],
      "order": 5,
      "parameters": [],
      "workloadId": 1
    },
    {
      "key": "sla1",
      "type": true,
      "groupName": "",
      "enabled": true,
      "hidden": false,
      "required": true,
      "heading": "SLA for retention policy",
      "title": "",
      "interaction": 1,
      "hint": "",
      "default": "",
      "placeholder": "",
      "class": "full",
      "options": [],
      "actions": {},
      "validations": [],
      "order": 4,
      "parameters": [],
      "workloadId": 1,
      "id": 3
    },
    {
      "key": "anothr",
      "type": false,
      "groupName": "",
      "enabled": true,
      "hidden": false,
      "required": true,
      "heading": "ddsddsd",
      "title": "sddsdsd",
      "interaction": 1,
      "hint": "",
      "default": "",
      "placeholder": "",
      "class": "fourth",
      "options": [],
      "actions": {},
      "validations": [],
      "order": 5,
      "parameters": [],
      "workloadId": 1,
      "id": 4
    },
    {
      "key": "another",
      "type": false,
      "groupName": "",
      "enabled": true,
      "hidden": false,
      "required": true,
      "heading": "sdssd",
      "title": "sddssdds",
      "interaction": 1,
      "hint": "",
      "default": "",
      "placeholder": "",
      "class": "third",
      "options": [],
      "actions": {},
      "validations": [],
      "order": 6,
      "parameters": [],
      "workloadId": 1,
      "id": 5
    },
    {
      "key": "aassdd",
      "type": false,
      "groupName": "",
      "enabled": true,
      "hidden": false,
      "required": true,
      "heading": "ffff",
      "title": "ddd",
      "interaction": 1,
      "hint": "ddd",
      "default": "",
      "placeholder": "",
      "class": "third",
      "options": [],
      "actions": {},
      "validations": [],
      "order": 7,
      "parameters": [],
      "workloadId": 1,
      "id": 6
    },
    {
      "key": "aaa",
      "type": false,
      "groupName": "sla1",
      "enabled": true,
      "hidden": false,
      "required": true,
      "heading": "ds",
      "title": "sdsdsdsdsdsd",
      "interaction": 1,
      "hint": "",
      "default": "",
      "placeholder": "",
      "class": "third",
      "options": [],
      "actions": {},
      "validations": [],
      "order": 8,
      "parameters": [],
      "workloadId": 1,
      "id": 7
    },
    {
      "key": "adasdd",
      "type": true,
      "groupName": "",
      "enabled": true,
      "hidden": false,
      "required": true,
      "heading": "asddasdd",
      "title": "asddasddada",
      "interaction": 1,
      "hint": "",
      "default": "",
      "placeholder": "",
      "class": "third",
      "options": [],
      "actions": {},
      "validations": [],
      "order": 8,
      "parameters": [],
      "workloadId": 1,
      "id": 8
    },
    {
      "key": "first",
      "type": false,
      "groupName": "",
      "enabled": true,
      "hidden": false,
      "required": true,
      "heading": "",
      "title": "What is first value",
      "interaction": 1,
      "hint": "",
      "default": "",
      "placeholder": "",
      "class": "half",
      "options": [],
      "actions": {},
      "validations": [],
      "order": 0,
      "parameters": [],
      "workloadId": 3,
      "id": 9
    },
    {
      "key": "second",
      "type": false,
      "groupName": "",
      "enabled": true,
      "hidden": false,
      "required": true,
      "heading": "",
      "title": "Second Parameter",
      "interaction": 1,
      "hint": "",
      "default": "",
      "placeholder": "",
      "class": "",
      "options": [],
      "actions": {},
      "validations": [],
      "order": 1,
      "parameters": [],
      "workloadId": 3,
      "id": 10
    },
    {
      "key": "third",
      "type": false,
      "groupName": "",
      "enabled": true,
      "hidden": false,
      "required": true,
      "heading": "",
      "title": "Third parameter",
      "interaction": 1,
      "hint": "",
      "default": "",
      "placeholder": "",
      "class": "",
      "options": [],
      "actions": {},
      "validations": [],
      "order": 2,
      "parameters": [],
      "workloadId": 3,
      "id": 11
    },
    {
      "id": 12,
      "key": "fourth",
      "type": false,
      "groupName": "",
      "enabled": true,
      "hidden": false,
      "required": true,
      "heading": "",
      "title": "This is fourth question",
      "interaction": 1,
      "hint": "",
      "default": "",
      "placeholder": "",
      "class": "half",
      "options": [],
      "actions": {},
      "validations": [],
      "order": 4,
      "parameters": [],
      "workloadId": 3
    },
    {
      "key": "fifth",
      "type": true,
      "groupName": "",
      "enabled": true,
      "hidden": false,
      "required": true,
      "heading": "A full group",
      "title": "This is group type question",
      "interaction": 1,
      "hint": "",
      "default": "",
      "placeholder": "",
      "class": "full",
      "options": [],
      "actions": {},
      "validations": [],
      "order": 5,
      "parameters": [],
      "workloadId": 3,
      "id": 13
    }
  ]
}