<svg xmlns="http://www.w3.org/2000/svg" width="22" height="20" viewBox="0 0 22 20">
    <g fill="#1499C2" fill-rule="nonzero">
        <path d="M18.947 0H2.105C.943 0 0 .992 0 2.216V5.54c0 .612.471 1.108 1.053 1.108v11.08c0 1.224.942 2.217 2.105 2.217h14.737c1.162 0 2.105-.993 2.105-2.216V6.649c.581 0 1.053-.497 1.053-1.109V2.216C21.053.992 20.11 0 18.947 0zM2.105 2.216h16.842v2.216H2.105V2.216zm15.79 15.513H3.158V6.649h14.737v11.08z"/>
        <path d="M8.421 11.08h4.21c.582 0 1.053-.496 1.053-1.108 0-.612-.471-1.108-1.052-1.108h-4.21c-.582 0-1.054.496-1.054 1.108 0 .612.472 1.108 1.053 1.108z"/>
    </g>
</svg>
