<svg xmlns="http://www.w3.org/2000/svg" width="24" height="24" viewBox="0 0 24 24">
    <g fill="none" fill-rule="evenodd">
        <path d="M0 0h24v24H0z"/>
        <path fill="#535C65" d="M19 10.41V10A6 6 0 0 0 7.33 8 6.01 6.01 0 1 0 8 20h9a5 5 0 0 0 2-9.59zM17 18H8a4 4 0 1 1 1-7.85V10a4 4 0 0 1 4-4 4 4 0 0 1 3.41 6.06A3 3 0 1 1 17 18z"/>
    </g>
</svg>
