{
    "watch": [
        "./"
    ],
    "ext": "ts",
    "ignore": [
        "src/**/*.spec.ts",
        "./**/*.log",
        "./**/*.pdf",
        "./**/*.jpg",
        "./uploads/**"
    ],
    "exec": "export NODE_ENV=dev && ts-node --project tsconfig.json src/main.ts"
}