<?xml version="1.0" encoding="utf-8"?>
<svg xmlns="http://www.w3.org/2000/svg" xmlns:xlink="http://www.w3.org/1999/xlink" style="margin: auto; background: rgb(255, 255, 255); display: block; shape-rendering: auto; animation-play-state: running; animation-delay: 0s;" width="200px" height="200px" viewBox="0 0 100 100" preserveAspectRatio="xMidYMid">
<g transform="translate(0 -7.5)" style="animation-play-state: running; animation-delay: 0s;">
  <circle cx="50" cy="41" r="10" fill="#0055a5" style="animation-play-state: running; animation-delay: 0s;">
    <animateTransform attributeName="transform" type="rotate" dur="1s" repeatCount="indefinite" keyTimes="0;1" values="0 50 50;360 50 50" style="animation-play-state: running; animation-delay: 0s;"></animateTransform>
    <animate attributeName="r" dur="1s" repeatCount="indefinite" calcMode="spline" keyTimes="0;0.5;1" values="0;15;0" keySplines="0.2 0 0.8 1;0.2 0 0.8 1" style="animation-play-state: running; animation-delay: 0s;"></animate>
  </circle>
  <circle cx="50" cy="41" r="10" fill="#45aee7" style="animation-play-state: running; animation-delay: 0s;">
    <animateTransform attributeName="transform" type="rotate" dur="1s" repeatCount="indefinite" keyTimes="0;1" values="180 50 50;540 50 50" style="animation-play-state: running; animation-delay: 0s;"></animateTransform>
    <animate attributeName="r" dur="1s" repeatCount="indefinite" calcMode="spline" keyTimes="0;0.5;1" values="15;0;15" keySplines="0.2 0 0.8 1;0.2 0 0.8 1" style="animation-play-state: running; animation-delay: 0s;"></animate>
  </circle>
</g>
<!-- [ldio] generated by https://loading.io/ --></svg>