@startuml

Actor user
participant browser as b
participant "Symfony: Champs-Libres / AsyncUploaderBundle" as cla
participant "Openstack Swift" as os
participant "Symfony: Your bundle" as yb

user -> b: Pick a file in a `<input type="file">`
activate b

b -> cla: Request a temporary URL to upload
activate cla

cla -> cla: Generate a temporary URL

cla -> b: Return the temporary URL
deactivate cla

b -> os: Upload file to temporary URL
activate os
os -> b: Return a `200` response
deactivate os

deactivate b

user -> b: Submit the form
activate b

b -> yb: Submit the form
activate yb

note over yb
  Your bundle validate
  the form
end note

yb -> cla: Validate the field "file"
activate cla

cla -> os: Make a `HEAD` request to be sure the object is present
activate os

alt the file is not present
  os -> cla: Return a `404` response

  cla -> yb: Add an error to the field

else The file is present

  os -> cla: Return a `200` response
  deactivate os

end
deactivate cla

note over yb
  Your bundle process the form.
  The filename is available as a string.
end note

yb -> cla: Call to `??->persistFile($filename)`
activate cla

cla -> cla: Record that the file should be kept in Openstack Swift
deactivate cla

deactivate yb

... Run `php bin/console champslibres:asyncuploader:clean` (from cronjob) ...


cla -> os: Delete eventual uploaded file which are not persisted


@enduml
