EESchema Schematic File Version 4
EELAYER 29 0
EELAYER END
$Descr A4 11693 8268
encoding utf-8
Sheet 1 1
Title "LTC6811 BMS "
Date "2019-06-07"
Rev "0.2"
Comp "EBO Designs"
Comment1 ""
Comment2 ""
Comment3 ""
Comment4 ""
$EndDescr
$Comp
L LoraNode-rescue:ESP32-WROOM U103
U 1 1 5B2C4549
P 4000 2050
F 0 "U103" H 3300 3300 60  0000 C CNN
F 1 "ESP32-WROOM" H 4500 3300 60  0000 C CNN
F 2 "Accelerando:ESP32-WROOM" H 4350 3400 60  0001 C CNN
F 3 "" H 3550 2500 60  0001 C CNN
	1    4000 2050
	1    0    0    -1  
$EndComp
NoConn ~ 3750 3100
NoConn ~ 3850 3100
NoConn ~ 3950 3100
NoConn ~ 4050 3100
NoConn ~ 4150 3100
NoConn ~ 4250 3100
$Comp
L power:GND #PWR02
U 1 1 5B2C49C4
P 4900 2700
F 0 "#PWR02" H 4900 2450 50  0001 C CNN
F 1 "GND" H 4900 2550 50  0000 C CNN
F 2 "" H 4900 2700 50  0001 C CNN
F 3 "" H 4900 2700 50  0001 C CNN
	1    4900 2700
	1    0    0    -1  
$EndComp
$Comp
L power:GND #PWR03
U 1 1 5B2C49E3
P 3550 3100
F 0 "#PWR03" H 3550 2850 50  0001 C CNN
F 1 "GND" H 3550 2950 50  0000 C CNN
F 2 "" H 3550 3100 50  0001 C CNN
F 3 "" H 3550 3100 50  0001 C CNN
	1    3550 3100
	1    0    0    -1  
$EndComp
$Comp
L power:GND #PWR04
U 1 1 5B2C49FA
P 3050 2750
F 0 "#PWR04" H 3050 2500 50  0001 C CNN
F 1 "GND" H 3050 2600 50  0000 C CNN
F 2 "" H 3050 2750 50  0001 C CNN
F 3 "" H 3050 2750 50  0001 C CNN
	1    3050 2750
	1    0    0    -1  
$EndComp
$Comp
L Device:CP_Small C105
U 1 1 5B2C4A3A
P 7800 1000
F 0 "C105" H 7810 1070 50  0000 L CNN
F 1 "10uF" H 7810 920 50  0000 L CNN
F 2 "Capacitor_SMD:CP_Elec_6.3x5.4" H 7800 1000 50  0001 C CNN
F 3 "" H 7800 1000 50  0001 C CNN
	1    7800 1000
	1    0    0    -1  
$EndComp
$Comp
L power:+3.3V #PWR05
U 1 1 5B2C4A91
P 3050 1450
F 0 "#PWR05" H 3050 1300 50  0001 C CNN
F 1 "+3.3V" H 3050 1590 50  0000 C CNN
F 2 "" H 3050 1450 50  0001 C CNN
F 3 "" H 3050 1450 50  0001 C CNN
	1    3050 1450
	1    0    0    -1  
$EndComp
$Comp
L power:+3.3V #PWR06
U 1 1 5B2C4AB2
P 7800 900
F 0 "#PWR06" H 7800 750 50  0001 C CNN
F 1 "+3.3V" H 7800 1040 50  0000 C CNN
F 2 "" H 7800 900 50  0001 C CNN
F 3 "" H 7800 900 50  0001 C CNN
	1    7800 900 
	1    0    0    -1  
$EndComp
$Comp
L power:GND #PWR07
U 1 1 5B2C4ADB
P 7800 1100
F 0 "#PWR07" H 7800 850 50  0001 C CNN
F 1 "GND" H 7800 950 50  0000 C CNN
F 2 "" H 7800 1100 50  0001 C CNN
F 3 "" H 7800 1100 50  0001 C CNN
	1    7800 1100
	1    0    0    -1  
$EndComp
$Comp
L Device:C_Small C106
U 1 1 5B2C4B26
P 2200 1650
F 0 "C106" H 2210 1720 50  0000 L CNN
F 1 "0.1uF" H 2210 1570 50  0000 L CNN
F 2 "Capacitor_SMD:C_0805_2012Metric" H 2200 1650 50  0001 C CNN
F 3 "" H 2200 1650 50  0001 C CNN
	1    2200 1650
	1    0    0    -1  
$EndComp
$Comp
L power:GND #PWR08
U 1 1 5B2C4B89
P 2200 1750
F 0 "#PWR08" H 2200 1500 50  0001 C CNN
F 1 "GND" H 2200 1600 50  0000 C CNN
F 2 "" H 2200 1750 50  0001 C CNN
F 3 "" H 2200 1750 50  0001 C CNN
	1    2200 1750
	1    0    0    -1  
$EndComp
$Comp
L Device:R_Small R101
U 1 1 5B2C4BA2
P 2200 1450
F 0 "R101" H 2230 1470 50  0000 L CNN
F 1 "10k" H 2230 1410 50  0000 L CNN
F 2 "Resistor_SMD:R_0805_2012Metric" H 2200 1450 50  0001 C CNN
F 3 "" H 2200 1450 50  0001 C CNN
	1    2200 1450
	1    0    0    -1  
$EndComp
$Comp
L power:+3.3V #PWR09
U 1 1 5B2C4C58
P 2200 1350
F 0 "#PWR09" H 2200 1200 50  0001 C CNN
F 1 "+3.3V" H 2200 1490 50  0000 C CNN
F 2 "" H 2200 1350 50  0001 C CNN
F 3 "" H 2200 1350 50  0001 C CNN
	1    2200 1350
	1    0    0    -1  
$EndComp
NoConn ~ 4900 1800
$Comp
L Device:C_Small C104
U 1 1 5B2C4C8E
P 7600 1000
F 0 "C104" H 7610 1070 50  0000 L CNN
F 1 "0.1uF" H 7610 920 50  0000 L CNN
F 2 "Capacitor_SMD:C_0805_2012Metric" H 7600 1000 50  0001 C CNN
F 3 "" H 7600 1000 50  0001 C CNN
	1    7600 1000
	1    0    0    -1  
$EndComp
Text Notes 3400 650  0    60   ~ 0
turn off device under 2.3v
Text Label 5500 2500 2    60   ~ 0
PROGRAM
$Comp
L Device:R_Small R102
U 1 1 5B2C51E8
P 4450 3200
F 0 "R102" H 4480 3220 50  0000 L CNN
F 1 "10k" H 4480 3160 50  0000 L CNN
F 2 "Resistor_SMD:R_0805_2012Metric" H 4450 3200 50  0001 C CNN
F 3 "" H 4450 3200 50  0001 C CNN
	1    4450 3200
	1    0    0    -1  
$EndComp
$Comp
L power:GND #PWR010
U 1 1 5B2C522C
P 4450 3300
F 0 "#PWR010" H 4450 3050 50  0001 C CNN
F 1 "GND" H 4450 3150 50  0000 C CNN
F 2 "" H 4450 3300 50  0001 C CNN
F 3 "" H 4450 3300 50  0001 C CNN
	1    4450 3300
	1    0    0    -1  
$EndComp
$Comp
L power:+3.3V #PWR040
U 1 1 5B2D4FDB
P 6150 2450
F 0 "#PWR040" H 6150 2300 50  0001 C CNN
F 1 "+3.3V" H 6150 2590 50  0000 C CNN
F 2 "" H 6150 2450 50  0001 C CNN
F 3 "" H 6150 2450 50  0001 C CNN
	1    6150 2450
	1    0    0    -1  
$EndComp
NoConn ~ 3650 3100
Text Label 5350 2300 2    60   ~ 0
LED
Text Label 6700 2250 1    60   ~ 0
LED
Text Label 6450 2250 1    60   ~ 0
LED1
$Comp
L Device:R R125
U 1 1 5B2EABAE
P 6450 2400
F 0 "R125" V 6530 2400 50  0000 C CNN
F 1 "10k" V 6450 2400 50  0000 C CNN
F 2 "Resistor_SMD:R_0805_2012Metric" V 6380 2400 50  0001 C CNN
F 3 "" H 6450 2400 50  0001 C CNN
	1    6450 2400
	1    0    0    -1  
$EndComp
$Comp
L Device:R R126
U 1 1 5B2EACC5
P 6700 2400
F 0 "R126" V 6780 2400 50  0000 C CNN
F 1 "10k" V 6700 2400 50  0000 C CNN
F 2 "Resistor_SMD:R_0805_2012Metric" V 6630 2400 50  0001 C CNN
F 3 "" H 6700 2400 50  0001 C CNN
	1    6700 2400
	1    0    0    -1  
$EndComp
$Comp
L Device:LED D101
U 1 1 5B2EB11A
P 6450 2700
F 0 "D101" H 6450 2800 50  0000 C CNN
F 1 "LED" H 6450 2600 50  0000 C CNN
F 2 "LED_SMD:LED_0805_2012Metric" H 6450 2700 50  0001 C CNN
F 3 "" H 6450 2700 50  0001 C CNN
	1    6450 2700
	0    -1   -1   0   
$EndComp
$Comp
L Device:LED D102
U 1 1 5B2EB20C
P 6700 2700
F 0 "D102" H 6700 2800 50  0000 C CNN
F 1 "LED" H 6700 2600 50  0000 C CNN
F 2 "LED_SMD:LED_0805_2012Metric" H 6700 2700 50  0001 C CNN
F 3 "" H 6700 2700 50  0001 C CNN
	1    6700 2700
	0    -1   -1   0   
$EndComp
$Comp
L power:GND #PWR050
U 1 1 5B2EB2F2
P 6450 2850
F 0 "#PWR050" H 6450 2600 50  0001 C CNN
F 1 "GND" H 6450 2700 50  0000 C CNN
F 2 "" H 6450 2850 50  0001 C CNN
F 3 "" H 6450 2850 50  0001 C CNN
	1    6450 2850
	1    0    0    -1  
$EndComp
$Comp
L power:GND #PWR051
U 1 1 5B2EB3C9
P 6700 2850
F 0 "#PWR051" H 6700 2600 50  0001 C CNN
F 1 "GND" H 6700 2700 50  0000 C CNN
F 2 "" H 6700 2850 50  0001 C CNN
F 3 "" H 6700 2850 50  0001 C CNN
	1    6700 2850
	1    0    0    -1  
$EndComp
$Comp
L Device:R R124
U 1 1 5B2EC0EA
P 5800 2500
F 0 "R124" V 5880 2500 50  0000 C CNN
F 1 "10k" V 5800 2500 50  0000 C CNN
F 2 "Resistor_SMD:R_0805_2012Metric" V 5730 2500 50  0001 C CNN
F 3 "" H 5800 2500 50  0001 C CNN
	1    5800 2500
	0    1    1    0   
$EndComp
Wire Wire Line
	4900 2600 4900 2700
Wire Wire Line
	7800 900  7600 900 
Wire Wire Line
	7600 1100 7800 1100
Wire Wire Line
	5350 2300 4900 2300
Wire Wire Line
	5950 2500 6150 2500
Wire Wire Line
	6150 2500 6150 2450
Connection ~ 2200 1550
$Comp
L LoraNode-rescue:Conn_01x01 J122
U 1 1 5B368FFD
P 800 750
F 0 "J122" H 800 850 50  0000 C CNN
F 1 "Conn_01x01" H 800 650 50  0000 C CNN
F 2 "MountingHole:MountingHole_3.2mm_M3_Pad" H 800 750 50  0001 C CNN
F 3 "" H 800 750 50  0001 C CNN
	1    800  750 
	1    0    0    -1  
$EndComp
$Comp
L LoraNode-rescue:Conn_01x01 J123
U 1 1 5B3696CA
P 800 1050
F 0 "J123" H 800 1150 50  0000 C CNN
F 1 "Conn_01x01" H 800 950 50  0000 C CNN
F 2 "MountingHole:MountingHole_3.2mm_M3_Pad" H 800 1050 50  0001 C CNN
F 3 "" H 800 1050 50  0001 C CNN
	1    800  1050
	1    0    0    -1  
$EndComp
$Comp
L LoraNode-rescue:Conn_01x01 J124
U 1 1 5B3697E1
P 800 1350
F 0 "J124" H 800 1450 50  0000 C CNN
F 1 "Conn_01x01" H 800 1250 50  0000 C CNN
F 2 "MountingHole:MountingHole_3.2mm_M3_Pad" H 800 1350 50  0001 C CNN
F 3 "" H 800 1350 50  0001 C CNN
	1    800  1350
	1    0    0    -1  
$EndComp
$Comp
L LoraNode-rescue:Conn_01x01 J125
U 1 1 5B3698F5
P 800 1600
F 0 "J125" H 800 1700 50  0000 C CNN
F 1 "Conn_01x01" H 800 1500 50  0000 C CNN
F 2 "MountingHole:MountingHole_3.2mm_M3_Pad" H 800 1600 50  0001 C CNN
F 3 "" H 800 1600 50  0001 C CNN
	1    800  1600
	1    0    0    -1  
$EndComp
NoConn ~ 600  1600
NoConn ~ 600  1350
NoConn ~ 600  1050
NoConn ~ 600  750 
Wire Wire Line
	2200 1550 3050 1550
$Comp
L power:+BATT #PWR061
U 1 1 5B30DEBC
P 6250 700
F 0 "#PWR061" H 6250 550 50  0001 C CNN
F 1 "+BATT" H 6250 840 50  0000 C CNN
F 2 "" H 6250 700 50  0001 C CNN
F 3 "" H 6250 700 50  0001 C CNN
	1    6250 700 
	1    0    0    -1  
$EndComp
$Comp
L power:PWR_FLAG #FLG060
U 1 1 5B30DDC4
P 6250 700
F 0 "#FLG060" H 6250 775 50  0001 C CNN
F 1 "PWR_FLAG" H 6250 850 50  0000 C CNN
F 2 "" H 6250 700 50  0001 C CNN
F 3 "" H 6250 700 50  0001 C CNN
	1    6250 700 
	-1   0    0    1   
$EndComp
Wire Wire Line
	5350 2000 4900 2000
Wire Wire Line
	4900 1900 5350 1900
Wire Wire Line
	5350 2100 4900 2100
Text Label 5350 2000 2    60   ~ 0
CS
Text Label 5350 1900 2    60   ~ 0
MISO
Text Label 5350 2100 2    60   ~ 0
SCK
Wire Wire Line
	3000 5850 3450 5850
Wire Wire Line
	3000 5950 3450 5950
Text Label 3000 5850 0    60   ~ 0
CS
Text Label 3000 6150 0    60   ~ 0
MISO
Text Label 3000 5950 0    60   ~ 0
SCK
$Comp
L Device:Q_NPN_BCE Q1
U 1 1 5C022B4A
P 1250 6250
F 0 "Q1" H 1441 6296 50  0000 L CNN
F 1 "CZT3055 TR" H 1441 6205 50  0000 L CNN
F 2 "Package_TO_SOT_SMD:SOT-223-3_TabPin2" H 1450 6350 50  0001 C CNN
F 3 "~" H 1250 6250 50  0001 C CNN
	1    1250 6250
	-1   0    0    -1  
$EndComp
$Comp
L Device:Q_PNP_BCE Q2
U 1 1 5C022BDF
P 1250 6950
F 0 "Q2" H 1441 6904 50  0000 L CNN
F 1 "CZT2955 TR" H 1441 6995 50  0000 L CNN
F 2 "Package_TO_SOT_SMD:SOT-223-3_TabPin2" H 1450 7050 50  0001 C CNN
F 3 "~" H 1250 6950 50  0001 C CNN
	1    1250 6950
	-1   0    0    1   
$EndComp
Text Label 3250 5100 2    50   ~ 0
Vreg
Text Label 1900 6250 0    50   ~ 0
Vreg
$Comp
L Device:R_Small R3
U 1 1 5C02423C
P 1550 6250
F 0 "R3" V 1354 6250 50  0000 C CNN
F 1 "200" V 1445 6250 50  0000 C CNN
F 2 "Resistor_SMD:R_0805_2012Metric" H 1550 6250 50  0001 C CNN
F 3 "~" H 1550 6250 50  0001 C CNN
	1    1550 6250
	0    1    1    0   
$EndComp
$Comp
L Device:R_Small R2
U 1 1 5C0242C9
P 1150 6550
F 0 "R2" H 1091 6504 50  0000 R CNN
F 1 "22" H 1091 6595 50  0000 R CNN
F 2 "Resistor_SMD:R_2512_6332Metric" H 1150 6550 50  0001 C CNN
F 3 "~" H 1150 6550 50  0001 C CNN
	1    1150 6550
	-1   0    0    1   
$EndComp
$Comp
L Device:R_Small R1
U 1 1 5C024342
P 1150 5950
F 0 "R1" H 1091 5904 50  0000 R CNN
F 1 "100" H 1091 5995 50  0000 R CNN
F 2 "Resistor_THT:R_Axial_Power_L25.0mm_W6.4mm_P30.48mm" H 1150 5950 50  0001 C CNN
F 3 "~" H 1150 5950 50  0001 C CNN
	1    1150 5950
	-1   0    0    1   
$EndComp
Wire Wire Line
	1650 6250 1900 6250
$Comp
L power:+BATT #PWR011
U 1 1 5C024D26
P 1150 5650
F 0 "#PWR011" H 1150 5500 50  0001 C CNN
F 1 "+BATT" H 1165 5823 50  0000 C CNN
F 2 "" H 1150 5650 50  0001 C CNN
F 3 "" H 1150 5650 50  0001 C CNN
	1    1150 5650
	1    0    0    -1  
$EndComp
$Comp
L power:-BATT #PWR012
U 1 1 5C024DB3
P 1150 7150
F 0 "#PWR012" H 1150 7000 50  0001 C CNN
F 1 "-BATT" H 1165 7323 50  0000 C CNN
F 2 "" H 1150 7150 50  0001 C CNN
F 3 "" H 1150 7150 50  0001 C CNN
	1    1150 7150
	-1   0    0    1   
$EndComp
Wire Wire Line
	1150 6750 1150 6650
Wire Wire Line
	1450 6950 1900 6950
Text Label 1900 6950 0    50   ~ 0
gpio3
Text Label 3450 6950 2    50   ~ 0
gpio3
Text Notes 900  5350 0    50   ~ 0
200mA module Balancer
Wire Notes Line
	500  5200 2200 5200
Wire Notes Line
	2200 5200 2200 7600
Wire Notes Line
	2200 7600 500  7600
Wire Notes Line
	500  7600 500  5200
Text Notes 850  7500 0    50   ~ 0
Figure 43, page 70
$Comp
L Device:C_Small C1
U 1 1 5C025FC5
P 1650 6350
F 0 "C1" H 1742 6396 50  0000 L CNN
F 1 "1uF" H 1742 6305 50  0000 L CNN
F 2 "Capacitor_SMD:C_0805_2012Metric" H 1650 6350 50  0001 C CNN
F 3 "~" H 1650 6350 50  0001 C CNN
	1    1650 6350
	1    0    0    -1  
$EndComp
Connection ~ 1650 6250
$Comp
L power:GND #PWR013
U 1 1 5C0260A5
P 1650 6450
F 0 "#PWR013" H 1650 6200 50  0001 C CNN
F 1 "GND" H 1655 6277 50  0000 C CNN
F 2 "" H 1650 6450 50  0001 C CNN
F 3 "" H 1650 6450 50  0001 C CNN
	1    1650 6450
	1    0    0    -1  
$EndComp
$Comp
L power:GND #PWR015
U 1 1 5C0260F3
P 3050 7500
F 0 "#PWR015" H 3050 7250 50  0001 C CNN
F 1 "GND" H 3055 7327 50  0000 C CNN
F 2 "" H 3050 7500 50  0001 C CNN
F 3 "" H 3050 7500 50  0001 C CNN
	1    3050 7500
	1    0    0    -1  
$EndComp
$Comp
L power:-BATT #PWR014
U 1 1 5C026306
P 2850 7500
F 0 "#PWR014" H 2850 7350 50  0001 C CNN
F 1 "-BATT" H 2865 7673 50  0000 C CNN
F 2 "" H 2850 7500 50  0001 C CNN
F 3 "" H 2850 7500 50  0001 C CNN
	1    2850 7500
	-1   0    0    1   
$EndComp
Wire Wire Line
	3050 7500 2850 7500
Wire Wire Line
	3450 6050 3000 6050
Text Label 3000 6050 0    50   ~ 0
MOSI
Text Label 5250 1300 2    50   ~ 0
MOSI
Wire Wire Line
	5250 1300 4900 1300
$Comp
L power:GND #PWR020
U 1 1 5C02C237
P 5800 4050
F 0 "#PWR020" H 5800 3800 50  0001 C CNN
F 1 "GND" H 5805 3877 50  0000 C CNN
F 2 "" H 5800 4050 50  0001 C CNN
F 3 "" H 5800 4050 50  0001 C CNN
	1    5800 4050
	1    0    0    -1  
$EndComp
Wire Wire Line
	5800 4050 5450 4050
$Comp
L power:GND #PWR016
U 1 1 5C02CC96
P 3300 4300
F 0 "#PWR016" H 3300 4050 50  0001 C CNN
F 1 "GND" H 3305 4127 50  0000 C CNN
F 2 "" H 3300 4300 50  0001 C CNN
F 3 "" H 3300 4300 50  0001 C CNN
	1    3300 4300
	1    0    0    -1  
$EndComp
$Comp
L power:GND #PWR019
U 1 1 5C03AC0E
P 6500 7100
F 0 "#PWR019" H 6500 6850 50  0001 C CNN
F 1 "GND" H 6505 6927 50  0000 C CNN
F 2 "" H 6500 7100 50  0001 C CNN
F 3 "" H 6500 7100 50  0001 C CNN
	1    6500 7100
	1    0    0    -1  
$EndComp
Text Notes 5850 7250 0    50   ~ 0
Page88\n
$Comp
L Connector_Generic:Conn_01x13 J1
U 1 1 5C0640B0
P 7250 5650
F 0 "J1" H 7330 5692 50  0000 L CNN
F 1 "Conn_01x13" H 7330 5601 50  0000 L CNN
F 2 "Connector_JST:JST_EH_S13B-EH_1x13_P2.50mm_Horizontal" H 7250 5650 50  0001 C CNN
F 3 "~" H 7250 5650 50  0001 C CNN
	1    7250 5650
	1    0    0    1   
$EndComp
$Comp
L power:GND #PWR022
U 1 1 5C06415A
P 7050 6250
F 0 "#PWR022" H 7050 6000 50  0001 C CNN
F 1 "GND" H 7055 6077 50  0000 C CNN
F 2 "" H 7050 6250 50  0001 C CNN
F 3 "" H 7050 6250 50  0001 C CNN
	1    7050 6250
	1    0    0    -1  
$EndComp
$Comp
L power:+BATT #PWR021
U 1 1 5C08D4F8
P 7050 5050
F 0 "#PWR021" H 7050 4900 50  0001 C CNN
F 1 "+BATT" H 7065 5223 50  0000 C CNN
F 2 "" H 7050 5050 50  0001 C CNN
F 3 "" H 7050 5050 50  0001 C CNN
	1    7050 5050
	1    0    0    -1  
$EndComp
$Comp
L power:+5V #PWR023
U 1 1 5C08E8E2
P 3250 5000
F 0 "#PWR023" H 3250 4850 50  0001 C CNN
F 1 "+5V" H 3265 5173 50  0000 C CNN
F 2 "" H 3250 5000 50  0001 C CNN
F 3 "" H 3250 5000 50  0001 C CNN
	1    3250 5000
	1    0    0    -1  
$EndComp
Wire Wire Line
	3250 5000 3450 5000
$Comp
L power:+5V #PWR026
U 1 1 5C09289A
P 10000 1450
F 0 "#PWR026" H 10000 1300 50  0001 C CNN
F 1 "+5V" H 10015 1623 50  0000 C CNN
F 2 "" H 10000 1450 50  0001 C CNN
F 3 "" H 10000 1450 50  0001 C CNN
	1    10000 1450
	1    0    0    -1  
$EndComp
$Comp
L power:GND #PWR027
U 1 1 5C092BC9
P 10000 3400
F 0 "#PWR027" H 10000 3150 50  0001 C CNN
F 1 "GND" H 10000 3250 50  0000 C CNN
F 2 "" H 10000 3400 50  0001 C CNN
F 3 "" H 10000 3400 50  0001 C CNN
	1    10000 3400
	1    0    0    -1  
$EndComp
Wire Notes Line
	11150 500  9150 500 
Text Notes 9900 650  0    50   ~ 0
ISOLATER +5V and CAN
$Comp
L LoraNode-rescue:B0505S-1W-Accelerando U2
U 1 1 5C098122
P 9900 1100
F 0 "U2" V 10090 1738 50  0000 L CNN
F 1 "B0505S-1W" V 9999 1738 50  0000 L CNN
F 2 "Accelerando:B0505S" H 9900 1100 50  0001 C CNN
F 3 "" H 9900 1100 50  0001 C CNN
	1    9900 1100
	0    1    -1   0   
$EndComp
$Comp
L Interface_CAN_LIN:TJA1052i-1 U3
U 1 1 5C0987C4
P 10200 2800
F 0 "U3" H 10200 3578 50  0000 C CNN
F 1 "TJA1052i-1" H 9650 3400 50  0000 C CNN
F 2 "Package_SO:SOIC-16W_7.5x10.3mm_P1.27mm" H 10200 1900 50  0001 C CNN
F 3 "https://www.nxp.com/docs/en/data-sheet/TJA1052I.pdf" H 9900 3400 50  0001 C CNN
	1    10200 2800
	1    0    0    -1  
$EndComp
Wire Notes Line
	11150 4400 9150 4400
$Comp
L power:Earth #PWR029
U 1 1 5C0AD30A
P 10400 3400
F 0 "#PWR029" H 10400 3150 50  0001 C CNN
F 1 "Earth" H 10400 3250 50  0001 C CNN
F 2 "" H 10400 3400 50  0001 C CNN
F 3 "~" H 10400 3400 50  0001 C CNN
	1    10400 3400
	1    0    0    -1  
$EndComp
$Comp
L power:Earth #PWR030
U 1 1 5C0AD3A6
P 10450 1200
F 0 "#PWR030" H 10450 950 50  0001 C CNN
F 1 "Earth" H 10450 1050 50  0001 C CNN
F 2 "" H 10450 1200 50  0001 C CNN
F 3 "~" H 10450 1200 50  0001 C CNN
	1    10450 1200
	1    0    0    -1  
$EndComp
Wire Wire Line
	10350 1200 10350 1350
Wire Wire Line
	10350 1500 10400 1500
Wire Wire Line
	10150 1200 10150 1450
Wire Wire Line
	10150 1450 10000 1450
$Comp
L power:GND #PWR028
U 1 1 5C0B995E
P 10250 1200
F 0 "#PWR028" H 10250 950 50  0001 C CNN
F 1 "GND" H 10250 1050 50  0000 C CNN
F 2 "" H 10250 1200 50  0001 C CNN
F 3 "" H 10250 1200 50  0001 C CNN
	1    10250 1200
	1    0    0    -1  
$EndComp
$Comp
L Connector_Generic:Conn_01x04 J2
U 1 1 5C0B9A57
P 10950 1400
F 0 "J2" H 11030 1392 50  0000 L CNN
F 1 "Conn_01x04" H 11030 1301 50  0000 L CNN
F 2 "Connector_JST:JST_EH_S04B-EH_1x04_P2.50mm_Horizontal" H 10950 1400 50  0001 C CNN
F 3 "~" H 10950 1400 50  0001 C CNN
	1    10950 1400
	1    0    0    -1  
$EndComp
Wire Wire Line
	10350 1350 10650 1350
Wire Wire Line
	10650 1350 10650 1300
Wire Wire Line
	10650 1300 10750 1300
Connection ~ 10350 1350
Wire Wire Line
	10350 1350 10350 1500
Text Label 10350 1350 0    50   ~ 0
extPower
$Comp
L power:Earth #PWR031
U 1 1 5C0BE2F8
P 10600 1400
F 0 "#PWR031" H 10600 1150 50  0001 C CNN
F 1 "Earth" H 10600 1250 50  0001 C CNN
F 2 "" H 10600 1400 50  0001 C CNN
F 3 "~" H 10600 1400 50  0001 C CNN
	1    10600 1400
	1    0    0    -1  
$EndComp
Wire Wire Line
	10600 1400 10750 1400
Wire Wire Line
	10700 3400 10400 3400
Connection ~ 10400 3400
Wire Wire Line
	10700 2900 10850 2900
Wire Wire Line
	10700 2600 10700 2000
Wire Wire Line
	10700 1500 10750 1500
Text Label 10850 2900 0    50   ~ 0
CAN_L
Text Label 10700 2600 0    50   ~ 0
CAN_H
Text Label 10900 3450 0    50   ~ 0
CAN_L
Text Label 10900 3050 0    50   ~ 0
CAN_H
$Comp
L Device:R_Small R29
U 1 1 5C0D1B0D
P 10900 3350
F 0 "R29" H 10841 3304 50  0000 R CNN
F 1 "50" H 10841 3395 50  0000 R CNN
F 2 "Resistor_SMD:R_0805_2012Metric" H 10900 3350 50  0001 C CNN
F 3 "~" H 10900 3350 50  0001 C CNN
	1    10900 3350
	-1   0    0    1   
$EndComp
$Comp
L Device:R_Small R28
U 1 1 5C0D1EBA
P 10900 3150
F 0 "R28" H 10841 3104 50  0000 R CNN
F 1 "50" H 10841 3195 50  0000 R CNN
F 2 "Resistor_SMD:R_0805_2012Metric" H 10900 3150 50  0001 C CNN
F 3 "~" H 10900 3150 50  0001 C CNN
	1    10900 3150
	-1   0    0    1   
$EndComp
$Comp
L Device:C_Small C14
U 1 1 5C0D207E
P 10800 3250
F 0 "C14" V 10571 3250 50  0000 C CNN
F 1 "100nF" V 10662 3250 50  0000 C CNN
F 2 "Capacitor_SMD:C_0805_2012Metric" H 10800 3250 50  0001 C CNN
F 3 "~" H 10800 3250 50  0001 C CNN
	1    10800 3250
	0    1    1    0   
$EndComp
Wire Wire Line
	10700 3100 10700 3250
Connection ~ 10900 3250
Connection ~ 10700 3250
Wire Wire Line
	10700 3250 10700 3400
Text Label 9550 2600 2    50   ~ 0
CAN_TXD
Wire Wire Line
	9700 2600 9550 2600
Wire Wire Line
	9700 2900 9550 2900
Text Label 9550 2900 2    50   ~ 0
CAN_RXD
NoConn ~ 9700 3100
NoConn ~ 9700 3200
$Comp
L Jumper:Jumper_3_Bridged12 JP1
U 1 1 5C112281
P 3100 3750
F 0 "JP1" V 3146 3816 50  0000 L CNN
F 1 "DTEN" V 3055 3816 50  0000 L CNN
F 2 "Jumper:SolderJumper-3_P1.3mm_Bridged2Bar12_RoundedPad1.0x1.5mm" H 3100 3750 50  0001 C CNN
F 3 "~" H 3100 3750 50  0001 C CNN
	1    3100 3750
	0    -1   -1   0   
$EndComp
$Comp
L power:+5V #PWR024
U 1 1 5C11C9F6
P 3100 3500
F 0 "#PWR024" H 3100 3350 50  0001 C CNN
F 1 "+5V" H 3115 3673 50  0000 C CNN
F 2 "" H 3100 3500 50  0001 C CNN
F 3 "" H 3100 3500 50  0001 C CNN
	1    3100 3500
	1    0    0    -1  
$EndComp
$Comp
L Isolator:PC817 U4
U 1 1 5C129871
P 10250 4050
F 0 "U4" H 10250 4375 50  0000 C CNN
F 1 "PC817" H 10250 4284 50  0000 C CNN
F 2 "Package_DIP:DIP-4_W7.62mm" H 10050 3850 50  0001 L CIN
F 3 "http://www.soselectronic.cz/a_info/resource/d/pc817.pdf" H 10250 4050 50  0001 L CNN
	1    10250 4050
	1    0    0    -1  
$EndComp
$Comp
L Connector_Generic:Conn_01x02 J3
U 1 1 5C1299E6
P 11050 4000
F 0 "J3" H 11129 3998 50  0000 L CNN
F 1 "~fault" H 11129 3900 50  0000 L CNN
F 2 "Connector_JST:JST_EH_S02B-EH_1x02_P2.50mm_Horizontal" H 11050 4000 50  0001 C CNN
F 3 "~" H 11050 4000 50  0001 C CNN
	1    11050 4000
	1    0    0    -1  
$EndComp
Wire Wire Line
	10850 4000 10550 4000
Wire Wire Line
	10550 4000 10550 3950
Wire Wire Line
	10550 4150 10550 4100
Wire Wire Line
	10550 4100 10850 4100
$Comp
L power:GND #PWR025
U 1 1 5C1346B0
P 9950 4150
F 0 "#PWR025" H 9950 3900 50  0001 C CNN
F 1 "GND" H 9950 4000 50  0000 C CNN
F 2 "" H 9950 4150 50  0001 C CNN
F 3 "" H 9950 4150 50  0001 C CNN
	1    9950 4150
	1    0    0    -1  
$EndComp
Text Label 9550 3900 0    50   ~ 0
chargeOK
Wire Wire Line
	9550 3950 9550 3900
Wire Wire Line
	9550 3950 9950 3950
$Comp
L Regulator_Linear:AMS1117-5.0 U5
U 1 1 5C140D7B
P 10100 1600
F 0 "U5" V 10054 1704 50  0000 L CNN
F 1 "AMS1117-5.0" H 10350 1500 50  0000 L CNN
F 2 "Package_TO_SOT_SMD:SOT-223-3_TabPin2" H 10100 1800 50  0001 C CNN
F 3 "http://www.advanced-monolithic.com/pdf/ds1117.pdf" H 10200 1350 50  0001 C CNN
	1    10100 1600
	-1   0    0    -1  
$EndComp
Wire Wire Line
	10400 1500 10400 1600
$Comp
L power:Earth #PWR034
U 1 1 5C15CC39
P 10700 1900
F 0 "#PWR034" H 10700 1650 50  0001 C CNN
F 1 "Earth" H 10700 1750 50  0001 C CNN
F 2 "" H 10700 1900 50  0001 C CNN
F 3 "~" H 10700 1900 50  0001 C CNN
	1    10700 1900
	1    0    0    -1  
$EndComp
Wire Wire Line
	10700 2000 10750 2000
Wire Wire Line
	10750 2000 10750 1850
Wire Wire Line
	10750 1850 10700 1850
Wire Wire Line
	10700 1850 10700 1500
Wire Wire Line
	10750 1600 10750 1800
Wire Wire Line
	10750 1800 10850 1800
Wire Wire Line
	10850 1800 10850 2900
Text Notes 8750 1950 0    50   ~ 0
short 2 and 3 \nif using 5v ext power
$Comp
L power:+5V #PWR0101
U 1 1 5C1692DF
P 10000 2200
F 0 "#PWR0101" H 10000 2050 50  0001 C CNN
F 1 "+5V" H 10015 2373 50  0000 C CNN
F 2 "" H 10000 2200 50  0001 C CNN
F 3 "" H 10000 2200 50  0001 C CNN
	1    10000 2200
	1    0    0    -1  
$EndComp
Wire Notes Line
	9150 500  9150 4400
Wire Notes Line
	11150 500  11150 4400
$Comp
L Device:Thermistor_NTC TH-Bal1
U 1 1 5C175F00
P 700 2800
F 0 "TH-Bal1" H 797 2846 50  0000 L CNN
F 1 "10k" H 797 2755 50  0000 L CNN
F 2 "Resistor_SMD:R_0805_2012Metric" H 700 2850 50  0001 C CNN
F 3 "~" H 700 2850 50  0001 C CNN
	1    700  2800
	1    0    0    -1  
$EndComp
$Comp
L Device:Thermistor_NTC TH2
U 1 1 5C176028
P 1100 2800
F 0 "TH2" H 1197 2846 50  0000 L CNN
F 1 "10k" H 1197 2755 50  0000 L CNN
F 2 "Connector_JST:JST_EH_S02B-EH_1x02_P2.50mm_Horizontal" H 1100 2850 50  0001 C CNN
F 3 "~" H 1100 2850 50  0001 C CNN
	1    1100 2800
	1    0    0    -1  
$EndComp
$Comp
L Device:Thermistor_NTC TH3
U 1 1 5C1760F0
P 1450 2800
F 0 "TH3" H 1547 2846 50  0000 L CNN
F 1 "10k" H 1547 2755 50  0000 L CNN
F 2 "Connector_JST:JST_EH_S02B-EH_1x02_P2.50mm_Horizontal" H 1450 2850 50  0001 C CNN
F 3 "~" H 1450 2850 50  0001 C CNN
	1    1450 2800
	1    0    0    -1  
$EndComp
$Comp
L Device:Thermistor_NTC TH4-Bypass1
U 1 1 5C17635A
P 1800 2800
F 0 "TH4-Bypass1" H 1897 2846 50  0000 L CNN
F 1 "10k" H 1897 2755 50  0000 L CNN
F 2 "Resistor_SMD:R_0805_2012Metric" H 1800 2850 50  0001 C CNN
F 3 "~" H 1800 2850 50  0001 C CNN
	1    1800 2800
	1    0    0    -1  
$EndComp
$Comp
L Device:R_Small R30
U 1 1 5C17669C
P 700 2350
F 0 "R30" H 641 2304 50  0000 R CNN
F 1 "10k" H 641 2395 50  0000 R CNN
F 2 "Resistor_SMD:R_0805_2012Metric" H 700 2350 50  0001 C CNN
F 3 "~" H 700 2350 50  0001 C CNN
	1    700  2350
	-1   0    0    1   
$EndComp
$Comp
L Device:R_Small R31
U 1 1 5C176778
P 1100 2350
F 0 "R31" H 1041 2304 50  0000 R CNN
F 1 "10k" H 1041 2395 50  0000 R CNN
F 2 "Resistor_SMD:R_0805_2012Metric" H 1100 2350 50  0001 C CNN
F 3 "~" H 1100 2350 50  0001 C CNN
	1    1100 2350
	-1   0    0    1   
$EndComp
$Comp
L Device:R_Small R32
U 1 1 5C17683C
P 1450 2350
F 0 "R32" H 1391 2304 50  0000 R CNN
F 1 "10k" H 1391 2395 50  0000 R CNN
F 2 "Resistor_SMD:R_0805_2012Metric" H 1450 2350 50  0001 C CNN
F 3 "~" H 1450 2350 50  0001 C CNN
	1    1450 2350
	-1   0    0    1   
$EndComp
$Comp
L Device:R_Small R33
U 1 1 5C1768FA
P 1800 2350
F 0 "R33" H 1741 2304 50  0000 R CNN
F 1 "10k" H 1741 2395 50  0000 R CNN
F 2 "Resistor_SMD:R_0805_2012Metric" H 1800 2350 50  0001 C CNN
F 3 "~" H 1800 2350 50  0001 C CNN
	1    1800 2350
	-1   0    0    1   
$EndComp
Wire Wire Line
	700  2650 700  2450
Wire Wire Line
	1100 2650 1100 2450
Wire Wire Line
	1450 2450 1450 2650
Wire Wire Line
	1800 2450 1800 2650
Wire Wire Line
	1800 2950 1450 2950
Connection ~ 1100 2950
Wire Wire Line
	1100 2950 700  2950
Connection ~ 1450 2950
Wire Wire Line
	1450 2950 1100 2950
Wire Wire Line
	700  2250 1100 2250
Connection ~ 1100 2250
Wire Wire Line
	1100 2250 1450 2250
Connection ~ 1450 2250
Wire Wire Line
	1450 2250 1800 2250
$Comp
L power:GND #PWR0102
U 1 1 5C19B3D2
P 700 2950
F 0 "#PWR0102" H 700 2700 50  0001 C CNN
F 1 "GND" H 705 2777 50  0000 C CNN
F 2 "" H 700 2950 50  0001 C CNN
F 3 "" H 700 2950 50  0001 C CNN
	1    700  2950
	1    0    0    -1  
$EndComp
Connection ~ 700  2950
Text Label 700  2250 0    50   ~ 0
Vref2
Text Label 5450 4250 0    50   ~ 0
Vref2
$Comp
L Device:C_Small C15
U 1 1 5C19B8DB
P 5450 4350
F 0 "C15" H 5542 4396 50  0000 L CNN
F 1 "100nF" H 5542 4305 50  0000 L CNN
F 2 "Capacitor_SMD:C_0805_2012Metric" H 5450 4350 50  0001 C CNN
F 3 "~" H 5450 4350 50  0001 C CNN
	1    5450 4350
	1    0    0    -1  
$EndComp
$Comp
L Device:C_Small C16
U 1 1 5C19B9AD
P 5800 4350
F 0 "C16" H 5892 4396 50  0000 L CNN
F 1 "100nF" H 5892 4305 50  0000 L CNN
F 2 "Capacitor_SMD:C_0805_2012Metric" H 5800 4350 50  0001 C CNN
F 3 "~" H 5800 4350 50  0001 C CNN
	1    5800 4350
	1    0    0    -1  
$EndComp
$Comp
L Device:C_Small C17
U 1 1 5C19BA75
P 6150 4350
F 0 "C17" H 6242 4396 50  0000 L CNN
F 1 "100nF" H 6242 4305 50  0000 L CNN
F 2 "Capacitor_SMD:C_0805_2012Metric" H 6150 4350 50  0001 C CNN
F 3 "~" H 6150 4350 50  0001 C CNN
	1    6150 4350
	1    0    0    -1  
$EndComp
Wire Wire Line
	6150 4450 5800 4450
Connection ~ 5800 4450
Wire Wire Line
	5800 4450 5450 4450
$Comp
L power:GND #PWR0103
U 1 1 5C1A2C7F
P 5450 4450
F 0 "#PWR0103" H 5450 4200 50  0001 C CNN
F 1 "GND" H 5455 4277 50  0000 C CNN
F 2 "" H 5450 4450 50  0001 C CNN
F 3 "" H 5450 4450 50  0001 C CNN
	1    5450 4450
	1    0    0    -1  
$EndComp
Connection ~ 5450 4450
Wire Wire Line
	5450 4150 5800 4150
Wire Wire Line
	5800 4150 5800 4250
Wire Wire Line
	6150 4250 6150 3950
Wire Wire Line
	6150 3950 5450 3950
Text Label 700  2500 0    50   ~ 0
GPIO1
Text Label 1100 2500 0    50   ~ 0
GPIO2
Text Label 1800 2500 0    50   ~ 0
GPIO5
Text Label 1450 2500 0    50   ~ 0
GPIO4
Text Label 3450 6750 2    50   ~ 0
GPIO1
Text Label 3450 6850 2    50   ~ 0
GPIO2
Text Label 3450 7050 2    50   ~ 0
GPIO4
Text Label 3450 7150 2    50   ~ 0
GPIO5
$Comp
L power:+5VP #PWR0104
U 1 1 5C02E461
P 9800 1600
F 0 "#PWR0104" H 9800 1450 50  0001 C CNN
F 1 "+5VP" H 9815 1773 50  0000 C CNN
F 2 "" H 9800 1600 50  0001 C CNN
F 3 "" H 9800 1600 50  0001 C CNN
	1    9800 1600
	1    0    0    -1  
$EndComp
$Comp
L power:+5VP #PWR0105
U 1 1 5C02EFD7
P 10400 2200
F 0 "#PWR0105" H 10400 2050 50  0001 C CNN
F 1 "+5VP" H 10415 2373 50  0000 C CNN
F 2 "" H 10400 2200 50  0001 C CNN
F 3 "" H 10400 2200 50  0001 C CNN
	1    10400 2200
	1    0    0    -1  
$EndComp
$Comp
L power:+5VP #PWR0106
U 1 1 5C02F1A9
P 10750 5250
F 0 "#PWR0106" H 10750 5100 50  0001 C CNN
F 1 "+5VP" H 10765 5423 50  0000 C CNN
F 2 "" H 10750 5250 50  0001 C CNN
F 3 "" H 10750 5250 50  0001 C CNN
	1    10750 5250
	1    0    0    -1  
$EndComp
$Comp
L power:+5V #PWR0107
U 1 1 5C03757D
P 8800 5550
F 0 "#PWR0107" H 8800 5400 50  0001 C CNN
F 1 "+5V" H 8815 5723 50  0000 C CNN
F 2 "" H 8800 5550 50  0001 C CNN
F 3 "" H 8800 5550 50  0001 C CNN
	1    8800 5550
	1    0    0    -1  
$EndComp
$Comp
L Connector_Generic:Conn_01x04 J102
U 1 1 5C03810A
P 10800 5600
F 0 "J102" H 10880 5592 50  0000 L CNN
F 1 "Conn_01x04" H 10880 5501 50  0000 L CNN
F 2 "Connector_JST:JST_EH_S04B-EH_1x04_P2.50mm_Horizontal" H 10800 5600 50  0001 C CNN
F 3 "~" H 10800 5600 50  0001 C CNN
	1    10800 5600
	1    0    0    1   
$EndComp
Wire Wire Line
	10600 5700 10600 5800
$Comp
L power:GND #PWR0108
U 1 1 5C0583AE
P 8800 6300
F 0 "#PWR0108" H 8800 6050 50  0001 C CNN
F 1 "GND" H 8800 6150 50  0000 C CNN
F 2 "" H 8800 6300 50  0001 C CNN
F 3 "" H 8800 6300 50  0001 C CNN
	1    8800 6300
	1    0    0    -1  
$EndComp
$Comp
L power:Earth #PWR0109
U 1 1 5C0588A5
P 10600 6300
F 0 "#PWR0109" H 10600 6050 50  0001 C CNN
F 1 "Earth" H 10600 6150 50  0001 C CNN
F 2 "" H 10600 6300 50  0001 C CNN
F 3 "~" H 10600 6300 50  0001 C CNN
	1    10600 6300
	1    0    0    -1  
$EndComp
$Comp
L LoraNode-rescue:MAX14946EWE+T-Accelerando U101
U 1 1 5C05977F
P 9700 5800
F 0 "U101" H 9700 6570 50  0000 C CNN
F 1 "MAX14946EWE+T" H 9700 6479 50  0000 C CNN
F 2 "Package_SO:SOIC-16W_7.5x10.3mm_P1.27mm" H 9700 5800 50  0001 L BNN
F 3 "Unavailable" H 9850 6450 50  0001 L BNN
F 4 "2.75KV Isolated 500kbps Half-Duplex RS-485 Transceiver with +/-30KV ESD and Inte" H 9700 5800 50  0001 L BNN "Field4"
F 5 "Maxim Integrated" H 9800 6550 50  0001 L BNN "Field6"
F 6 "None" H 9700 5800 50  0001 L BNN "Field7"
F 7 "MAX14946EWE+T" H 9700 5800 50  0001 L BNN "Field8"
	1    9700 5800
	1    0    0    -1  
$EndComp
Wire Wire Line
	10600 6100 10600 6200
Connection ~ 10600 6200
Wire Wire Line
	10600 6200 10600 6300
Wire Wire Line
	10600 6100 10700 6100
Wire Wire Line
	10700 6100 10700 5800
Wire Wire Line
	10700 5800 10600 5800
Connection ~ 10600 6100
Wire Wire Line
	10600 5350 10750 5350
Wire Wire Line
	10750 5350 10750 5250
Connection ~ 10600 6300
$Comp
L Device:R_Pack04 RN101
U 1 1 5C10F635
P 6300 4900
F 0 "RN101" V 5883 4900 50  0000 C CNN
F 1 "R_Pack04" V 5974 4900 50  0000 C CNN
F 2 "Resistor_SMD:R_Array_Convex_4x1206" V 6575 4900 50  0001 C CNN
F 3 "~" H 6300 4900 50  0001 C CNN
	1    6300 4900
	0    -1   1    0   
$EndComp
Wire Wire Line
	6100 4800 5450 4800
Wire Wire Line
	6100 5000 5450 5000
$Comp
L Device:R_Pack04 RN102
U 1 1 5C158BCB
P 6300 5300
F 0 "RN102" V 5883 5300 50  0000 C CNN
F 1 "R_Pack04" V 5974 5300 50  0000 C CNN
F 2 "Resistor_SMD:R_Array_Convex_4x1206" V 6575 5300 50  0001 C CNN
F 3 "~" H 6300 5300 50  0001 C CNN
	1    6300 5300
	0    -1   1    0   
$EndComp
Wire Wire Line
	5450 5200 6100 5200
Wire Wire Line
	5450 5400 6100 5400
Wire Wire Line
	7050 5150 6900 5150
Wire Wire Line
	7050 5250 6850 5250
Wire Wire Line
	6500 5100 6500 5200
Connection ~ 6500 5200
Wire Wire Line
	6500 5300 6500 5350
$Comp
L Device:R_Pack04 RN103
U 1 1 5C1E8D41
P 6300 5700
F 0 "RN103" V 5883 5700 50  0000 C CNN
F 1 "R_Pack04" V 5974 5700 50  0000 C CNN
F 2 "Resistor_SMD:R_Array_Convex_4x1206" V 6575 5700 50  0001 C CNN
F 3 "~" H 6300 5700 50  0001 C CNN
	1    6300 5700
	0    -1   1    0   
$EndComp
$Comp
L Device:R_Pack04 RN104
U 1 1 5C1E8FBD
P 6300 6100
F 0 "RN104" V 5883 6100 50  0000 C CNN
F 1 "R_Pack04" V 5974 6100 50  0000 C CNN
F 2 "Resistor_SMD:R_Array_Convex_4x1206" V 6575 6100 50  0001 C CNN
F 3 "~" H 6300 6100 50  0001 C CNN
	1    6300 6100
	0    -1   1    0   
$EndComp
$Comp
L Device:R_Pack04 RN105
U 1 1 5C1E9837
P 6300 6500
F 0 "RN105" V 5883 6500 50  0000 C CNN
F 1 "R_Pack04" V 5974 6500 50  0000 C CNN
F 2 "Resistor_SMD:R_Array_Convex_4x1206" V 6575 6500 50  0001 C CNN
F 3 "~" H 6300 6500 50  0001 C CNN
	1    6300 6500
	0    -1   1    0   
$EndComp
$Comp
L Device:R_Pack04 RN106
U 1 1 5C1E98DF
P 6300 6900
F 0 "RN106" V 5883 6900 50  0000 C CNN
F 1 "R_Pack04" V 5974 6900 50  0000 C CNN
F 2 "Resistor_SMD:R_Array_Convex_4x1206" V 6575 6900 50  0001 C CNN
F 3 "~" H 6300 6900 50  0001 C CNN
	1    6300 6900
	0    -1   1    0   
$EndComp
Wire Wire Line
	5450 7000 6100 7000
Wire Wire Line
	6100 6800 5450 6800
Wire Wire Line
	6100 6600 5450 6600
Wire Wire Line
	6100 6400 5450 6400
Wire Wire Line
	5450 6200 6100 6200
Wire Wire Line
	6100 6000 5450 6000
Wire Wire Line
	6100 5800 5450 5800
Wire Wire Line
	6100 5600 5450 5600
Wire Wire Line
	6500 5700 6500 5800
Wire Wire Line
	6500 5700 6550 5700
Connection ~ 6500 5700
Wire Wire Line
	6500 5900 6500 6000
Connection ~ 6500 5900
Wire Wire Line
	6500 6100 6500 6200
Wire Wire Line
	6500 6300 6500 6400
Wire Wire Line
	6500 6500 6500 6600
Wire Wire Line
	6500 6700 6500 6800
Wire Wire Line
	6500 6900 6500 7000
Connection ~ 6500 6900
Connection ~ 6500 6700
Connection ~ 6500 6500
Wire Wire Line
	6500 5500 6500 5600
Wire Wire Line
	7050 5050 6950 5050
Wire Wire Line
	6950 5050 6950 4800
Wire Wire Line
	6500 4800 6950 4800
Connection ~ 7050 5050
Wire Wire Line
	6900 5150 6900 5000
Wire Wire Line
	6500 5000 6900 5000
Wire Wire Line
	6850 5250 6850 5200
Wire Wire Line
	6500 5200 6850 5200
Wire Wire Line
	6550 5550 7050 5550
Wire Wire Line
	6550 5550 6550 5700
Wire Wire Line
	6600 5650 7050 5650
Wire Wire Line
	6500 6100 6650 6100
Wire Wire Line
	6650 6100 6650 5750
Wire Wire Line
	6650 5750 7050 5750
Connection ~ 6500 6100
Wire Wire Line
	6500 6300 6700 6300
Wire Wire Line
	6700 6300 6700 5850
Wire Wire Line
	6700 5850 7050 5850
Connection ~ 6500 6300
Wire Wire Line
	6750 6500 6750 5950
Wire Wire Line
	6750 5950 7050 5950
Wire Wire Line
	6500 6500 6750 6500
Wire Wire Line
	6800 6700 6800 6050
Wire Wire Line
	6800 6050 7050 6050
Wire Wire Line
	6500 6700 6800 6700
Wire Wire Line
	6850 6900 6850 6150
Wire Wire Line
	6850 6150 7050 6150
Wire Wire Line
	6500 6900 6850 6900
Wire Wire Line
	6500 5900 6600 5900
Wire Wire Line
	6600 5650 6600 5900
Wire Wire Line
	6500 5500 6500 5450
Wire Wire Line
	6500 5450 7050 5450
Connection ~ 6500 5500
Wire Wire Line
	6500 5350 7050 5350
Connection ~ 6500 5350
Wire Wire Line
	6500 5350 6500 5400
$Comp
L Device:R_Small R103
U 1 1 5C36A056
P 6300 7100
F 0 "R103" H 6241 7054 50  0000 R CNN
F 1 "30" V 6200 7200 50  0000 R CNN
F 2 "Resistor_SMD:R_0805_2012Metric" H 6300 7100 50  0001 C CNN
F 3 "~" H 6300 7100 50  0001 C CNN
	1    6300 7100
	0    -1   -1   0   
$EndComp
Wire Wire Line
	6400 7100 6500 7100
$Comp
L Device:R_Small R104
U 1 1 5C37DCCC
P 6300 4550
F 0 "R104" H 6241 4504 50  0000 R CNN
F 1 "100" V 6300 4800 50  0000 R CNN
F 2 "Resistor_SMD:R_0805_2012Metric" H 6300 4550 50  0001 C CNN
F 3 "~" H 6300 4550 50  0001 C CNN
	1    6300 4550
	0    -1   -1   0   
$EndComp
Wire Wire Line
	6400 4550 6500 4550
Wire Wire Line
	6500 4550 6500 4700
Wire Wire Line
	6200 4550 6200 3950
Wire Wire Line
	6200 3950 6150 3950
Connection ~ 6150 3950
Wire Wire Line
	5450 4700 5600 4700
Wire Wire Line
	5450 4900 5600 4900
Wire Wire Line
	5450 5100 5600 5100
Wire Wire Line
	5450 5300 5600 5300
Wire Wire Line
	5450 5500 5600 5500
Wire Wire Line
	5450 5700 5600 5700
Wire Wire Line
	5450 5900 5600 5900
Wire Wire Line
	5450 6100 5600 6100
Wire Wire Line
	5450 6300 5600 6300
Wire Wire Line
	5450 6500 5600 6500
Wire Wire Line
	5450 6700 5600 6700
Wire Wire Line
	5450 6900 5600 6900
Wire Wire Line
	5450 7100 5600 7100
$Comp
L Device:C_Small C101
U 1 1 5C391920
P 5600 4800
F 0 "C101" H 5692 4846 50  0000 L CNN
F 1 "100nF" H 5692 4755 50  0000 L CNN
F 2 "Capacitor_SMD:C_0805_2012Metric" H 5600 4800 50  0001 C CNN
F 3 "~" H 5600 4800 50  0001 C CNN
	1    5600 4800
	1    0    0    -1  
$EndComp
Connection ~ 5600 4700
Wire Wire Line
	5600 4700 6100 4700
Connection ~ 5600 4900
Wire Wire Line
	5600 4900 6100 4900
$Comp
L Device:C_Small C102
U 1 1 5C3919BA
P 5600 5000
F 0 "C102" H 5692 5046 50  0000 L CNN
F 1 "100nF" H 5692 4955 50  0000 L CNN
F 2 "Capacitor_SMD:C_0805_2012Metric" H 5600 5000 50  0001 C CNN
F 3 "~" H 5600 5000 50  0001 C CNN
	1    5600 5000
	1    0    0    -1  
$EndComp
Connection ~ 5600 5100
Wire Wire Line
	5600 5100 6100 5100
$Comp
L Device:C_Small C103
U 1 1 5C391A4E
P 5600 5200
F 0 "C103" H 5692 5246 50  0000 L CNN
F 1 "100nF" H 5692 5155 50  0000 L CNN
F 2 "Capacitor_SMD:C_0805_2012Metric" H 5600 5200 50  0001 C CNN
F 3 "~" H 5600 5200 50  0001 C CNN
	1    5600 5200
	1    0    0    -1  
$EndComp
Connection ~ 5600 5300
Wire Wire Line
	5600 5300 6100 5300
$Comp
L Device:C_Small C107
U 1 1 5C391AE4
P 5600 5400
F 0 "C107" H 5692 5446 50  0000 L CNN
F 1 "100nF" H 5692 5355 50  0000 L CNN
F 2 "Capacitor_SMD:C_0805_2012Metric" H 5600 5400 50  0001 C CNN
F 3 "~" H 5600 5400 50  0001 C CNN
	1    5600 5400
	1    0    0    -1  
$EndComp
Connection ~ 5600 5500
Wire Wire Line
	5600 5500 6100 5500
$Comp
L Device:C_Small C108
U 1 1 5C391B78
P 5600 5600
F 0 "C108" H 5692 5646 50  0000 L CNN
F 1 "100nF" H 5692 5555 50  0000 L CNN
F 2 "Capacitor_SMD:C_0805_2012Metric" H 5600 5600 50  0001 C CNN
F 3 "~" H 5600 5600 50  0001 C CNN
	1    5600 5600
	1    0    0    -1  
$EndComp
Connection ~ 5600 5700
Wire Wire Line
	5600 5700 6100 5700
$Comp
L Device:C_Small C109
U 1 1 5C391C0E
P 5600 5800
F 0 "C109" H 5692 5846 50  0000 L CNN
F 1 "100nF" H 5692 5755 50  0000 L CNN
F 2 "Capacitor_SMD:C_0805_2012Metric" H 5600 5800 50  0001 C CNN
F 3 "~" H 5600 5800 50  0001 C CNN
	1    5600 5800
	1    0    0    -1  
$EndComp
Connection ~ 5600 5900
Wire Wire Line
	5600 5900 6100 5900
$Comp
L Device:C_Small C110
U 1 1 5C391CA6
P 5600 6000
F 0 "C110" H 5692 6046 50  0000 L CNN
F 1 "100nF" H 5692 5955 50  0000 L CNN
F 2 "Capacitor_SMD:C_0805_2012Metric" H 5600 6000 50  0001 C CNN
F 3 "~" H 5600 6000 50  0001 C CNN
	1    5600 6000
	1    0    0    -1  
$EndComp
Connection ~ 5600 6100
Wire Wire Line
	5600 6100 6100 6100
$Comp
L Device:C_Small C111
U 1 1 5C391ED0
P 5600 6200
F 0 "C111" H 5692 6246 50  0000 L CNN
F 1 "100nF" H 5692 6155 50  0000 L CNN
F 2 "Capacitor_SMD:C_0805_2012Metric" H 5600 6200 50  0001 C CNN
F 3 "~" H 5600 6200 50  0001 C CNN
	1    5600 6200
	1    0    0    -1  
$EndComp
Connection ~ 5600 6300
Wire Wire Line
	5600 6300 6100 6300
$Comp
L Device:C_Small C112
U 1 1 5C391F70
P 5600 6400
F 0 "C112" H 5692 6446 50  0000 L CNN
F 1 "100nF" H 5692 6355 50  0000 L CNN
F 2 "Capacitor_SMD:C_0805_2012Metric" H 5600 6400 50  0001 C CNN
F 3 "~" H 5600 6400 50  0001 C CNN
	1    5600 6400
	1    0    0    -1  
$EndComp
Connection ~ 5600 6500
Wire Wire Line
	5600 6500 6100 6500
$Comp
L Device:C_Small C113
U 1 1 5C39200E
P 5600 6600
F 0 "C113" H 5692 6646 50  0000 L CNN
F 1 "100nF" H 5692 6555 50  0000 L CNN
F 2 "Capacitor_SMD:C_0805_2012Metric" H 5600 6600 50  0001 C CNN
F 3 "~" H 5600 6600 50  0001 C CNN
	1    5600 6600
	1    0    0    -1  
$EndComp
Connection ~ 5600 6700
Wire Wire Line
	5600 6700 6100 6700
$Comp
L Device:C_Small C114
U 1 1 5C3920AE
P 5600 6800
F 0 "C114" H 5692 6846 50  0000 L CNN
F 1 "100nF" H 5692 6755 50  0000 L CNN
F 2 "Capacitor_SMD:C_0805_2012Metric" H 5600 6800 50  0001 C CNN
F 3 "~" H 5600 6800 50  0001 C CNN
	1    5600 6800
	1    0    0    -1  
$EndComp
Connection ~ 5600 6900
Wire Wire Line
	5600 6900 6100 6900
$Comp
L Device:C_Small C115
U 1 1 5C392154
P 5600 7000
F 0 "C115" H 5692 7046 50  0000 L CNN
F 1 "100nF" H 5692 6955 50  0000 L CNN
F 2 "Capacitor_SMD:C_0805_2012Metric" H 5600 7000 50  0001 C CNN
F 3 "~" H 5600 7000 50  0001 C CNN
	1    5600 7000
	1    0    0    -1  
$EndComp
Connection ~ 5600 7100
Wire Wire Line
	5600 7100 6200 7100
Text Notes 600  5750 0    50   ~ 0
8Whatts \nbetween both\n
Text Notes 850  6600 0    50   ~ 0
0.8W??
$Comp
L Device:R_Small R105
U 1 1 5C39404E
P 1150 5750
F 0 "R105" H 1091 5704 50  0000 R CNN
F 1 "100" H 1091 5795 50  0000 R CNN
F 2 "Resistor_THT:R_Axial_Power_L25.0mm_W6.4mm_P30.48mm" H 1150 5750 50  0001 C CNN
F 3 "~" H 1150 5750 50  0001 C CNN
	1    1150 5750
	-1   0    0    1   
$EndComp
Text Label 3050 2250 2    50   ~ 0
CAN_TXD
Text Label 3050 2150 2    50   ~ 0
CAN_RXD
Text Label 8800 5900 2    50   ~ 0
MOD_TXD
Text Label 8800 5700 2    50   ~ 0
MOD_RXD
Text Label 8800 5800 2    50   ~ 0
MOD_RE
Text Label 8800 6000 2    50   ~ 0
MOD_DE
Text Label 3050 2350 2    50   ~ 0
MOD_TXD
Text Label 3050 2650 2    50   ~ 0
MOD_RXD
Text Label 3050 2550 2    50   ~ 0
MOD_RE
Text Label 3050 2450 2    50   ~ 0
MOD_DE
Text Label 5350 2200 2    60   ~ 0
LED1
Wire Wire Line
	5350 2200 4900 2200
Text Label 2650 2050 0    50   ~ 0
chargeOK
Wire Wire Line
	3050 2050 2650 2050
Text Label 5450 7100 0    50   ~ 0
C0
Text Label 5450 6900 0    50   ~ 0
C1
Text Label 5450 6700 0    50   ~ 0
C2
Text Label 5450 6500 0    50   ~ 0
C3
Text Label 5450 6300 0    50   ~ 0
C4
Text Label 5450 6100 0    50   ~ 0
C5
Text Label 5450 5900 0    50   ~ 0
C6
Text Label 5450 5700 0    50   ~ 0
C7
Text Label 5450 5500 0    50   ~ 0
C8
Text Label 5450 5300 0    50   ~ 0
C9
Text Label 5450 5100 0    50   ~ 0
C10
Text Label 5450 4900 0    50   ~ 0
C11
Text Label 5450 4700 0    50   ~ 0
C12
$Comp
L Device:R R109
U 1 1 5C04683B
P 2750 6000
F 0 "R109" V 2830 6000 50  0000 C CNN
F 1 "10k" V 2750 6000 50  0000 C CNN
F 2 "Resistor_SMD:R_0805_2012Metric" V 2680 6000 50  0001 C CNN
F 3 "" H 2750 6000 50  0001 C CNN
	1    2750 6000
	-1   0    0    1   
$EndComp
$Comp
L power:+3.3V #PWR0112
U 1 1 5C046C7D
P 2750 5850
F 0 "#PWR0112" H 2750 5700 50  0001 C CNN
F 1 "+3.3V" H 2750 5990 50  0000 C CNN
F 2 "" H 2750 5850 50  0001 C CNN
F 3 "" H 2750 5850 50  0001 C CNN
	1    2750 5850
	1    0    0    -1  
$EndComp
$Comp
L Regulator_Linear:AMS1117-3.3 U102
U 1 1 5C04806F
P 7100 850
F 0 "U102" H 7100 1092 50  0000 C CNN
F 1 "AMS1117-3.3" H 7100 1001 50  0000 C CNN
F 2 "Package_TO_SOT_SMD:SOT-223-3_TabPin2" H 7100 1050 50  0001 C CNN
F 3 "http://www.advanced-monolithic.com/pdf/ds1117.pdf" H 7200 600 50  0001 C CNN
	1    7100 850 
	1    0    0    -1  
$EndComp
$Comp
L power:+3.3V #PWR0115
U 1 1 5C048203
P 7400 850
F 0 "#PWR0115" H 7400 700 50  0001 C CNN
F 1 "+3.3V" H 7400 990 50  0000 C CNN
F 2 "" H 7400 850 50  0001 C CNN
F 3 "" H 7400 850 50  0001 C CNN
	1    7400 850 
	1    0    0    -1  
$EndComp
$Comp
L power:+5V #PWR0113
U 1 1 5C049CAC
P 6800 850
F 0 "#PWR0113" H 6800 700 50  0001 C CNN
F 1 "+5V" H 6815 1023 50  0000 C CNN
F 2 "" H 6800 850 50  0001 C CNN
F 3 "" H 6800 850 50  0001 C CNN
	1    6800 850 
	1    0    0    -1  
$EndComp
$Comp
L power:GND #PWR0114
U 1 1 5C04AA03
P 7100 1150
F 0 "#PWR0114" H 7100 900 50  0001 C CNN
F 1 "GND" H 7100 1000 50  0000 C CNN
F 2 "" H 7100 1150 50  0001 C CNN
F 3 "" H 7100 1150 50  0001 C CNN
	1    7100 1150
	1    0    0    -1  
$EndComp
$Comp
L Device:C_Small C116
U 1 1 5C04BA88
P 3450 5100
F 0 "C116" H 3542 5146 50  0000 L CNN
F 1 "22uF" H 3542 5055 50  0000 L CNN
F 2 "Capacitor_SMD:C_0805_2012Metric" H 3450 5100 50  0001 C CNN
F 3 "~" H 3450 5100 50  0001 C CNN
	1    3450 5100
	1    0    0    -1  
$EndComp
$Comp
L power:GND #PWR0111
U 1 1 5C04CCA5
P 3450 5200
F 0 "#PWR0111" H 3450 4950 50  0001 C CNN
F 1 "GND" H 3455 5027 50  0000 C CNN
F 2 "" H 3450 5200 50  0001 C CNN
F 3 "" H 3450 5200 50  0001 C CNN
	1    3450 5200
	1    0    0    -1  
$EndComp
Connection ~ 3450 5000
$Comp
L LoraNode-rescue:LTC6811IG-2#PBF-BradleyKing U1
U 1 1 5C02201A
P 4450 5550
F 0 "U1" H 4336 7417 50  0000 C CNN
F 1 "LTC6811IG-2#PBF" H 4336 7326 50  0000 C CNN
F 2 "Package_SO:TSSOP-48_6.1x12.5mm_P0.5mm" H 4450 5550 50  0001 L BNN
F 3 "https://www.analog.com/media/en/technical-documentation/data-sheets/68111fb.pdf" H 4450 5550 50  0001 L BNN
F 4 "Linear Technology/Analog" H 4450 5550 50  0001 L BNN "Field4"
F 5 "FSOP-48 Analog Devices" H 4450 5550 50  0001 L BNN "Field5"
F 6 "Unavailable" H 4450 5550 50  0001 L BNN "Field6"
F 7 "None" H 4450 5550 50  0001 L BNN "Field7"
F 8 "LTC6811IG-2#PBF" H 4450 5550 50  0001 L BNN "Field8"
	1    4450 5550
	1    0    0    -1  
$EndComp
Wire Wire Line
	3450 6450 3000 6450
$Comp
L Device:R_Small R108
U 1 1 5C083B4C
P 3350 6350
F 0 "R108" V 3250 6350 50  0000 C CNN
F 1 "1k" V 3350 6350 50  0000 C CNN
F 2 "Resistor_SMD:R_0805_2012Metric" H 3350 6350 50  0001 C CNN
F 3 "~" H 3350 6350 50  0001 C CNN
	1    3350 6350
	0    -1   1    0   
$EndComp
$Comp
L Device:R_Small R107
U 1 1 5C0840D9
P 3150 6350
F 0 "R107" V 3050 6350 50  0000 C CNN
F 1 "1k" V 3150 6350 50  0000 C CNN
F 2 "Resistor_SMD:R_0805_2012Metric" H 3150 6350 50  0001 C CNN
F 3 "~" H 3150 6350 50  0001 C CNN
	1    3150 6350
	0    -1   1    0   
$EndComp
Wire Wire Line
	3450 6250 3250 6250
Wire Wire Line
	3250 6250 3250 6350
Connection ~ 3250 6350
$Comp
L power:GND #PWR0110
U 1 1 5C0AFAED
P 2750 6350
F 0 "#PWR0110" H 2750 6100 50  0001 C CNN
F 1 "GND" H 2755 6177 50  0000 C CNN
F 2 "" H 2750 6350 50  0001 C CNN
F 3 "" H 2750 6350 50  0001 C CNN
	1    2750 6350
	1    0    0    -1  
$EndComp
Wire Wire Line
	2750 6350 3050 6350
Text Notes 2550 6950 0    50   ~ 0
Set R107 to 20k\nR108 to 0 ohms \nwhen not using\nISObus
$Comp
L Jumper:Jumper_3_Bridged12 JP104
U 1 1 5C0BD2AF
P 3300 4050
F 0 "JP104" V 3346 4116 50  0000 L CNN
F 1 "ISOMD" V 3255 4116 50  0000 L CNN
F 2 "Jumper:SolderJumper-3_P1.3mm_Bridged2Bar12_RoundedPad1.0x1.5mm" H 3300 4050 50  0001 C CNN
F 3 "~" H 3300 4050 50  0001 C CNN
	1    3300 4050
	0    -1   -1   0   
$EndComp
Wire Wire Line
	3450 3950 3250 3950
Wire Wire Line
	3250 3950 3250 3750
Wire Wire Line
	3300 3800 3300 3550
Wire Wire Line
	3300 3550 3100 3550
Wire Wire Line
	3100 3550 3100 3500
Connection ~ 3100 3500
$Comp
L power:GND #PWR0116
U 1 1 5C0D2F86
P 3100 4000
F 0 "#PWR0116" H 3100 3750 50  0001 C CNN
F 1 "GND" H 3105 3827 50  0000 C CNN
F 2 "" H 3100 4000 50  0001 C CNN
F 3 "" H 3100 4000 50  0001 C CNN
	1    3100 4000
	1    0    0    -1  
$EndComp
Wire Notes Line
	500  2050 2350 2050
Wire Notes Line
	2350 2050 2350 3300
Wire Notes Line
	2350 3300 500  3300
Wire Notes Line
	500  3300 500  2050
Text Notes 1100 3200 0    50   ~ 0
Thermisiters\n10k @25*c
$Comp
L Connector_Generic:Conn_01x02 J104
U 1 1 5C1261CB
P 1300 3850
F 0 "J104" H 1379 3848 50  0000 L CNN
F 1 "ISObusS" H 1379 3750 50  0000 L CNN
F 2 "Connector_JST:JST_EH_S02B-EH_1x02_P2.50mm_Horizontal" H 1300 3850 50  0001 C CNN
F 3 "~" H 1300 3850 50  0001 C CNN
	1    1300 3850
	1    0    0    1   
$EndComp
Text Label 850  3750 0    60   ~ 0
SCK
Text Label 850  3850 0    60   ~ 0
CS
$Comp
L Device:R_Small R106
U 1 1 5C132AEA
P 700 3750
F 0 "R106" V 600 3750 50  0000 C CNN
F 1 "50" V 700 3750 50  0000 C CNN
F 2 "Resistor_SMD:R_0805_2012Metric" H 700 3750 50  0001 C CNN
F 3 "~" H 700 3750 50  0001 C CNN
	1    700  3750
	0    -1   1    0   
$EndComp
$Comp
L Device:R_Small R110
U 1 1 5C13325A
P 700 3850
F 0 "R110" V 600 3850 50  0000 C CNN
F 1 "50" V 700 3850 50  0000 C CNN
F 2 "Resistor_SMD:R_0805_2012Metric" H 700 3850 50  0001 C CNN
F 3 "~" H 700 3850 50  0001 C CNN
	1    700  3850
	0    -1   -1   0   
$EndComp
Wire Wire Line
	600  3750 600  3850
$Comp
L power:GND #PWR0117
U 1 1 5C14A570
P 600 4150
F 0 "#PWR0117" H 600 3900 50  0001 C CNN
F 1 "GND" H 605 3977 50  0000 C CNN
F 2 "" H 600 4150 50  0001 C CNN
F 3 "" H 600 4150 50  0001 C CNN
	1    600  4150
	1    0    0    -1  
$EndComp
Wire Wire Line
	1100 3750 800  3750
Wire Wire Line
	800  3850 1100 3850
$Comp
L Device:C_Small C117
U 1 1 5C17B7C3
P 600 4050
F 0 "C117" H 692 4096 50  0000 L CNN
F 1 "10n" H 692 4005 50  0000 L CNN
F 2 "Capacitor_SMD:C_0805_2012Metric" H 600 4050 50  0001 C CNN
F 3 "~" H 600 4050 50  0001 C CNN
	1    600  4050
	1    0    0    -1  
$EndComp
Wire Wire Line
	600  3950 600  3850
Connection ~ 600  3850
$Comp
L Transformer:ADTT1.5-1 TR101
U 1 1 5C19626C
P 1150 4600
F 0 "TR101" H 1150 4978 50  0000 C CNN
F 1 "HM2113ZNLT " H 1150 4887 50  0000 C CNN
F 2 "Libaries:HM2113ZNLT" H 1150 4250 50  0001 C CNN
F 3 "https://ww2.minicircuits.com/pdfs/ADTT1.5-1+.pdf" H 1150 4600 50  0001 C CNN
	1    1150 4600
	1    0    0    -1  
$EndComp
$Comp
L Connector_Generic:Conn_01x02 J103
U 1 1 5C1B976F
P 600 4550
F 0 "J103" H 500 4150 50  0000 L CNN
F 1 "ISObusM" H 400 4250 50  0000 L CNN
F 2 "Connector_JST:JST_EH_S02B-EH_1x02_P2.50mm_Horizontal" H 600 4550 50  0001 C CNN
F 3 "~" H 600 4550 50  0001 C CNN
	1    600  4550
	-1   0    0    -1  
$EndComp
Wire Wire Line
	800  4550 800  4400
Wire Wire Line
	800  4400 950  4400
$Comp
L Device:C_Small C119
U 1 1 5C1D1D0E
P 1450 4600
F 0 "C119" H 1542 4646 50  0000 L CNN
F 1 "10n" H 1542 4555 50  0000 L CNN
F 2 "Capacitor_SMD:C_0805_2012Metric" H 1450 4600 50  0001 C CNN
F 3 "~" H 1450 4600 50  0001 C CNN
	1    1450 4600
	0    -1   -1   0   
$EndComp
$Comp
L power:GND #PWR0119
U 1 1 5C1D1D15
P 1550 4600
F 0 "#PWR0119" H 1550 4350 50  0001 C CNN
F 1 "GND" H 1555 4427 50  0000 C CNN
F 2 "" H 1550 4600 50  0001 C CNN
F 3 "" H 1550 4600 50  0001 C CNN
	1    1550 4600
	0    -1   -1   0   
$EndComp
Wire Wire Line
	3450 6550 3000 6550
Text Label 3000 6450 0    50   ~ 0
IMB
Text Label 3000 6550 0    50   ~ 0
IPB
Text Label 1850 4400 0    50   ~ 0
IMB
Text Label 1850 4800 0    50   ~ 0
IPB
Wire Wire Line
	1350 4800 1850 4800
Wire Wire Line
	1350 4400 1850 4400
Text Label 850  4800 0    50   ~ 0
B
Text Notes 1700 3850 0    50   ~ 0
IMA\n
Text Notes 1700 3750 0    50   ~ 0
IPA\n
Wire Wire Line
	800  4650 800  4800
$Comp
L power:Earth #PWR0120
U 1 1 5C27DC3F
P 10100 1900
F 0 "#PWR0120" H 10100 1650 50  0001 C CNN
F 1 "Earth" H 10100 1750 50  0001 C CNN
F 2 "" H 10100 1900 50  0001 C CNN
F 3 "~" H 10100 1900 50  0001 C CNN
	1    10100 1900
	1    0    0    -1  
$EndComp
$Comp
L Connector_Generic:Conn_01x06 J101
U 1 1 5C29ABB8
P 7550 2150
F 0 "J101" H 7470 2567 50  0000 C CNN
F 1 "Conn_01x06" H 7470 2476 50  0000 C CNN
F 2 "Connector_PinHeader_2.54mm:PinHeader_1x06_P2.54mm_Horizontal" H 7550 2150 50  0001 C CNN
F 3 "~" H 7550 2150 50  0001 C CNN
	1    7550 2150
	-1   0    0    -1  
$EndComp
Wire Wire Line
	7750 1950 8000 1950
Wire Wire Line
	8000 2050 7750 2050
Wire Wire Line
	7750 2250 8000 2250
Wire Wire Line
	7750 2350 8000 2350
Wire Wire Line
	7750 2450 8000 2450
Text Label 8000 1950 0    50   ~ 0
GND
Text Label 8000 2050 0    50   ~ 0
RESET
Text Label 8000 2250 0    50   ~ 0
UART_RX
Text Label 8000 2350 0    50   ~ 0
UART_TX
Text Label 8000 2450 0    50   ~ 0
PROGRAM
Text Label 2600 1550 0    50   ~ 0
RESET
Text Label 4900 1600 0    50   ~ 0
UART_RX
Text Label 4900 1500 0    50   ~ 0
UART_TX
Wire Wire Line
	4900 2500 5650 2500
$Comp
L Device:Q_NPN_BCE Q101
U 1 1 5C32A3CD
P 3100 4900
F 0 "Q101" H 2900 5200 50  0000 L CNN
F 1 "CZT3055 TR" H 2650 5100 50  0000 L CNN
F 2 "Package_TO_SOT_SMD:SOT-223-3_TabPin2" H 3300 5000 50  0001 C CNN
F 3 "~" H 3100 4900 50  0001 C CNN
	1    3100 4900
	-1   0    0    -1  
$EndComp
Wire Wire Line
	3300 4900 3450 4900
Wire Wire Line
	3250 5000 3250 5100
Wire Wire Line
	3250 5100 3000 5100
Connection ~ 3250 5000
$Comp
L Device:C_Small C118
U 1 1 5C3430FC
P 2800 4600
F 0 "C118" H 2550 4600 50  0000 L CNN
F 1 "22uF" H 2550 4500 50  0000 L CNN
F 2 "Capacitor_SMD:C_0805_2012Metric" H 2800 4600 50  0001 C CNN
F 3 "~" H 2800 4600 50  0001 C CNN
	1    2800 4600
	1    0    0    -1  
$EndComp
$Comp
L Device:R_Small R111
U 1 1 5C343245
P 2800 4400
F 0 "R111" H 2741 4354 50  0000 R CNN
F 1 "100" H 2741 4445 50  0000 R CNN
F 2 "Resistor_SMD:R_0805_2012Metric" H 2800 4400 50  0001 C CNN
F 3 "~" H 2800 4400 50  0001 C CNN
	1    2800 4400
	1    0    0    -1  
$EndComp
$Comp
L power:+BATT #PWR0118
U 1 1 5C343383
P 2800 4300
F 0 "#PWR0118" H 2800 4150 50  0001 C CNN
F 1 "+BATT" H 2815 4473 50  0000 C CNN
F 2 "" H 2800 4300 50  0001 C CNN
F 3 "" H 2800 4300 50  0001 C CNN
	1    2800 4300
	1    0    0    -1  
$EndComp
Wire Wire Line
	3000 4500 3000 4700
$Comp
L power:GND #PWR0122
U 1 1 5C369684
P 2800 4700
F 0 "#PWR0122" H 2800 4450 50  0001 C CNN
F 1 "GND" H 2805 4527 50  0000 C CNN
F 2 "" H 2800 4700 50  0001 C CNN
F 3 "" H 2800 4700 50  0001 C CNN
	1    2800 4700
	1    0    0    -1  
$EndComp
NoConn ~ 3450 4500
NoConn ~ 3050 1650
NoConn ~ 3050 1750
NoConn ~ 3050 1850
NoConn ~ 3050 1950
NoConn ~ 4900 1700
NoConn ~ 4900 1400
NoConn ~ 4900 2400
NoConn ~ 8800 5250
NoConn ~ 8800 5350
NoConn ~ 10600 5950
Text Label 800  4400 0    50   ~ 0
B+
Wire Wire Line
	6500 5000 6500 4900
Connection ~ 6500 5000
Wire Wire Line
	6500 4800 6500 4700
Connection ~ 6500 4800
Connection ~ 6500 4700
$Comp
L Device:R_Small R4
U 1 1 5CFD5690
P 1850 4600
F 0 "R4" H 1791 4554 50  0000 R CNN
F 1 "100" H 1791 4645 50  0000 R CNN
F 2 "Resistor_SMD:R_0805_2012Metric" H 1850 4600 50  0001 C CNN
F 3 "~" H 1850 4600 50  0001 C CNN
	1    1850 4600
	-1   0    0    1   
$EndComp
Wire Wire Line
	1850 4500 1850 4400
Wire Wire Line
	1850 4700 1850 4800
Text Notes 1200 4950 0    50   ~ 0
Popultate R4 if not using ISObus
Text Notes 6200 3550 0    50   ~ 0
ISOMD: Serial Interface Mode. \nConnecting ISOMD to VREG  2-wire isolated interface (isoSPI) mode. \nConnecting ISOMD to V– configures the LTC6811 for 4-wire SPI mode
Text Notes 9050 4950 0    50   ~ 0
485 transciever for house installations. \nLeave un populated for car
Connection ~ 7800 900 
Connection ~ 7800 1100
Wire Wire Line
	2750 6150 3450 6150
Wire Wire Line
	3000 4500 2800 4500
Connection ~ 2800 4500
Text Notes 650  600  0    50   ~ 0
Mounting
Wire Notes Line
	1050 1750 1050 500 
Wire Notes Line
	1050 500  500  500 
Wire Notes Line
	500  500  500  1750
Wire Notes Line
	1050 1750 500  1750
Wire Wire Line
	950  4800 800  4800
Wire Notes Line
	2500 5000 2500 3500
Wire Notes Line
	2500 3500 500  3500
Wire Notes Line
	500  3500 500  5000
Wire Notes Line
	500  5000 2500 5000
Connection ~ 4900 2700
Text Notes 2100 3650 0    50   ~ 0
ISObus
$Comp
L Connector:Conn_01x02_Male J4
U 1 1 5D2B8FF8
P 5950 1200
F 0 "J4" H 6058 1381 50  0000 C CNN
F 1 "Prog" H 6058 1290 50  0000 C CNN
F 2 "Button_Switch_SMD:SW_SPST_B3U-1000P" H 5950 1200 50  0001 C CNN
F 3 "~" H 5950 1200 50  0001 C CNN
	1    5950 1200
	1    0    0    -1  
$EndComp
$Comp
L Connector:Conn_01x02_Male J5
U 1 1 5D2BB08D
P 5950 1700
F 0 "J5" H 6058 1881 50  0000 C CNN
F 1 "Reset" H 6058 1790 50  0000 C CNN
F 2 "Button_Switch_SMD:SW_SPST_B3U-1000P" H 5950 1700 50  0001 C CNN
F 3 "~" H 5950 1700 50  0001 C CNN
	1    5950 1700
	1    0    0    -1  
$EndComp
Text Label 6150 1200 0    60   ~ 0
PROGRAM
Text Label 6150 1700 0    50   ~ 0
RESET
$Comp
L power:GND #PWR0121
U 1 1 5D2BBA9C
P 6150 1800
F 0 "#PWR0121" H 6150 1550 50  0001 C CNN
F 1 "GND" H 6150 1650 50  0000 C CNN
F 2 "" H 6150 1800 50  0001 C CNN
F 3 "" H 6150 1800 50  0001 C CNN
	1    6150 1800
	1    0    0    -1  
$EndComp
$Comp
L power:GND #PWR0123
U 1 1 5D2BBF13
P 6150 1300
F 0 "#PWR0123" H 6150 1050 50  0001 C CNN
F 1 "GND" H 6150 1150 50  0000 C CNN
F 2 "" H 6150 1300 50  0001 C CNN
F 3 "" H 6150 1300 50  0001 C CNN
	1    6150 1300
	1    0    0    -1  
$EndComp
$Comp
L power:PWR_FLAG #FLG0101
U 1 1 5D2CBED0
P 10750 1300
F 0 "#FLG0101" H 10750 1375 50  0001 C CNN
F 1 "PWR_FLAG" H 10750 1450 50  0000 C CNN
F 2 "" H 10750 1300 50  0001 C CNN
F 3 "" H 10750 1300 50  0001 C CNN
	1    10750 1300
	1    0    0    -1  
$EndComp
Connection ~ 10750 1300
$EndSCHEMATC
