{
  "name": {
    "doc": "Database name",
    "default": "chatbot-conv",
    "env": "DB_NAME"
  },
  "username": {
    "doc": "Database username",
    "default": "postgres",
    "env": "DB_USERNAME"
  },
  "password": {
    "doc": "Database password",
    "default": "postgres",
    "env": "DB_PASSWORD"
  },
  "host": {
    "doc": "db host ip address.",
    "default": "127.0.0.1",
    "env": "DB_HOST"
  },
  "port": {
    "doc": "Database port.",
    "format": "port",
    "default": 5432,
    "env": "DB_PORT"
  },
  "url": {
    "doc": "Database url",
    "default": "",
    "env": "DB_URL"
  },
  "options": {
    "dialect": {
      "doc": "Database dialect",
      "default": "postgres",
      "env": "DB_DIALECT"
    },
    "acquire": {
      "default": 20000,
      "type": "INTEGER"
    },
    "max": {
      "default": 5,
      "type": "INTEGER"
    },
    "idle": {
      "default": 10000,
      "type": "INTEGER"
    }
  },
  "dropTables": {
    "doc": "drop existing tables",
    "format": "Boolean",
    "default": false,
    "env": "DROP_TABLES"
  },
  "logging": {
    "doc": "disable logging",
    "format": "Boolean",
    "default": true,
    "env": "DB_LOGGING"
  },
  "replication": {
    "enable": {
      "doc": "enable or disable replication",
      "format": "Boolean",
      "default": false,
      "env": "USE_REPLICATION"
    },
    "write": {
      "username": {
        "doc": "Database username",
        "default": "postgres",
        "env": "WRITE_DB_USERNAME"
      },
      "password": {
        "doc": "Database password",
        "default": "postgres",
        "env": "WRITE_DB_PASSWORD"
      },
      "host": {
        "doc": "db host ip address.",
        "default": "127.0.0.1",
        "env": "WRITE_DB_HOST"
      },
      "port": {
        "doc": "Database port.",
        "format": "port",
        "default": 5432,
        "env": "WRITE_DB_PORT"
      }
    },
    "read": {
        "doc": "Database username",
        "default": [],
        "format":"Array",
        "env": "WRITE_DB_USERNAME"
      }
  }
}