{
    "settings": {
        "theme": {
            "header": {
                "color": "#FFFFFF",
                "height": "56",
                "display": true,
                "gradient": "#FFFFFF",
                "backgroundColor": "#131313ff"
            },
            "botLogo": {
                "url": "https://www.roseatehotels.com/images/logo.png",
                "width": "38",
                "height": "38",
                "visibility": true
            },
            "botName": {
                "display": true,
                "fontSize": "16",
                "fontFamily": "NA"
            },
            "goToTop": {
                "showGoTopButton": true
            },
            "typeAhead": {
                "color": "#333333de",
                "height": "30",
                "fontSize": "14",
                "gradient": "#000000de",
                "iconColor": "#333333de",
                "fontFamily": "NA",
                "noOfCharacters": 3,
                "backgroundColor": "#ffffffff",
                "autoCompleteLimit": 5
            },
            "background": {},
            "bottomMenu": {
                "display": false,
                "menuList": [],
                "itemWidth": 67,
                "itemHeight": 67,
                "menuImageURL": null,
                "backgroundColor": "#ffffffff",
                "menuCloseImageURL": null
            },
            "customTabs": {
                "color": "#26acae",
                "display": true
            },
            "menuConfig": {
                "menuImg": "https://d2qea2mkheiw5n.cloudfront.net/Chatbot_resources/menu.svg",
                "startOverImg": "https://d2qea2mkheiw5n.cloudfront.net/Chatbot_resources/startover.svg",
                "startOverTxt": "Start Over",
                "talkToAgentImg": "https://d2qea2mkheiw5n.cloudfront.net/Chatbot_resources/person.svg",
                "talkToAgentTxt": "Talk To Agent",
                "enableStartOver": false,
                "menuContentIsText": true,
                "disconnectAgentImg": "https://d2qea2mkheiw5n.cloudfront.net/Chatbot_resources/live_agent_disconnect.svg",
                "disconnectAgentTxt": "Disconnect Agent"
            },
            "sendAction": {
                "color": "#26acae",
                "display": true
            },
            "queryTextBox": {
                "color": "#FFF",
                "fontSize": "12",
                "gradient": "#BBB",
                "fontFamily": "NA",
                "backgroundColor": "#26acae"
            },
            "quickReplies": {
                "color": "#26acae",
                "style": "chips",
                "display": "none",
                "fontSize": "12",
                "fontFamily": "NA",
                "backgroundColor": "#26acae"
            },
            "speechConfig": {
                "speechImg": "https://images.xbotapps.com/Bot_Images/bot_mic.svg",
                "speechLiveImg": "https://d2qea2mkheiw5n.cloudfront.net/Chatbot_resources/mic-animate.gif",
                "speechUnsupportedImg": "https://d2qea2mkheiw5n.cloudfront.net/Chatbot_resources/microphone-off.svg"
            },
            "inputQueryBox": {
                "color": "#26acaeff",
                "fontSize": "12",
                "fontFamily": "NA",
                "backgroundColor": "#FFF",
                "placeholderText": "How Can I Help You",
                "typingPlaceholder": false
            },
            "showTimeStamp": true,
            "responseTextBox": {
                "color": "#555555",
                "fontSize": "12",
                "fontFamily": "NA",
                "backgroundColor": "#FFF"
            },
            "quickRepliesStyle": {
                "bold": false,
                "label": "icon",
                "border": 1,
                "height": 24,
                "italic": false,
                "margin": 2,
                "enabled": true,
                "fontSize": 12,
                "chipWidth": "variable",
                "textAlign": "left",
                "textColor": "#131313ff",
                "underline": false,
                "hoverColor": "#efefefff",
                "hoverTextColor": "#ffffff",
                "borderColor": "#131313ff",
                "borderRadius": "16",
                "backgroundColor": "rgba(255, 255, 255)",
                "noOFQuickRepliesToShow": 5
            }
        },
        "minPartialMatchCount": 2,
        "enablePartialFeatures": true,
        "entity": {},
        "wolfram": {},
        "liveChat": true,
        "training": {
            "queued": false,
            "inProgress": false
        },
        "suggestions": {
                "count": "2",
                "enable": true,
                "messages": [
                    "Are you refering to?"
                ]
            },
        "analytics": {
            "apxor": {
                "appId": "934ba557-b65e-483d-a25e-c7737a6e7e73",
                "enable": false,
                "options": {}
            }
        },
        "liveAgent": "",
        "matchMode": "ml",
        "isTraining": false,
        "showFeedback": true,
        "needsTraining": true,
        "errorCorrection": {
            "mode": "word"
        },
        "liveAgentConfig": {
            "ozonetel": {
                "did": "",
                "apiKey": "",
                "workingDays": [],
                "workingHours": {
                    "endMin": 0,
                    "endSec": 0,
                    "endHour": 20,
                    "endTime": "20:00",
                    "startMin": 0,
                    "startSec": 0,
                    "startHour": 8,
                    "startTime": "08:00"
                },
                "longIdleTimeout": 900000,
                "shortIdleTimeout": 180000,
                "noAgentWorkingMsg": "No Agents are available",
                "placeholderMessages": {
                    "typing": "Agent is typing",
                    "longIdle": "It seems agent is taking too much time. <br>  You can wait for the agent to respond or disconnect from agent",
                    "connected": "Connected to Agent",
                    "shortIdle": "Agent is taking time to process. Please wait",
                    "connecting": "Connecting... Please wait",
                    "unavailable": "No agent available at this moment",
                    "disconnected": "Agent disconnected"
                }
            }
        },
        "enableEmailAction": false,
        "enableSpeechToText": true,
        "enableErrorCorrection": true
    },
    "previewChat": [
        { "alignment": "left", "message": "Hi, Welcome to Hotels bot powered by Xploree.ai. Start talking to the bot by saying hi" },
    	{ "alignment": "right", "message": "How can you help me" },
    	{ "alignment": "left", "message": "I can help you with the queries related to our hotels." },
        { "alignment": "right", "message": "Do you have a branch in Delhi" },
        { "alignment": "left", "message": "Yes, We have a branch in Delhi amongst 14 other indian cities" }
    ]
    }
