{
"settings": {
        "theme": {
            "header": {
                "color": "#FFFFFF",
                "height": "56",
                "display": true,
                "gradient": "#FFFFFF",
                "backgroundColor": "#1fbed9ff"
            },
            "botLogo": {
                "url": "https://d2qea2mkheiw5n.cloudfront.net/Chatbot_resources/Neldrac_logo.png",
                "width": "40",
                "height": "40",
                "visibility": true
            },
            "botName": {
                "display": true,
                "fontSize": "17",
                "fontFamily": "NA"
            },
            "goToTop": {
                "showGoTopButton": true
            },
            "typeAhead": {
                "color": "#333333de",
                "enable": false,
                "height": "30",
                "fontSize": "14",
                "gradient": "#26acaeff",
                "iconColor": "#000000de",
                "fontFamily": "NA",
                "showGrouped": false,
                "showAutoIcon": false,
                "multipleLines": false,
                "noOfCharacters": 3,
                "backgroundColor": "#FFF",
                "autoCompleteLimit": 5
            },
            "background": {},
            "bottomMenu": {
                "display": true,
                "menuList": [
                    {
                        "flow": null,
                        "type": "hyperlink",
                        "title": "About Us",
                        "imageURL": "https://d2qea2mkheiw5n.cloudfront.net/Chatbot_resources/about_us_nd.png",
                        "hyperlink": "",
                        "textColor": "#000000ff",
                        "displayText": "<p><span class=\"ql-size-small\">About Us</span></p>",
                        "backgroundColor": "#ffffffff"
                    },
                    {
                        "flow": null,
                        "type": "hyperlink",
                        "title": "Curriculum",
                        "imageURL": "https://d2qea2mkheiw5n.cloudfront.net/Chatbot_resources/curriculum_nd.png",
                        "hyperlink": "",
                        "textColor": "#030303ff",
                        "displayText": "<p><span class=\"ql-size-small\">Curriculum</span></p>",
                        "backgroundColor": "#ffffffff"
                    },
                    {
                        "flow": null,
                        "type": "hyperlink",
                        "title": "Programs",
                        "imageURL": "https://d2qea2mkheiw5n.cloudfront.net/Chatbot_resources/programs_nd.png",
                        "hyperlink": "",
                        "textColor": "#000000ff",
                        "displayText": "<p><span class=\"ql-size-small\">Programs</span></p>",
                        "backgroundColor": "#ffffffff"
                    },
                    {
                        "flow": null,
                        "type": "hyperlink",
                        "title": "Contact Us",
                        "imageURL": "https://d2qea2mkheiw5n.cloudfront.net/Chatbot_resources/contact_info_nd.png",
                        "hyperlink": "",
                        "textColor": "#000000ff",
                        "displayText": "<p><span class=\"ql-size-small\">Contact Us</span></p>",
                        "backgroundColor": "#ffffffff"
                    }
                ],
                "itemWidth": 67,
                "itemHeight": 58,
                "menuImageURL": "https://d2qea2mkheiw5n.cloudfront.net/Chatbot_resources/menu_nd.png",
                "backgroundColor": "#f1f1f1ff",
                "menuCloseImageURL": "https://d2qea2mkheiw5n.cloudfront.net/Chatbot_resources/close_nd.png"
            },
            "customTabs": {
                "color": "#26acae",
                "display": true
            },
            "menuConfig": {
                "menuImg": "https://d2qea2mkheiw5n.cloudfront.net/Chatbot_resources/menu.svg",
                "startOverImg": "https://d2qea2mkheiw5n.cloudfront.net/Chatbot_resources/startover.svg",
                "startOverTxt": "Start Over",
                "talkToAgentImg": "https://d2qea2mkheiw5n.cloudfront.net/Chatbot_resources/person.svg",
                "talkToAgentTxt": "Talk To Agent",
                "enableStartOver": false,
                "menuContentIsText": true,
                "disconnectAgentImg": "https://d2qea2mkheiw5n.cloudfront.net/Chatbot_resources/live_agent_disconnect.svg",
                "disconnectAgentTxt": "Disconnect Agent"
            },
            "sendAction": {
                "color": "#3387c8ff",
                "display": true
            },
            "queryTextBox": {
                "color": "#FFF",
                "fontSize": "12",
                "gradient": "#BBB",
                "fontFamily": "NA",
                "backgroundColor": "#1fbed9ff"
            },
            "quickReplies": {
                "color": "#26acae",
                "style": "chips",
                "display": "none",
                "fontSize": 12,
                "fontFamily": "NA",
                "backgroundColor": "#26acae"
            },
            "speechConfig": {
                "speechImg": "https://images.xbotapps.com/Bot_Images/bot_mic.svg",
                "speechLiveImg": "https://d2qea2mkheiw5n.cloudfront.net/Chatbot_resources/mic-animate.gif",
                "speechUnsupportedImg": "https://d2qea2mkheiw5n.cloudfront.net/Chatbot_resources/microphone-off.svg"
            },
            "inputQueryBox": {
                "color": "#26acaeff",
                "fontSize": "12",
                "fontFamily": "NA",
                "backgroundColor": "#FFF",
                "placeholderText": "How Can I Help You",
                "typingPlaceholder": false
            },
            "showTimeStamp": true,
            "responseTextBox": {
                "color": "#000000ff",
                "fontSize": "12",
                "fontFamily": "NA",
                "backgroundColor": "#FFF"
            },
            "quickRepliesStyle": {
                "bold": false,
                "label": "icon",
                "border": 1,
                "height": 24,
                "italic": false,
                "margin": 2,
                "enabled": true,
                "fontSize": 12,
                "chipWidth": "variable",
                "textAlign": "left",
                "textColor": "#000000ff",
                "underline": false,
                "hoverColor": "#f7f7f7ff",
                "hoverTextColor": "#ffffff",
                "borderColor": "#bcd031ff",
                "borderRadius": "16",
                "backgroundColor": "#ffffffff",
                "noOFQuickRepliesToShow": 5
            }
        },
        "entity": {},
        "wolfram": {},
        "liveChat": true,
        "training": {
            "queued": false,
            "inProgress": false
        },
        "analytics": {
            "apxor": {
                "appId": "",
                "enable": false,
                "options": {}
            }
        },
        "liveAgent": "",
        "matchMode": "ml",
        "isTraining": false,
        "suggestions": {
            "count": 3,
            "enable": true,
            "messages": [
                "You can ask questions like below:"
            ]
        },
        "webSettings": {
            "logoUrl": "https://d2qea2mkheiw5n.cloudfront.net/Chatbot/chat_icon2.png",
            "preOpen": true,
            "showLogo": true,
            "displayName": "",
            "toolTipName": "Didn’t get answer for something?",
            "preOpenTimer": 10000,
            "toolTipImgUrl": "https://d2qea2mkheiw5n.cloudfront.net/Chatbot/up-arrow.svg",
            "bubblefontSize": "16",
            "backgroundColor": "#1fbed9ff",
            "toolTipfontSize": "14",
            "bubbleImageWidth": "32",
            "iframeProperties": {
                "style": "pixels",
                "width": "320",
                "height": "549",
                "animation": "fadein"
            },
            "toolTipBottomPos": "100",
            "toolTipIsEnabled": false,
            "bubbleImageHeight": "32",
            "toolTipImageWidth": "18",
            "bubbleBorderRadius": "25",
            "toolTipImageHeight": "18",
            "enableOnHoverAction": true,
            "iframeBubblePadding": {
                "top": "10",
                "left": "10",
                "right": "10",
                "bottom": "10"
            },
            "toolTipBorderRadius": "28",
            "iframeBubbleHPosition": "right",
            "toolTipBackgroundColor": "#26acae",
            "iframeBubblePositionInPx": "20",
            "enableHoverActionOnlyOnce": true,
            "bubbleVerticalPositionFromBottom": "42"
        },
        "showFeedback": true,
        "needsTraining": true,
        "errorCorrection": {
            "mode": "word"
        },
        "liveAgentConfig": {
            "ozonetel": {
                "did": "",
                "apiKey": "",
                "workingDays": [],
                "workingHours": {
                    "endMin": 0,
                    "endSec": 0,
                    "endHour": 20,
                    "endTime": "20:00",
                    "startMin": 0,
                    "startSec": 0,
                    "startHour": 8,
                    "startTime": "08:00"
                },
                "longIdleTimeout": 900000,
                "shortIdleTimeout": 180000,
                "noAgentWorkingMsg": "No Agents are available",
                "placeholderMessages": {
                    "typing": "Agent is typing",
                    "longIdle": "It seems agent is taking too much time. <br>  You can wait for the agent to respond or disconnect from agent",
                    "connected": "Connected to Agent",
                    "shortIdle": "Agent is taking time to process. Please wait",
                    "connecting": "Connecting... Please wait",
                    "unavailable": "No agent available at this moment",
                    "disconnected": "Agent disconnected"
                }
            }
        },
        "enableEmailAction": false,
        "enableErrorCorrection": true
    },
    "previewChat": [
        { "alignment": "left", "message": "Hi, Welcome to Education bot. You can ask the queries related to education." },
    	{ "alignment": "right", "message": "How can you help me" },
    	{ "alignment": "left", "message": "I can help you with the queries related to Education sector. Please let me know." },
        { "alignment": "right", "message": "Vision and Mission" },
        { "alignment": "left", "message": "Our vision is to support future generations by setting a new benchmark in Education and Care services. We appreciate each child’s uniqueness and are determined to sharpen their abilities to help them contribute to a healthy society." }
    ]
}
